0b3069a468fa0de7 / check errored
Defined at .automate/pipelines.scm:143
Making check in .
make[1]: Entering directory '/home/chris/automate.cbaines.net/guile-automate/checks/workspace/0b3069a468fa0de7/work/source'
make check-TESTS
make[2]: Entering directory '/home/chris/automate.cbaines.net/guile-automate/checks/workspace/0b3069a468fa0de7/work/source'
make[3]: Entering directory '/home/chris/automate.cbaines.net/guile-automate/checks/workspace/0b3069a468fa0de7/work/source'
PASS: tests/check.scm
PASS: tests/errors.scm
PASS: tests/events.scm
PASS: tests/forgejo.scm
PASS: tests/http.scm
PASS: tests/layout.scm
PASS: tests/masking.scm
PASS: tests/metrics.scm
PASS: tests/pages.scm
PASS: tests/model.scm
PASS: tests/pipeline.scm
FAIL: tests/pumphouse.scm
PASS: tests/records.scm
PASS: tests/scope.scm
PASS: tests/source.scm
PASS: tests/step-scheduling.scm
PASS: tests/uploader.scm
================================================
guile-automate 0.0.0-dev: ./test-suite.log
================================================
# TOTAL: 17
# PASS: 16
# SKIP: 0
# XFAIL: 0
# FAIL: 1
# XPASS: 0
# ERROR: 0
System information (uname -a): Linux 6.18.13-gnu #1 SMP PREEMPT_DYNAMIC 1 x86_64
Distribution information (/etc/os-release):
NAME="Guix System"
ID=guix
PRETTY_NAME="Guix System"
LOGO=guix-icon
HOME_URL="https://guix.gnu.org"
DOCUMENTATION_URL="https://guix.gnu.org/en/manual"
SUPPORT_URL="https://guix.gnu.org/en/help"
BUG_REPORT_URL="https://lists.gnu.org/mailman/listinfo/bug-guix"
.. contents:: :depth: 2
FAIL: tests/pumphouse
=====================
http on port 42491
pumphouse address: /tmp/automate-pumphouse-wfdu6W/address
remote registrar: ocapn://6du6luyihb63oi755p2mmyglnz52fd23pjfcoq5n5ifm7to4ilxq.tcp-tls/s/-5OeVUdnj_hFJKiPYRQ4yvEdm7Sk8AH1SGsa-VblA2A?port=46593&host=%3A%3A1
remote admin: ocapn://6du6luyihb63oi755p2mmyglnz52fd23pjfcoq5n5ifm7to4ilxq.tcp-tls/s/BWFxCwrAd94OiY7eUWxwRADrQO6-yqMVEblUrBu3pEU?port=46593&host=%3A%3A1
attached to pumphouse /tmp/automate-pumphouse-wfdu6W/address
2026-09-20 18:12:18 (with-exception-handler) INFO: POST /output/7e0487be2087846c/tick 200 9ms
Goblins exception:
In message to #<local-object ^admin>:
(run tests/nothing (run-request (id . "1dcd3149a4bd2506") (parameters (n . 5)) (cause . #f) (ancestors)))
ice-9/boot-9.scm:1705:22: In procedure raise-exception:
ERROR:
1. &automate-error:
kind: not-attached
irritants: (tests/nothing #f)
2. &message: "no pipeline process is attached under this name"
3. &irritants: (tests/nothing #f)
In goblins/core.scm:
1074:7 4 (syscaller-$ _ #<local-object ^admin> (run tests/nothing (run-request (id . "1dcd3149a4bd2506") (parameters (n . 5)) (cause . #f) (ancestors))))
In automate/pumphouse.scm:
136:15 3 (request-run! #<<pumphouse> records: #<local-object ^records> lives: #<hash-table 7fb702a031a0 9/31> shared: #<hash-table 7fb702a03180 0/31> gates: #<hash-table 7fb702a03160 0/31> timers: #<hash-table 7fb702a03140 1/31> tokens: #<hash-table 7fb702a03120 7/31> registrations: #<hash-table 7fb702a03100 0/31> sink: "http://127.0.0.1:42491/output" web: "http://127.0.0.1:42491" publish: #<procedure 7fb702ac7ca0 at automate/pumphouse/process.scm:129:2 (object swiss-num)>> tests/nothing #)
99:6 2 (live-of _ _)
In automate/model.scm:
83:2 1 (raise-automate-error _ _ . _)
In ice-9/boot-9.scm:
1705:22 0 (raise-exception _ #:continuable? _)
2026-09-20 18:12:19 INFO: dropping a connection that failed to hand shake: #<&compound-exception components: (#<&error> #<&irritants irritants: (#<gnutls-error-enum Error in the pull function.> handshake)> #<&exception-with-kind-and-args kind: gnutls-error args: (#<gnutls-error-enum Error in the pull function.> handshake)>)>
2026-09-20 18:12:19 INFO: dropping a connection that failed to hand shake: #<&compound-exception components: (#<&external-error> #<&origin origin: "fport_write"> #<&message message: "~A"> #<&irritants irritants: ("Broken pipe")> #<&exception-with-kind-and-args kind: system-error args: ("fport_write" "~A" ("Broken pipe") (32))>)>
2026-09-20 18:12:19 (with-exception-handler) INFO: POST /output/f6feb8989f853429/tick 200 14ms
2026-09-20 18:12:19 (with-exception-handler) INFO: POST /output/10917c4662889ab2/tick 200 1ms
2026-09-20 18:12:19 (with-exception-handler) INFO: POST /output/c16c38924a3bdc64/tick 200 8ms
2026-09-20 18:12:19 (with-exception-handler) INFO: POST /output/f011ab4fc456ee10/tick 200 12ms
2026-09-20 18:12:20 (with-exception-handler) INFO: POST /output/38c64f2aa65b9c48/tick 200 75ms
2026-09-20 18:12:20 (with-exception-handler) INFO: POST /output/2aa8cab030f7374c/tick 200 9ms
2026-09-20 18:12:20 INFO: dropping a connection that failed to hand shake: #<&compound-exception components: (#<&error> #<&irritants irritants: (#<gnutls-error-enum Error in the pull function.> handshake)> #<&exception-with-kind-and-args kind: gnutls-error args: (#<gnutls-error-enum Error in the pull function.> handshake)>)>
Goblins exception:
In message to #<local-object ^records>:
(registration (/) 1789924340)
ice-9/boot-9.scm:1705:22: In procedure raise-exception:
ERROR:
1. &automate-error:
kind: invalid-scope
irritants: ((/))
2. &message: "not a list of pipeline names and prefixes"
3. &irritants: ((/))
In goblins/core.scm:
1074:7 5 (syscaller-$ _ #<local-object ^records> (registration (/) 1789924340))
In unknown file:
4 (_ #<procedure cons (_ _)>)
In automate/pumphouse/datastore.scm:
335:15 3 (datastore-registration! #<<datastore> directory: "/tmp/automate-pumphouse-wfdu6W" pumphouse: #<<sqlite-db> pointer: #<pointer 0x7fb6f8001ae8> open?: #t stmts: #<hash-table 7fb702a37ca0 17/31>> pipelines: #<hash-table 7fb702a37960 9/31>> (/) 1789924340)
In automate/pumphouse/scope.scm:
44:4 2 (canonical-scope (/))
In automate/model.scm:
83:2 1 (raise-automate-error _ _ . _)
In ice-9/boot-9.scm:
1705:22 0 (raise-exception _ #:continuable? _)
2026-09-20 18:12:21 (with-exception-handler) INFO: POST /output/1f7077bb21dd6627/tick 200 21ms
2026-09-20 18:12:21 (with-exception-handler) INFO: POST /output/06c6a63ca4aa7a3f/tick 200 9ms
2026-09-20 18:12:21 (with-exception-handler) INFO: POST /output/f071e16e85fb5158/tick 200 1ms
2026-09-20 18:12:21 (with-exception-handler) INFO: POST /output/41dd0fefb15d0d74/tick 200 4ms
2026-09-20 18:12:21 (with-exception-handler) INFO: POST /output/5c7f2d69d11c862e/tick 200 7ms
Goblins exception:
In message to #<local-object ^scoped-registrar>:
(register tests/nap "/tmp/automate-def-rlgBA3" (structure (version 2) (name tests/nap) (steps ((step (name nap) (label #f) (group #f) (timeout #f) (error-permitted #f) (outputs (value)) (inputs ())))) (resources ()) (params ()) (web-ui-options ())) #<remote-object> "ocapn://aqeilk2a2vy6ffmg4i6ytlear4p3eehvde4kay2v3jvoaooeyk2a.tcp-tls/s/s6P4tMF1hlQxHmrAhojFlyeJ2U-ZBfYagp4HWsVNVVg?" ())
ice-9/boot-9.scm:1705:22: In procedure raise-exception:
ERROR:
1. &automate-error:
kind: not-permitted
irritants: (tests/nap (tests/only tests/scoped/))
2. &message: "this registration does not cover the pipeline"
3. &irritants: (tests/nap (tests/only tests/scoped/))
In goblins/core.scm:
1074:7 3 (syscaller-$ _ #<local-object ^scoped-registrar> (register tests/nap "/tmp/automate-def-rlgBA3" (structure (version 2) (name tests/nap) (steps ((step (name nap) (label #f) (group #f) (timeout #f) (error-permitted #f) (outputs (value)) (inputs ())))) (resources ()) (params ()) (web-ui-options ())) #<remote-object> "ocapn://aqeilk2a2vy6ffmg4i6ytlear4p3eehvde4kay2v3jvoaooeyk2a.tcp-tls/s/s6P4tMF1hlQxHmrAhojFlyeJ2U-ZBfYagp4HWsVNVVg?" ()))
In automate/pumphouse.scm:
296:6 2 (register tests/nap "/tmp/automate-def-rlgBA3" (structure (version 2) (name tests/nap) (steps ((step (name nap) (label #f) (group #f) (timeout #f) (error-permitted #f) (outputs (value)) (inputs ())))) (resources ()) (params ()) (web-ui-options ())) #<remote-object> "ocapn://aqeilk2a2vy6ffmg4i6ytlear4p3eehvde4kay2v3jvoaooeyk2a.tcp-tls/s/s6P4tMF1hlQxHmrAhojFlyeJ2U-ZBfYagp4HWsVNVVg?" ())
In automate/model.scm:
83:2 1 (raise-automate-error _ _ . _)
In ice-9/boot-9.scm:
1705:22 0 (raise-exception _ #:continuable? _)
pumphouse refused tests/nap: Unknown error occurred with remote object
attached to pumphouse ocapn://6du6luyihb63oi755p2mmyglnz52fd23pjfcoq5n5ifm7to4ilxq.tcp-tls/s/e9PlNbxwEJxKeIIzc4NBCtU7LqW8s-JEhb9fHLY84aQ?port=46593&host=%3A%3A1
2026-09-20 18:12:22 (with-exception-handler) INFO: POST /output/d7d6779111ef1415/tick 200 16ms
2026-09-20 18:12:22 (with-exception-handler) INFO: POST /output/f3aadab0abad9693/tick 200 5ms
2026-09-20 18:12:22 (with-exception-handler) INFO: POST /output/a62c849363817904/tick 200 7ms
2026-09-20 18:12:22 (with-exception-handler) INFO: POST /output/e914e659f4e3d993/tick 200 4ms
2026-09-20 18:12:22 (with-exception-handler) INFO: POST /output/71121f93cf065f5b/tick 200 5ms
2026-09-20 18:12:23 (with-exception-handler) INFO: POST /output/03e8d02a3c7b5d1c/tick 200 13ms
2026-09-20 18:12:23 (with-exception-handler) INFO: POST /output/03e8d02a3c7b5d1c/tick 200 9ms
2026-09-20 18:12:23 (with-exception-handler) INFO: POST /output/7e68a7c298bde37a/tick 200 5ms
2026-09-20 18:12:23 (with-exception-handler) INFO: POST /output/cf4d533109fd8868/tick 200 7ms
2026-09-20 18:12:23 (with-exception-handler) INFO: POST /output/96cdd6f5e6e4e85f/tick 200 3ms
Error in IO handling wrapped resource #<input-output: file 179>:
#<&compound-exception components: (#<&external-error> #<&origin origin: "fport_read"> #<&message message: "~A"> #<&irritants irritants: ("Connection reset by peer")> #<&exception-with-kind-and-args kind: system-error args: ("fport_read" "~A" ("Connection reset by peer") (104))>)>
In ice-9/boot-9.scm:
1778:15 19 (with-exception-handler #<procedure 7fbeede3bf30 at ice-9/boot-9.scm:1882:7 (exn)> _ #:unwind? _ #:unwind-for-type _)
In fibers.scm:
164:13 18 (run-fibers _ #:hz _ #:scheduler _ #:parallelism _ #:cpus _ #:install-suspendable-ports? _ #:drain? _)
85:4 17 (%run-fibers _ _ _ _)
In fibers/interrupts.scm:
98:4 16 (with-interrupts/thread-cputime _ _ _ _)
In fibers/scheduler.scm:
380:26 15 (run-scheduler #<scheduler 7fbeede3ee70 (remote-peers: (7fbeede3ee00))> _)
In ice-9/boot-9.scm:
1778:15 14 (with-exception-handler #<procedure 7fbeede50a50 at ice-9/boot-9.scm:1882:7 (exn)> _ #:unwind? _ #:unwind-for-type _)
1784:12 13 (with-exception-handler _ _ #:unwind? _ #:unwind-for-type _)
In fibers/scheduler.scm:
344:10 12 (next-task)
In fibers.scm:
179:8 11 (_)
In goblins/actor-lib/io.scm:
60:10 10 (_)
85:15 9 (_ _)
In ice-9/boot-9.scm:
1784:12 8 (with-exception-handler _ _ #:unwind? _ #:unwind-for-type _)
In goblins/actor-lib/io.scm:
70:18 7 (run-and-send)
In ice-9/control.scm:
91:24 6 (call-with-escape-continuation _)
In goblins/contrib/syrup.scm:
306:7 5 (read-next)
In ice-9/suspendable-ports.scm:
558:2 4 (peek-char _)
184:27 3 (fill-input #<input-output: file 179> _ _)
72:4 2 (read-bytes #<input-output: file 179> #vu8(49 49 39 100 101 115 99 58 101 120 112 111 114 116 50 43 62 91 56 39 102 105 110 105 115 104 101 100 57 39 115 117 99 99 101 101 100 101 100 93 52 43 60 49 56 39 100 101 115 99 58 105 109 112 111 114 116 45 111 98 106 101 99 116 53 43 62 62 112 111 114 116 45 111 98 106 101 99 116 52 43 62 62 115 99 58 105 109 112 111 114 116 45 111 98 106 101 99 116 49 43 62 62 225 175 248 12 225 110 72 139 126 42 103 48 135 27 236 93 93 93 60 49 48 …) …)
In unknown file:
1 (port-read #<input-output: file 179> #vu8(49 49 39 100 101 115 99 58 101 120 112 111 114 116 50 43 62 91 56 39 102 105 110 105 115 104 101 100 57 39 115 117 99 99 101 101 100 101 100 93 52 43 60 49 56 39 100 101 115 99 58 105 109 112 111 114 116 45 111 98 106 101 99 116 53 43 62 62 112 111 114 116 45 111 98 106 101 99 116 52 43 62 62 115 99 58 105 109 112 111 114 116 45 111 98 106 101 99 116 49 43 62 62 225 175 248 12 225 110 72 139 126 42 103 48 135 27 236 93 93 93 60 49 48 # …) …)
In ice-9/boot-9.scm:
1705:22 0 (raise-exception _ #:continuable? _)
Uncaught exception in task:
In fibers.scm:
179:8 12 (_)
In goblins/actor-lib/io.scm:
60:10 11 (_)
85:15 10 (_ _)
In ice-9/boot-9.scm:
1784:12 9 (with-exception-handler _ _ #:unwind? _ #:unwind-for-type _)
In goblins/actor-lib/io.scm:
70:18 8 (run-and-send)
In ice-9/control.scm:
91:24 7 (call-with-escape-continuation _)
In goblins/contrib/syrup.scm:
306:7 6 (read-next)
In ice-9/suspendable-ports.scm:
558:2 5 (peek-char _)
184:27 4 (fill-input #<input-output: file 179> _ _)
72:4 3 (read-bytes #<input-output: file 179> #vu8(49 49 39 100 101 115 99 58 101 120 112 111 114 116 50 43 62 91 56 39 102 105 110 105 115 104 101 100 57 39 115 117 99 99 101 101 100 101 100 93 52 43 60 49 56 39 100 101 115 99 58 105 109 112 111 114 116 45 111 98 106 101 99 116 53 43 62 62 112 111 114 116 45 111 98 106 101 99 116 52 43 62 62 115 99 58 105 109 112 111 114 116 45 111 98 106 101 99 116 49 43 62 62 225 175 248 12 225 110 72 139 126 42 103 48 135 27 236 93 93 93 60 49 48 …) …)
In unknown file:
2 (port-read #<input-output: file 179> #vu8(49 49 39 100 101 115 99 58 101 120 112 111 114 116 50 43 62 91 56 39 102 105 110 105 115 104 101 100 57 39 115 117 99 99 101 101 100 101 100 93 52 43 60 49 56 39 100 101 115 99 58 105 109 112 111 114 116 45 111 98 106 101 99 116 53 43 62 62 112 111 114 116 45 111 98 106 101 99 116 52 43 62 62 115 99 58 105 109 112 111 114 116 45 111 98 106 101 99 116 49 43 62 62 225 175 248 12 225 110 72 139 126 42 103 48 135 27 236 93 93 93 60 49 48 # …) …)
In ice-9/boot-9.scm:
1706:22 1 (raise-exception _ #:continuable? _)
1705:22 0 (raise-exception _ #:continuable? _)
ice-9/boot-9.scm:1705:22: In procedure raise-exception:
ERROR:
1. &non-continuable
2026-09-20 18:12:24 (with-exception-handler) INFO: POST /output/f3ee2b02e10afcdd/tick 200 16ms
2026-09-20 18:12:24 (with-exception-handler) INFO: POST /output/eff260b67a6a4380/tick 200 4ms
2026-09-20 18:12:24 (with-exception-handler) INFO: POST /output/f379bd67cc337a1a/tick 200 7ms
2026-09-20 18:12:24 (with-exception-handler) INFO: POST /output/6a26d07e45eb66c9/tick 200 5ms
Error in IO handling wrapped resource #<input-output: file 49>:
#<&compound-exception components: (#<&external-error> #<&origin origin: "fport_read"> #<&message message: "~A"> #<&irritants irritants: ("Connection reset by peer")> #<&exception-with-kind-and-args kind: system-error args: ("fport_read" "~A" ("Connection reset by peer") (104))>)>
In ice-9/boot-9.scm:
1778:15 19 (with-exception-handler #<procedure 7fb6ff636f30 at ice-9/boot-9.scm:1882:7 (exn)> _ #:unwind? _ #:unwind-for-type _)
In fibers.scm:
164:13 18 (run-fibers _ #:hz _ #:scheduler _ #:parallelism _ #:cpus _ #:install-suspendable-ports? _ #:drain? _)
85:4 17 (%run-fibers _ _ _ _)
In fibers/interrupts.scm:
98:4 16 (with-interrupts/thread-cputime _ _ _ _)
In fibers/scheduler.scm:
380:26 15 (run-scheduler #<scheduler 7fb6fe22de70 (remote-peers: (7fb6fe22de00))> _)
In ice-9/boot-9.scm:
1778:15 14 (with-exception-handler #<procedure 7fb6fea2c720 at ice-9/boot-9.scm:1882:7 (exn)> _ #:unwind? _ #:unwind-for-type _)
1784:12 13 (with-exception-handler _ _ #:unwind? _ #:unwind-for-type _)
In fibers/scheduler.scm:
344:10 12 (next-task)
In fibers.scm:
179:8 11 (_)
In goblins/actor-lib/io.scm:
60:10 10 (_)
85:15 9 (_ _)
In ice-9/boot-9.scm:
1784:12 8 (with-exception-handler _ _ #:unwind? _ #:unwind-for-type _)
In goblins/actor-lib/io.scm:
70:18 7 (run-and-send)
In ice-9/control.scm:
91:24 6 (call-with-escape-continuation _)
In goblins/contrib/syrup.scm:
306:7 5 (read-next)
In ice-9/suspendable-ports.scm:
558:2 4 (peek-char _)
184:27 3 (fill-input #<input-output: file 49> _ _)
72:4 2 (read-bytes #<input-output: file 49> #vu8(60 49 48 39 111 112 58 100 101 108 105 118 101 114 60 49 49 39 100 101 115 99 58 101 120 112 111 114 116 52 56 43 62 91 55 39 102 117 108 102 105 108 108 49 54 34 55 100 97 56 56 50 50 56 53 102 97 50 50 53 53 49 93 102 102 62 60 49 48 39 111 112 58 100 101 108 105 118 101 114 60 49 49 39 100 101 115 99 58 101 120 112 111 114 116 49 48 43 62 91 53 39 101 118 101 110 116 49 54 34 55 100 97 56 56 50 50 56 53 102 97 50 50 53 53 49 49 43 # …) …)
In unknown file:
1 (port-read #<input-output: file 49> #vu8(60 49 48 39 111 112 58 100 101 108 105 118 101 114 60 49 49 39 100 101 115 99 58 101 120 112 111 114 116 52 56 43 62 91 55 39 102 117 108 102 105 108 108 49 54 34 55 100 97 56 56 50 50 56 53 102 97 50 50 53 53 49 93 102 102 62 60 49 48 39 111 112 58 100 101 108 105 118 101 114 60 49 49 39 100 101 115 99 58 101 120 112 111 114 116 49 48 43 62 91 53 39 101 118 101 110 116 49 54 34 55 100 97 56 56 50 50 56 53 102 97 50 50 53 53 49 49 43 91 …) …)
In ice-9/boot-9.scm:
1705:22 0 (raise-exception _ #:continuable? _)
Uncaught exception in task:
In fibers.scm:
179:8 15 (_)
In goblins/actor-lib/io.scm:
60:10 14 (_)
85:15 13 (_ _)
In ice-9/boot-9.scm:
1784:12 12 (with-exception-handler _ _ #:unwind? _ #:unwind-for-type _)
In goblins/actor-lib/io.scm:
70:18 11 (run-and-send)
In ice-9/control.scm:
91:24 10 (call-with-escape-continuation _)
In goblins/contrib/syrup.scm:
306:7 9 (read-next)
In ice-9/suspendable-ports.scm:
558:2 8 (peek-char _)
184:27 7 (fill-input #<input-output: file 49> _ _)
72:4 6 (read-bytes #<input-output: file 49> #vu8(60 49 48 39 111 112 58 100 101 108 105 118 101 114 60 49 49 39 100 101 115 99 58 101 120 112 111 114 116 52 56 43 62 91 55 39 102 117 108 102 105 108 108 49 54 34 55 100 97 56 56 50 50 56 53 102 97 50 50 53 53 49 93 102 102 62 60 49 48 39 111 112 58 100 101 108 105 118 101 114 60 49 49 39 100 101 115 99 58 101 120 112 111 114 116 49 48 43 62 91 53 39 101 118 101 110 116 49 54 34 55 100 97 56 56 50 50 56 53 102 97 50 50 53 53 49 49 43 # …) …)
In unknown file:
5 (port-read #<input-output: file 49> #vu8(60 49 48 39 111 112 58 100 101 108 105 118 101 114 60 49 49 39 100 101 115 99 58 101 120 112 111 114 116 52 56 43 62 91 55 39 102 117 108 102 105 108 108 49 54 34 55 100 97 56 56 50 50 56 53 102 97 50 50 53 53 49 93 102 102 62 60 49 48 39 111 112 58 100 101 108 105 118 101 114 60 49 49 39 100 101 115 99 58 101 120 112 111 114 116 49 48 43 62 91 53 39 101 118 101 110 116 49 54 34 55 100 97 56 56 50 50 56 53 102 97 50 50 53 53 49 49 43 91 …) …)
In ice-9/boot-9.scm:
1705:22 4 (raise-exception _ #:continuable? _)
In goblins/core.scm:
1987:7 3 (<-np-extern _ . _)
In fibers/operations.scm:
200:10 2 (perform-operation _)
In fibers/scheduler.scm:
461:6 1 (suspend-current-task _)
In ice-9/boot-9.scm:
1705:22 0 (raise-exception _ #:continuable? _)
ice-9/boot-9.scm:1705:22: In procedure raise-exception:
Attempt to suspend fiber within continuation barrier
Error in IO handling wrapped resource #<input-output: file 49>:
#<&compound-exception components: (#<&external-error> #<&origin origin: "fport_write"> #<&message message: "~A"> #<&irritants irritants: ("Broken pipe")> #<&exception-with-kind-and-args kind: system-error args: ("fport_write" "~A" ("Broken pipe") (32))>)>
In ice-9/boot-9.scm:
1778:15 15 (with-exception-handler #<procedure 7fb6ff636f30 at ice-9/boot-9.scm:1882:7 (exn)> _ #:unwind? _ #:unwind-for-type _)
In fibers.scm:
164:13 14 (run-fibers _ #:hz _ #:scheduler _ #:parallelism _ #:cpus _ #:install-suspendable-ports? _ #:drain? _)
85:4 13 (%run-fibers _ _ _ _)
In fibers/interrupts.scm:
98:4 12 (with-interrupts/thread-cputime _ _ _ _)
In fibers/scheduler.scm:
380:26 11 (run-scheduler #<scheduler 7fb6fe22de70 (remote-peers: (7fb6fe22de00))> _)
In ice-9/boot-9.scm:
1778:15 10 (with-exception-handler #<procedure 7fb6f6753390 at ice-9/boot-9.scm:1882:7 (exn)> _ #:unwind? _ #:unwind-for-type _)
1784:12 9 (with-exception-handler _ _ #:unwind? _ #:unwind-for-type _)
In fibers/scheduler.scm:
344:10 8 (next-task)
In fibers.scm:
179:8 7 (_)
In goblins/actor-lib/io.scm:
60:10 6 (_)
85:15 5 (_ _)
In ice-9/boot-9.scm:
1784:12 4 (with-exception-handler _ _ #:unwind? _ #:unwind-for-type _)
In goblins/actor-lib/io.scm:
70:18 3 (run-and-send)
In ice-9/suspendable-ports.scm:
83:4 2 (write-bytes #<input-output: file 49> #vu8(60 49 51 39 111 112 58 103 99 45 101 120 112 111 114 116 115 91 53 54 55 43 93 91 49 43 93 62 116 54 50 49 43 62 91 55 39 102 117 108 102 105 108 108 50 39 111 107 93 102 102 62 51 39 117 114 108 50 57 34 104 116 116 112 58 47 47 49 50 55 46 48 46 48 46 49 58 52 50 52 57 49 47 111 117 116 112 117 116 62 60 52 39 112 97 105 114 53 39 116 111 107 101 110 51 50 34 98 51 52 50 98 55 56 49 99 50 56 54 55 55 98 54 53 48 50 50 101 50 51 48 # …) …)
In unknown file:
1 (port-write #<input-output: file 49> #vu8(60 49 51 39 111 112 58 103 99 45 101 120 112 111 114 116 115 91 53 54 55 43 93 91 49 43 93 62 116 54 50 49 43 62 91 55 39 102 117 108 102 105 108 108 50 39 111 107 93 102 102 62 51 39 117 114 108 50 57 34 104 116 116 112 58 47 47 49 50 55 46 48 46 48 46 49 58 52 50 52 57 49 47 111 117 116 112 117 116 62 60 52 39 112 97 105 114 53 39 116 111 107 101 110 51 50 34 98 51 52 50 98 55 56 49 99 50 56 54 55 55 98 54 53 48 50 50 101 50 51 48 49 …) …)
In ice-9/boot-9.scm:
1705:22 0 (raise-exception _ #:continuable? _)
Uncaught exception in task:
In fibers.scm:
179:8 11 (_)
In goblins/actor-lib/io.scm:
60:10 10 (_)
85:15 9 (_ _)
In ice-9/boot-9.scm:
1784:12 8 (with-exception-handler _ _ #:unwind? _ #:unwind-for-type _)
In goblins/actor-lib/io.scm:
70:18 7 (run-and-send)
In ice-9/suspendable-ports.scm:
83:4 6 (write-bytes #<input-output: file 49> #vu8(60 49 51 39 111 112 58 103 99 45 101 120 112 111 114 116 115 91 53 54 55 43 93 91 49 43 93 62 116 54 50 49 43 62 91 55 39 102 117 108 102 105 108 108 50 39 111 107 93 102 102 62 51 39 117 114 108 50 57 34 104 116 116 112 58 47 47 49 50 55 46 48 46 48 46 49 58 52 50 52 57 49 47 111 117 116 112 117 116 62 60 52 39 112 97 105 114 53 39 116 111 107 101 110 51 50 34 98 51 52 50 98 55 56 49 99 50 56 54 55 55 98 54 53 48 50 50 101 50 51 48 # …) …)
In unknown file:
5 (port-write #<input-output: file 49> #vu8(60 49 51 39 111 112 58 103 99 45 101 120 112 111 114 116 115 91 53 54 55 43 93 91 49 43 93 62 116 54 50 49 43 62 91 55 39 102 117 108 102 105 108 108 50 39 111 107 93 102 102 62 51 39 117 114 108 50 57 34 104 116 116 112 58 47 47 49 50 55 46 48 46 48 46 49 58 52 50 52 57 49 47 111 117 116 112 117 116 62 60 52 39 112 97 105 114 53 39 116 111 107 101 110 51 50 34 98 51 52 50 98 55 56 49 99 50 56 54 55 55 98 54 53 48 50 50 101 50 51 48 49 …) …)
In ice-9/boot-9.scm:
1705:22 4 (raise-exception _ #:continuable? _)
In goblins/core.scm:
1987:7 3 (<-np-extern _ . _)
In fibers/operations.scm:
200:10 2 (perform-operation _)
In fibers/scheduler.scm:
461:6 1 (suspend-current-task _)
In ice-9/boot-9.scm:
1705:22 0 (raise-exception _ #:continuable? _)
ice-9/boot-9.scm:1705:22: In procedure raise-exception:
Attempt to suspend fiber within continuation barrier
2026-09-20 18:14:11 (with-exception-handler) INFO: POST /output/19f9b0581b02aa52/chatty 200 2ms
run 19f9b0581b02aa52 reported to /tmp/automate-pumphouse-wfdu6W/address
run succeeded
chatty: succeeded
Goblins exception:
In message to #<local-object ^admin>:
(run tests/linger (run-request (id . "a03a300a494b9a1f") (parameters (marker . "/tmp/automate-pumphouse-wfdu6W/linger-1")) (cause . #f) (ancestors)))
ice-9/boot-9.scm:1705:22: In procedure raise-exception:
ERROR:
1. &automate-error:
kind: not-attached
irritants: (tests/linger stale)
2. &message: "no pipeline process is attached under this name"
3. &irritants: (tests/linger stale)
In goblins/core.scm:
1074:7 4 (syscaller-$ _ #<local-object ^admin> (run tests/linger (run-request (id . "a03a300a494b9a1f") (parameters (marker . "/tmp/automate-pumphouse-wfdu6W/linger-1")) (cause . #f) (ancestors))))
In automate/pumphouse.scm:
136:15 3 (request-run! #<<pumphouse> records: #<local-object ^records> lives: #<hash-table 7fb702a031a0 11/31> shared: #<hash-table 7fb702a03180 1/31> gates: #<hash-table 7fb702a03160 0/31> timers: #<hash-table 7fb702a03140 1/31> tokens: #<hash-table 7fb702a03120 38/61> registrations: #<hash-table 7fb702a03100 1/31> sink: "http://127.0.0.1:42491/output" web: "http://127.0.0.1:42491" publish: #<procedure 7fb702ac7ca0 at automate/pumphouse/process.scm:129:2 (object swiss-num)>> tests/linger …)
99:6 2 (live-of _ _)
In automate/model.scm:
83:2 1 (raise-automate-error _ _ . _)
In ice-9/boot-9.scm:
1705:22 0 (raise-exception _ #:continuable? _)
;;; note: auto-compilation is enabled, set GUILE_AUTO_COMPILE=0
;;; or pass the --no-auto-compile argument to disable.
;;; compiling /home/chris/automate.cbaines.net/guile-automate/checks/workspace/0b3069a468fa0de7/work/source/./tests/run.scm
;;; WARNING: compilation of /home/chris/automate.cbaines.net/guile-automate/checks/workspace/0b3069a468fa0de7/work/source/./tests/run.scm failed:
;;; failed to create path for auto-compiled file "/home/chris/automate.cbaines.net/guile-automate/checks/workspace/0b3069a468fa0de7/work/source/./tests/run.scm"
;;; compiling /home/chris/automate.cbaines.net/guile-automate/checks/workspace/0b3069a468fa0de7/work/source/tests/support.scm
;;; WARNING: compilation of /home/chris/automate.cbaines.net/guile-automate/checks/workspace/0b3069a468fa0de7/work/source/tests/support.scm failed:
;;; failed to create path for auto-compiled file "/home/chris/automate.cbaines.net/guile-automate/checks/workspace/0b3069a468fa0de7/work/source/tests/support.scm"
;;; compiling /home/chris/automate.cbaines.net/guile-automate/checks/workspace/0b3069a468fa0de7/work/source/tests/pumphouse.scm
;;; WARNING: compilation of /home/chris/automate.cbaines.net/guile-automate/checks/workspace/0b3069a468fa0de7/work/source/tests/pumphouse.scm failed:
;;; failed to create path for auto-compiled file "/home/chris/automate.cbaines.net/guile-automate/checks/workspace/0b3069a468fa0de7/work/source/tests/pumphouse.scm"
== pumphouse.scm
fail: chatty run succeeded
expected: succeeded
actual: #f
fail: the step's output was uploaded, both streams in order
fail: while the daemon stays attached under the name
expected: live
actual: stale
suite died: ERROR:
1. &mystery-exception
2. &message: "Unknown error occurred with remote object"
3. &irritants: ()
stop 20123: kill #<unspecified>, waitpid (20123 . 9)
stop 19988: kill #<unspecified>, waitpid (19988 . 13)
stop 19979: kill #<unspecified>, waitpid (19979 . 9)
FAIL tests/pumphouse.scm (exit status: 1)
============================================================================
Testsuite summary for guile-automate 0.0.0-dev
============================================================================
# TOTAL: 17
# PASS: 16
# SKIP: 0
# XFAIL: 0
# FAIL: 1
# XPASS: 0
# ERROR: 0
============================================================================
See ./test-suite.log for debugging.
============================================================================
make[3]: *** [Makefile:889: test-suite.log] Error 1
make[3]: Leaving directory '/home/chris/automate.cbaines.net/guile-automate/checks/workspace/0b3069a468fa0de7/work/source'
make[2]: *** [Makefile:1024: check-TESTS] Error 2
make[2]: Leaving directory '/home/chris/automate.cbaines.net/guile-automate/checks/workspace/0b3069a468fa0de7/work/source'
make[1]: *** [Makefile:1245: check-am] Error 2
make[1]: Leaving directory '/home/chris/automate.cbaines.net/guile-automate/checks/workspace/0b3069a468fa0de7/work/source'
make: *** [Makefile:775: check-recursive] Error 1
error: #<&invoke-error program: "/gnu/store/jsrbz9xvhjag4nxfj999fnd22jwlpgr2-profile/bin/bash" arguments: ("-c" "set -eo pipefail\nexport GUIX_PROFILE=/gnu/store/jsrbz9xvhjag4nxfj999fnd22jwlpgr2-profile\nsource \"$GUIX_PROFILE/etc/profile\"\ncd /home/chris/automate.cbaines.net/guile-automate/checks/workspace/0b3069a468fa0de7/work/source\nmake check VERBOSE=1") exit-status: 2 term-signal: #f stop-signal: #f>