2dd50ce9e95a63cd / check errored

Started
Duration
2m 57s

Defined at .automate/pipelines.scm:105

Making check in .
make[1]: Entering directory '/var/tmp/automate-work-xadZ33/workspace/source'
make  tests/support.go tests/attach.scm.go tests/authority.scm.go tests/check.scm.go tests/contain.scm.go tests/errors.scm.go tests/events.scm.go tests/forgejo.scm.go tests/http.scm.go tests/layout.scm.go tests/masking.scm.go tests/metrics.scm.go tests/pages.scm.go tests/model.scm.go tests/notify.scm.go tests/pipeline.scm.go tests/pumphouse.scm.go tests/reconnect.scm.go tests/records.scm.go tests/relay.scm.go tests/run-query.scm.go tests/repl.scm.go tests/scope.scm.go tests/source.scm.go tests/step-scheduling.scm.go tests/uploader.scm.go
make[2]: Entering directory '/var/tmp/automate-work-xadZ33/workspace/source'
./pre-inst-env /gnu/store/ja5nzdqahacvrd52rw7rsbf0qyx7zii3-profile/bin/guild compile  -W1 -Wunbound-variable -Warity-mismatch -Wformat -Wunused-module -Wshadowed-toplevel -o "tests/support.go" "tests/support.scm"
;;; note: auto-compilation is enabled, set GUILE_AUTO_COMPILE=0
;;;       or pass the --no-auto-compile argument to disable.
;;; compiling /gnu/store/ja5nzdqahacvrd52rw7rsbf0qyx7zii3-profile/bin/guild
;;; compiled /tmp/cache/guile/ccache/3.0-LE-8-4.7/gnu/store/k7vkw9x3wl3lni6a0i2w8xz2z8ylrqyz-guile-3.0.11/bin/guild.go
wrote `tests/support.go'
./pre-inst-env /gnu/store/ja5nzdqahacvrd52rw7rsbf0qyx7zii3-profile/bin/guild compile  -W1 -Wunbound-variable -Warity-mismatch -Wformat -Wshadowed-toplevel -o "tests/attach.scm.go" "tests/attach.scm"
wrote `tests/attach.scm.go'
./pre-inst-env /gnu/store/ja5nzdqahacvrd52rw7rsbf0qyx7zii3-profile/bin/guild compile  -W1 -Wunbound-variable -Warity-mismatch -Wformat -Wshadowed-toplevel -o "tests/authority.scm.go" "tests/authority.scm"
wrote `tests/authority.scm.go'
./pre-inst-env /gnu/store/ja5nzdqahacvrd52rw7rsbf0qyx7zii3-profile/bin/guild compile  -W1 -Wunbound-variable -Warity-mismatch -Wformat -Wshadowed-toplevel -o "tests/check.scm.go" "tests/check.scm"
wrote `tests/check.scm.go'
./pre-inst-env /gnu/store/ja5nzdqahacvrd52rw7rsbf0qyx7zii3-profile/bin/guild compile  -W1 -Wunbound-variable -Warity-mismatch -Wformat -Wshadowed-toplevel -o "tests/contain.scm.go" "tests/contain.scm"
wrote `tests/contain.scm.go'
./pre-inst-env /gnu/store/ja5nzdqahacvrd52rw7rsbf0qyx7zii3-profile/bin/guild compile  -W1 -Wunbound-variable -Warity-mismatch -Wformat -Wshadowed-toplevel -o "tests/errors.scm.go" "tests/errors.scm"
wrote `tests/errors.scm.go'
./pre-inst-env /gnu/store/ja5nzdqahacvrd52rw7rsbf0qyx7zii3-profile/bin/guild compile  -W1 -Wunbound-variable -Warity-mismatch -Wformat -Wshadowed-toplevel -o "tests/events.scm.go" "tests/events.scm"
wrote `tests/events.scm.go'
./pre-inst-env /gnu/store/ja5nzdqahacvrd52rw7rsbf0qyx7zii3-profile/bin/guild compile  -W1 -Wunbound-variable -Warity-mismatch -Wformat -Wshadowed-toplevel -o "tests/forgejo.scm.go" "tests/forgejo.scm"
wrote `tests/forgejo.scm.go'
./pre-inst-env /gnu/store/ja5nzdqahacvrd52rw7rsbf0qyx7zii3-profile/bin/guild compile  -W1 -Wunbound-variable -Warity-mismatch -Wformat -Wshadowed-toplevel -o "tests/http.scm.go" "tests/http.scm"
wrote `tests/http.scm.go'
./pre-inst-env /gnu/store/ja5nzdqahacvrd52rw7rsbf0qyx7zii3-profile/bin/guild compile  -W1 -Wunbound-variable -Warity-mismatch -Wformat -Wshadowed-toplevel -o "tests/layout.scm.go" "tests/layout.scm"
wrote `tests/layout.scm.go'
./pre-inst-env /gnu/store/ja5nzdqahacvrd52rw7rsbf0qyx7zii3-profile/bin/guild compile  -W1 -Wunbound-variable -Warity-mismatch -Wformat -Wshadowed-toplevel -o "tests/masking.scm.go" "tests/masking.scm"
wrote `tests/masking.scm.go'
./pre-inst-env /gnu/store/ja5nzdqahacvrd52rw7rsbf0qyx7zii3-profile/bin/guild compile  -W1 -Wunbound-variable -Warity-mismatch -Wformat -Wshadowed-toplevel -o "tests/metrics.scm.go" "tests/metrics.scm"
wrote `tests/metrics.scm.go'
./pre-inst-env /gnu/store/ja5nzdqahacvrd52rw7rsbf0qyx7zii3-profile/bin/guild compile  -W1 -Wunbound-variable -Warity-mismatch -Wformat -Wshadowed-toplevel -o "tests/pages.scm.go" "tests/pages.scm"
wrote `tests/pages.scm.go'
./pre-inst-env /gnu/store/ja5nzdqahacvrd52rw7rsbf0qyx7zii3-profile/bin/guild compile  -W1 -Wunbound-variable -Warity-mismatch -Wformat -Wshadowed-toplevel -o "tests/model.scm.go" "tests/model.scm"
wrote `tests/model.scm.go'
./pre-inst-env /gnu/store/ja5nzdqahacvrd52rw7rsbf0qyx7zii3-profile/bin/guild compile  -W1 -Wunbound-variable -Warity-mismatch -Wformat -Wshadowed-toplevel -o "tests/notify.scm.go" "tests/notify.scm"
wrote `tests/notify.scm.go'
./pre-inst-env /gnu/store/ja5nzdqahacvrd52rw7rsbf0qyx7zii3-profile/bin/guild compile  -W1 -Wunbound-variable -Warity-mismatch -Wformat -Wshadowed-toplevel -o "tests/pipeline.scm.go" "tests/pipeline.scm"
wrote `tests/pipeline.scm.go'
./pre-inst-env /gnu/store/ja5nzdqahacvrd52rw7rsbf0qyx7zii3-profile/bin/guild compile  -W1 -Wunbound-variable -Warity-mismatch -Wformat -Wshadowed-toplevel -o "tests/pumphouse.scm.go" "tests/pumphouse.scm"
wrote `tests/pumphouse.scm.go'
./pre-inst-env /gnu/store/ja5nzdqahacvrd52rw7rsbf0qyx7zii3-profile/bin/guild compile  -W1 -Wunbound-variable -Warity-mismatch -Wformat -Wshadowed-toplevel -o "tests/reconnect.scm.go" "tests/reconnect.scm"
wrote `tests/reconnect.scm.go'
./pre-inst-env /gnu/store/ja5nzdqahacvrd52rw7rsbf0qyx7zii3-profile/bin/guild compile  -W1 -Wunbound-variable -Warity-mismatch -Wformat -Wshadowed-toplevel -o "tests/records.scm.go" "tests/records.scm"
wrote `tests/records.scm.go'
./pre-inst-env /gnu/store/ja5nzdqahacvrd52rw7rsbf0qyx7zii3-profile/bin/guild compile  -W1 -Wunbound-variable -Warity-mismatch -Wformat -Wshadowed-toplevel -o "tests/relay.scm.go" "tests/relay.scm"
wrote `tests/relay.scm.go'
./pre-inst-env /gnu/store/ja5nzdqahacvrd52rw7rsbf0qyx7zii3-profile/bin/guild compile  -W1 -Wunbound-variable -Warity-mismatch -Wformat -Wshadowed-toplevel -o "tests/run-query.scm.go" "tests/run-query.scm"
wrote `tests/run-query.scm.go'
./pre-inst-env /gnu/store/ja5nzdqahacvrd52rw7rsbf0qyx7zii3-profile/bin/guild compile  -W1 -Wunbound-variable -Warity-mismatch -Wformat -Wshadowed-toplevel -o "tests/repl.scm.go" "tests/repl.scm"
wrote `tests/repl.scm.go'
./pre-inst-env /gnu/store/ja5nzdqahacvrd52rw7rsbf0qyx7zii3-profile/bin/guild compile  -W1 -Wunbound-variable -Warity-mismatch -Wformat -Wshadowed-toplevel -o "tests/scope.scm.go" "tests/scope.scm"
wrote `tests/scope.scm.go'
./pre-inst-env /gnu/store/ja5nzdqahacvrd52rw7rsbf0qyx7zii3-profile/bin/guild compile  -W1 -Wunbound-variable -Warity-mismatch -Wformat -Wshadowed-toplevel -o "tests/source.scm.go" "tests/source.scm"
wrote `tests/source.scm.go'
./pre-inst-env /gnu/store/ja5nzdqahacvrd52rw7rsbf0qyx7zii3-profile/bin/guild compile  -W1 -Wunbound-variable -Warity-mismatch -Wformat -Wshadowed-toplevel -o "tests/step-scheduling.scm.go" "tests/step-scheduling.scm"
wrote `tests/step-scheduling.scm.go'
./pre-inst-env /gnu/store/ja5nzdqahacvrd52rw7rsbf0qyx7zii3-profile/bin/guild compile  -W1 -Wunbound-variable -Warity-mismatch -Wformat -Wshadowed-toplevel -o "tests/uploader.scm.go" "tests/uploader.scm"
wrote `tests/uploader.scm.go'
make[2]: Leaving directory '/var/tmp/automate-work-xadZ33/workspace/source'
make  check-TESTS
make[2]: Entering directory '/var/tmp/automate-work-xadZ33/workspace/source'
make[3]: Entering directory '/var/tmp/automate-work-xadZ33/workspace/source'
FAIL: tests/attach.scm
PASS: tests/authority.scm
PASS: tests/check.scm
PASS: tests/contain.scm
PASS: tests/errors.scm
PASS: tests/events.scm
PASS: tests/forgejo.scm
PASS: tests/http.scm
PASS: tests/layout.scm
PASS: tests/masking.scm
PASS: tests/metrics.scm
PASS: tests/pages.scm
PASS: tests/model.scm
PASS: tests/notify.scm
PASS: tests/pipeline.scm
PASS: tests/pumphouse.scm
PASS: tests/reconnect.scm
PASS: tests/records.scm
PASS: tests/relay.scm
PASS: tests/run-query.scm
PASS: tests/repl.scm
PASS: tests/scope.scm
PASS: tests/source.scm
PASS: tests/step-scheduling.scm
PASS: tests/uploader.scm
================================================
   guile-automate 0.0.0-dev: ./test-suite.log
================================================

# TOTAL: 25
# PASS:  24
# SKIP:  0
# XFAIL: 0
# FAIL:  1
# XPASS: 0
# ERROR: 0

System information (uname -a): Linux 6.18.13-gnu #1 SMP PREEMPT_DYNAMIC 1 x86_64

.. contents:: :depth: 2

FAIL: tests/attach
==================

== attach.scm
stopped at the start of this step
resumed
error: boom 1 two
  irritants: "boom" 1 two
backtrace:
  automate/pipeline/step.scm:515:62 (_)
  ice-9/boot-9.scm:2058:7 (error)
stopped at the end of this step
resumed
stopped at the end of this step
resumed
stopped at the start of this step
resumed
FAIL tests/attach.scm (exit status: 141)

============================================================================
Testsuite summary for guile-automate 0.0.0-dev
============================================================================
# TOTAL: 25
# PASS:  24
# SKIP:  0
# XFAIL: 0
# FAIL:  1
# XPASS: 0
# ERROR: 0
============================================================================
See ./test-suite.log for debugging.
============================================================================
make[3]: *** [Makefile:961: test-suite.log] Error 1
make[3]: Leaving directory '/var/tmp/automate-work-xadZ33/workspace/source'
make[2]: *** [Makefile:1096: check-TESTS] Error 2
make[2]: Leaving directory '/var/tmp/automate-work-xadZ33/workspace/source'
make[1]: *** [Makefile:1318: check-am] Error 2
make[1]: Leaving directory '/var/tmp/automate-work-xadZ33/workspace/source'
make: *** [Makefile:847: check-recursive] Error 1
error: #<&invoke-error program: "/gnu/store/ja5nzdqahacvrd52rw7rsbf0qyx7zii3-profile/bin/bash" arguments: ("-c" "set -eo pipefail\nexport GUIX_PROFILE=/gnu/store/ja5nzdqahacvrd52rw7rsbf0qyx7zii3-profile\nsource \"$GUIX_PROFILE/etc/profile\"\ncd /var/tmp/automate-work-xadZ33/workspace/source\nexport XDG_CACHE_HOME=\"$TMPDIR/cache\"\nmake check VERBOSE=1") exit-status: 2 term-signal: #f stop-signal: #f>
backtrace:
  automate/pipeline/step.scm:515:62 (_)
  automate/step-body/check.scm:23:4 (body-thunk)
  guix/build/utils.scm:822:6 (invoke)