3a135f8edd833cd3 / check errored

Defined at .automate/pipelines.scm:154

Making check in .
make[1]: Entering directory '/home/chris/automate.cbaines.net/guile-automate/checks/workspace/3a135f8edd833cd3/work/source'
make  check-TESTS
make[2]: Entering directory '/home/chris/automate.cbaines.net/guile-automate/checks/workspace/3a135f8edd833cd3/work/source'
make[3]: Entering directory '/home/chris/automate.cbaines.net/guile-automate/checks/workspace/3a135f8edd833cd3/work/source'
PASS: tests/check.scm
PASS: tests/contain.scm
FAIL: tests/errors.scm
PASS: tests/events.scm
PASS: tests/forgejo.scm
PASS: tests/http.scm
PASS: tests/layout.scm
PASS: tests/masking.scm
PASS: tests/metrics.scm
PASS: tests/pages.scm
PASS: tests/model.scm
PASS: tests/pipeline.scm
FAIL: tests/pumphouse.scm
PASS: tests/reconnect.scm
PASS: tests/records.scm
PASS: tests/scope.scm
PASS: tests/source.scm
PASS: tests/step-scheduling.scm
PASS: tests/uploader.scm
================================================
   guile-automate 0.0.0-dev: ./test-suite.log
================================================

# TOTAL: 19
# PASS:  17
# SKIP:  0
# XFAIL: 0
# FAIL:  2
# XPASS: 0
# ERROR: 0

System information (uname -a): Linux 6.18.13-gnu #1 SMP PREEMPT_DYNAMIC 1 x86_64

.. contents:: :depth: 2

FAIL: tests/errors
==================

== errors.scm
  fail: the backtrace names the file that raised
  fail: a record raised as it is gains the step's backtrace
8 passed, 2 failed
;;; note: auto-compilation is enabled, set GUILE_AUTO_COMPILE=0
;;;       or pass the --no-auto-compile argument to disable.
;;; compiling /home/chris/automate.cbaines.net/guile-automate/checks/workspace/3a135f8edd833cd3/work/source/./tests/run.scm
;;; WARNING: compilation of /home/chris/automate.cbaines.net/guile-automate/checks/workspace/3a135f8edd833cd3/work/source/./tests/run.scm failed:
;;; failed to create path for auto-compiled file "/home/chris/automate.cbaines.net/guile-automate/checks/workspace/3a135f8edd833cd3/work/source/./tests/run.scm"
;;; compiling /home/chris/automate.cbaines.net/guile-automate/checks/workspace/3a135f8edd833cd3/work/source/tests/support.scm
;;; WARNING: compilation of /home/chris/automate.cbaines.net/guile-automate/checks/workspace/3a135f8edd833cd3/work/source/tests/support.scm failed:
;;; failed to create path for auto-compiled file "/home/chris/automate.cbaines.net/guile-automate/checks/workspace/3a135f8edd833cd3/work/source/tests/support.scm"
;;; compiling /home/chris/automate.cbaines.net/guile-automate/checks/workspace/3a135f8edd833cd3/work/source/tests/errors.scm
;;; WARNING: compilation of /home/chris/automate.cbaines.net/guile-automate/checks/workspace/3a135f8edd833cd3/work/source/tests/errors.scm failed:
;;; failed to create path for auto-compiled file "/home/chris/automate.cbaines.net/guile-automate/checks/workspace/3a135f8edd833cd3/work/source/tests/errors.scm"
FAIL tests/errors.scm (exit status: 1)

FAIL: tests/pumphouse
=====================

http on port 44053
pumphouse address: /tmp/automate-pumphouse-ekrdqd/address
remote registrar: ocapn://mlgz77fful47iy7upthhzev3k6y3ycotg56inqnsmwbu4vj2yiua.tcp-tls/s/jaLBUU6MUCl18fFWSnjX3yIk5ZoHHpeKUxfuCXipkX4?port=55785&host=%3A%3A1
remote admin: ocapn://mlgz77fful47iy7upthhzev3k6y3ycotg56inqnsmwbu4vj2yiua.tcp-tls/s/0JSl5nxEp0VF1_fQu9j6IjN8ORzLe7QPHjVswxFfgjQ?port=55785&host=%3A%3A1
warning: steps run unconfined: this command cannot run itself again as guile
attached to pumphouse /tmp/automate-pumphouse-ekrdqd/address
2026-09-21 07:11:29 (with-exception-handler) INFO: POST /output/6e5225dfc20a6bb4/tick 200 17ms

Goblins exception:
In message to #<local-object ^admin>:
  (run tests/nothing (run-request (id . "81d65c4ad9553742") (parameters (n . 5)) (cause . #f) (ancestors)))
ice-9/boot-9.scm:1705:22: In procedure raise-exception:
ERROR:
  1. &automate-error:
      kind: not-attached
      irritants: (tests/nothing #f)
  2. &message: "no pipeline process is attached under this name"
  3. &irritants: (tests/nothing #f)
warning: mutating the process environment while multiple threads are running;
         further behavior unspecified.
In goblins/core.scm:
   1074:7  4 (syscaller-$ _ #<local-object ^admin> (run tests/nothing (run-request (id . "81d65c4ad9553742") (parameters (n . 5)) (cause . #f) (ancestors))))
In automate/pumphouse.scm:
   145:15  3 (request-run! #<<pumphouse> records: #<local-object ^records> lives: #<hash-table 7f1036d7d3a0 9/31> shared: #<hash-table 7f1036d7d380 0/31> gates: #<hash-table 7f1036d7d360 0/31> timers: #<hash-table 7f1036d7d340 1/31> tokens: #<hash-table 7f1036d7d320 8/31> registrations: #<hash-table 7f1036d7d300 0/31> sink: "http://127.0.0.1:44053/output" web: "http://127.0.0.1:44053" publish: #<procedure 7f1036e3eae0 at automate/pumphouse/process.scm:129:2 (object swiss-num)>> tests/nothing #)
    107:6  2 (live-of _ _)
In automate/model.scm:
     83:2  1 (raise-automate-error _ _ . _)
In ice-9/boot-9.scm:
  1705:22  0 (raise-exception _ #:continuable? _)

2026-09-21 07:11:30 (with-exception-handler) INFO: POST /output/b8eeae3549a3ccdb/tick 200 19ms
2026-09-21 07:11:30 (with-exception-handler) INFO: POST /output/9153d0504e9e8a62/tick 200 15ms
2026-09-21 07:11:30 (with-exception-handler) INFO: POST /output/4b027c40527d9f52/tick 200 39ms
2026-09-21 07:11:30 INFO: dropping a connection that failed to hand shake: #<&compound-exception components: (#<&error> #<&irritants irritants: (#<gnutls-error-enum Error in the pull function.> handshake)> #<&exception-with-kind-and-args kind: gnutls-error args: (#<gnutls-error-enum Error in the pull function.> handshake)>)>
2026-09-21 07:11:30 (with-exception-handler) INFO: POST /output/4eba2d249c3d20cb/tick 200 40ms
2026-09-21 07:11:30 INFO: dropping a connection that failed to hand shake: #<&compound-exception components: (#<&external-error> #<&origin origin: "fport_write"> #<&message message: "~A"> #<&irritants irritants: ("Broken pipe")> #<&exception-with-kind-and-args kind: system-error args: ("fport_write" "~A" ("Broken pipe") (32))>)>
2026-09-21 07:11:30 (with-exception-handler) INFO: POST /output/28f03973c3a019ad/tick 200 4ms
2026-09-21 07:11:30 (with-exception-handler) INFO: POST /output/acbab568cf2fed12/tick 200 3ms
2026-09-21 07:11:31 INFO: dropping a connection that failed to hand shake: #<&compound-exception components: (#<&error> #<&irritants irritants: (#<gnutls-error-enum The TLS connection was non-properly terminated.> handshake)> #<&exception-with-kind-and-args kind: gnutls-error args: (#<gnutls-error-enum The TLS connection was non-properly terminated.> handshake)>)>

Goblins exception:
In message to #<local-object ^records>:
  (registration (/) 1789971091)
ice-9/boot-9.scm:1705:22: In procedure raise-exception:
ERROR:
  1. &automate-error:
      kind: invalid-scope
      irritants: ((/))
  2. &message: "not a list of pipeline names and prefixes"
  3. &irritants: ((/))
In goblins/core.scm:
   1074:7  4 (syscaller-$ _ #<local-object ^records> (registration (/) 1789971091))
In unknown file:
           3 (_ #<procedure cons (_ _)>)
In automate/pumphouse/scope.scm:
     44:4  2 (datastore-registration! #<<datastore> directory: "/tmp/automate-pumphouse-ekrdqd" pumphouse: #<<sqlite-db> pointer: #<pointer 0x7f102c001818> open?: #t stmts: #<hash-table 7f1036dbeda0 17/31>> pipelines: #<hash-table 7f1036dc6aa0 9/31>> (/) 1789971091)
In automate/model.scm:
     83:2  1 (raise-automate-error _ _ . _)
In ice-9/boot-9.scm:
  1705:22  0 (raise-exception _ #:continuable? _)

2026-09-21 07:11:32 (with-exception-handler) INFO: POST /output/5d49560d5a35bbe7/tick 200 17ms
2026-09-21 07:11:32 (with-exception-handler) INFO: POST /output/0a50ac849efeff66/tick 200 12ms
warning: steps run unconfined: this command cannot run itself again as guile
2026-09-21 07:11:32 (with-exception-handler) INFO: POST /output/f54439c8343a2a83/tick 200 77ms
2026-09-21 07:11:32 (with-exception-handler) INFO: POST /output/dc033b7d54e8687c/tick 200 22ms
2026-09-21 07:11:32 (with-exception-handler) INFO: POST /output/d6fc4d60aafbd808/tick 200 13ms

Goblins exception:
In message to #<local-object ^scoped-registrar>:
  (register tests/nap "/tmp/automate-def-a4FF6X" (structure (version 2) (name tests/nap) (steps ((step (name nap) (label #f) (group #f) (timeout #f) (error-permitted #f) (outputs (value)) (inputs ())))) (resources ()) (params ()) (web-ui-options ())) #<remote-object> "ocapn://qjce4poxxld33w34wad4b3thxv6f3mgphazdournxqh73jjkjqia.tcp-tls/s/pgJfksZ_w6LKUh1yc-Iak1LWRmGAtZbySOpxTbJmv8c?" ())
ice-9/boot-9.scm:1705:22: In procedure raise-exception:
ERROR:
  1. &automate-error:
      kind: not-permitted
      irritants: (tests/nap (tests/only tests/scoped/))
  2. &message: "this registration does not cover the pipeline"
  3. &irritants: (tests/nap (tests/only tests/scoped/))
In goblins/core.scm:
   1074:7  3 (syscaller-$ _ #<local-object ^scoped-registrar> (register tests/nap "/tmp/automate-def-a4FF6X" (structure (version 2) (name tests/nap) (steps ((step (name nap) (label #f) (group #f) (timeout #f) (error-permitted #f) (outputs (value)) (inputs ())))) (resources ()) (params ()) (web-ui-options ())) #<remote-object> "ocapn://qjce4poxxld33w34wad4b3thxv6f3mgphazdournxqh73jjkjqia.tcp-tls/s/pgJfksZ_w6LKUh1yc-Iak1LWRmGAtZbySOpxTbJmv8c?" ()))
In automate/pumphouse.scm:
    307:6  2 (register tests/nap "/tmp/automate-def-a4FF6X" (structure (version 2) (name tests/nap) (steps ((step (name nap) (label #f) (group #f) (timeout #f) (error-permitted #f) (outputs (value)) (inputs ())))) (resources ()) (params ()) (web-ui-options ())) #<remote-object> "ocapn://qjce4poxxld33w34wad4b3thxv6f3mgphazdournxqh73jjkjqia.tcp-tls/s/pgJfksZ_w6LKUh1yc-Iak1LWRmGAtZbySOpxTbJmv8c?" ())
In automate/model.scm:
     83:2  1 (raise-automate-error _ _ . _)
In ice-9/boot-9.scm:
  1705:22  0 (raise-exception _ #:continuable? _)

pumphouse refused tests/nap: Unknown error occurred with remote object
attached to pumphouse ocapn://mlgz77fful47iy7upthhzev3k6y3ycotg56inqnsmwbu4vj2yiua.tcp-tls/s/HI8MpvDIXhaCU2V797Pr83jOnL2ZScz5HGhgaWNv-to?port=55785&host=%3A%3A1
2026-09-21 07:11:33 (with-exception-handler) INFO: POST /output/559ad0b6eca7b830/tick 200 8ms
2026-09-21 07:11:33 (with-exception-handler) INFO: POST /output/1d2e6a48e9be8aa4/tick 200 4ms
2026-09-21 07:11:33 (with-exception-handler) INFO: POST /output/682894aa622a10a5/tick 200 16ms
2026-09-21 07:11:33 (with-exception-handler) INFO: POST /output/f39d9560b89ca07e/tick 200 7ms
2026-09-21 07:11:33 (with-exception-handler) INFO: POST /output/7a4a38c5e14926aa/tick 200 5ms
2026-09-21 07:11:33 (with-exception-handler) INFO: POST /output/f2377542fb69ceba/tick 200 11ms
2026-09-21 07:11:34 (with-exception-handler) INFO: POST /output/5b312076648134bd/tick 200 12ms
2026-09-21 07:11:34 (with-exception-handler) INFO: POST /output/f8fa195029f53db6/tick 200 20ms
2026-09-21 07:11:34 (with-exception-handler) INFO: POST /output/9e6ac5d187886f8e/tick 200 108ms
2026-09-21 07:11:34 (with-exception-handler) INFO: POST /output/91488cb03423d557/tick 200 7ms
2026-09-21 07:11:35 (with-exception-handler) INFO: POST /output/d17131203590a4e1/tick 200 6ms
2026-09-21 07:11:35 (with-exception-handler) INFO: POST /output/948388b0c4c4d4b0/tick 200 3ms
2026-09-21 07:11:35 (with-exception-handler) INFO: POST /output/5f7eec940e377b0e/tick 200 33ms
2026-09-21 07:11:35 (with-exception-handler) INFO: POST /output/9a6c36a903c61bfe/tick 200 9ms
2026-09-21 07:11:36 (with-exception-handler) INFO: POST /output/6774b2f08b418a98/tick 200 8ms
2026-09-21 07:11:36 (with-exception-handler) INFO: POST /output/9813bec252a34e1e/tick 200 13ms
2026-09-21 07:11:36 (with-exception-handler) INFO: POST /output/b7ce2f46d56729b5/tick 200 10ms
2026-09-21 07:11:36 (with-exception-handler) INFO: POST /output/d52238617fdb41cb/tick 200 58ms
2026-09-21 07:11:36 (with-exception-handler) INFO: POST /output/8ada13dfa520c492/tick 200 12ms
2026-09-21 07:11:36 (with-exception-handler) INFO: POST /output/49fe21c624f68485/tick 200 9ms
lost the pumphouse; reconnecting
2026-09-21 07:11:37 (with-exception-handler) INFO: POST /output/2240281835bc04af/chatty 200 8ms
2026-09-21 07:11:37 (with-exception-handler) INFO: POST /output/737dbd7354e1c4d4/tick 200 5ms
2026-09-21 07:11:37 (with-exception-handler) INFO: POST /output/da2581437636bafe/tick 200 11ms
2026-09-21 07:11:37 (with-exception-handler) INFO: POST /output/745d8ce5a4a1f286/tick 200 8ms
2026-09-21 07:11:37 (with-exception-handler) INFO: POST /output/59b667b48cd15149/tick 200 1ms
attached to pumphouse /tmp/automate-pumphouse-ekrdqd/address
2026-09-21 07:11:38 (with-exception-handler) INFO: POST /output/6555cee7c176fef0/tick 200 12ms
2026-09-21 07:11:38 (with-exception-handler) INFO: POST /output/93328f1cb783614c/tick 200 75ms
lost the pumphouse; reconnecting
2026-09-21 07:11:39 (with-exception-handler) INFO: POST /output/38e78bad4b455310/chatty 200 6ms
2026-09-21 07:11:40 (with-exception-handler) INFO: POST /output/0b9692d15fde7b8f/tick 200 11ms
2026-09-21 07:11:40 (with-exception-handler) INFO: POST /output/739debbe3ec5e610/tick 200 7ms
2026-09-21 07:11:40 (with-exception-handler) INFO: POST /output/e609017f378eb387/tick 200 4ms
2026-09-21 07:11:40 (with-exception-handler) INFO: POST /output/d4c958fa8e6e5dfa/tick 200 6ms
2026-09-21 07:11:40 (with-exception-handler) INFO: POST /output/e05fa58d0489b2f6/tick 200 4ms
run 38e78bad4b455310 reported to /tmp/automate-pumphouse-ekrdqd/address
run succeeded
  chatty: succeeded
attached to pumphouse /tmp/automate-pumphouse-ekrdqd/address
2026-09-21 07:11:41 (with-exception-handler) INFO: POST /output/eb92e0b6ace65559/tick 200 11ms
2026-09-21 07:11:41 (with-exception-handler) INFO: POST /output/02842eccb6b82a0a/tick 200 12ms
2026-09-21 07:11:41 (with-exception-handler) INFO: POST /output/74db7d3cd4233573/tick 200 98ms
lost the pumphouse; reconnecting
2026-09-21 07:11:42 (with-exception-handler) INFO: POST /output/fe5c40da80232c59/tick 200 265ms
2026-09-21 07:11:42 (with-exception-handler) INFO: POST /output/d35fc177066d978c/tick 200 4ms
2026-09-21 07:11:42 (with-exception-handler) INFO: POST /output/835043375ab9286a/tick 200 4ms
2026-09-21 07:11:42 (with-exception-handler) INFO: POST /output/362c1ec473f4ab0d/tick 200 12ms
2026-09-21 07:11:42 (with-exception-handler) INFO: POST /output/2543da6fc878678b/tick 200 4ms
attached to pumphouse /tmp/automate-pumphouse-ekrdqd/address
2026-09-21 07:11:43 (with-exception-handler) INFO: POST /output/d4b60b271ae24d47/tick 200 19ms
lost the pumphouse; reconnecting
2026-09-21 07:11:47 (with-exception-handler) INFO: POST /output/4cd010b515f2a372/tick 200 4ms
2026-09-21 07:11:47 (with-exception-handler) INFO: POST /output/c59c4e366138fa16/tick 200 15ms
2026-09-21 07:11:47 (with-exception-handler) INFO: POST /output/a7fb34b42a533b5f/tick 200 11ms
2026-09-21 07:11:47 (with-exception-handler) INFO: POST /output/e42f2569556cf98e/tick 200 13ms
2026-09-21 07:11:47 (with-exception-handler) INFO: GET /events/runs/f920a3b847467df9 200 5123ms
2026-09-21 07:11:47 (with-exception-handler) INFO: POST /output/a2483a25b15b5d87/tick 200 20ms
GET /events/pumphouse: error replying to client
2026-09-21 07:11:47 (with-exception-handler) INFO: GET /events/pumphouse 200 incomplete
2026-09-21 07:11:47 (with-exception-handler) INFO: POST /output/4d2bcf23f2285265/tick 200 13ms
2026-09-21 07:11:47 (with-exception-handler) INFO: POST /output/b27958045e017267/tick 200 7ms
2026-09-21 07:11:47 (with-exception-handler) INFO: GET /events/runs/nothing 404 8ms
2026-09-21 07:11:47 (with-exception-handler) INFO: GET / 200 127ms
2026-09-21 07:11:47 (with-exception-handler) INFO: GET /runs/2240281835bc04af 200 11ms
attached to pumphouse /tmp/automate-pumphouse-ekrdqd/address
2026-09-21 07:11:47 (with-exception-handler) INFO: GET /runs/2240281835bc04af/steps/chatty 200 12ms
2026-09-21 07:11:48 (with-exception-handler) INFO: POST /output/bcdc65e6f969d9a4/tick 200 19ms
lost the pumphouse; reconnecting
2026-09-21 07:11:48 (with-exception-handler) INFO: POST /output/8f8a37773e6a368d/tick 200 31ms
2026-09-21 07:11:49 (with-exception-handler) INFO: POST /output/083242b518956047/tick 200 105ms
2026-09-21 07:11:49 (with-exception-handler) INFO: POST /output/9b8db2070ec49b73/tick 200 228ms
2026-09-21 07:11:50 (with-exception-handler) INFO: POST /output/0fb0a718bce288f5/tick 200 380ms
2026-09-21 07:11:51 (with-exception-handler) INFO: POST /output/797a9de3571ea3c3/tick 200 63ms
2026-09-21 07:11:51 (with-exception-handler) INFO: POST /output/3c10cb1bea90f26c/tick 200 22ms
2026-09-21 07:11:51 (with-exception-handler) INFO: POST /output/12493c12b7fa4f0b/tick 200 20ms
2026-09-21 07:11:51 (with-exception-handler) INFO: POST /output/d29d77d1217a2a17/tick 200 157ms
attached to pumphouse /tmp/automate-pumphouse-ekrdqd/address
lost the pumphouse; reconnecting
lost the pumphouse; reconnecting
2026-09-21 07:11:55 (with-exception-handler) INFO: POST /output/4dc5b1879b7de5ab/tick 200 395ms
2026-09-21 07:11:55 (with-exception-handler) INFO: POST /output/c8955c34869f4f18/tick 200 120ms
2026-09-21 07:11:55 (with-exception-handler) INFO: POST /output/e7b4c86aef195d9c/tick 200 138ms
2026-09-21 07:11:55 (with-exception-handler) INFO: POST /output/73aacd60a08a30ea/tick 200 23ms
2026-09-21 07:11:55 (with-exception-handler) INFO: POST /output/71e5fe2e384963af/tick 200 9ms
2026-09-21 07:11:55 (with-exception-handler) INFO: POST /output/af70683139ad879c/tick 200 10ms
2026-09-21 07:11:56 (with-exception-handler) INFO: POST /output/d20b432469641928/tick 200 234ms
2026-09-21 07:11:56 (with-exception-handler) INFO: POST /output/de56b2133395e24c/tick 200 33ms
2026-09-21 07:11:56 (with-exception-handler) INFO: POST /output/011fa33e60cc7745/tick 200 21ms

Goblins exception:
In message to #<local-object ^scoped-registrar>:
  (register tests/nap "/tmp/automate-def-a4FF6X" (structure (version 2) (name tests/nap) (steps ((step (name nap) (label #f) (group #f) (timeout #f) (error-permitted #f) (outputs (value)) (inputs ())))) (resources ()) (params ()) (web-ui-options ())) #<remote-object> "ocapn://i2agghxy5ieq33eyynsfczu7gqqdxq5tqzmpb5qx4wl7pyk2dvza.tcp-tls/s/M1pv8eyYKI9fyVqXkC5cOGy7ypQxersHNVkhi9Y--SY?" ())
ice-9/boot-9.scm:1705:22: In procedure raise-exception:
ERROR:
  1. &automate-error:
      kind: not-permitted
      irritants: (tests/nap (tests/only tests/scoped/))
  2. &message: "this registration does not cover the pipeline"
  3. &irritants: (tests/nap (tests/only tests/scoped/))
In goblins/core.scm:
   1074:7  3 (syscaller-$ _ #<local-object ^scoped-registrar> (register tests/nap "/tmp/automate-def-a4FF6X" (structure (version 2) (name tests/nap) (steps ((step (name nap) (label #f) (group #f) (timeout #f) (error-permitted #f) (outputs (value)) (inputs ())))) (resources ()) (params ()) (web-ui-options ())) #<remote-object> "ocapn://i2agghxy5ieq33eyynsfczu7gqqdxq5tqzmpb5qx4wl7pyk2dvza.tcp-tls/s/M1pv8eyYKI9fyVqXkC5cOGy7ypQxersHNVkhi9Y--SY?" ()))
In automate/pumphouse.scm:
    307:6  2 (register tests/nap "/tmp/automate-def-a4FF6X" (structure (version 2) (name tests/nap) (steps ((step (name nap) (label #f) (group #f) (timeout #f) (error-permitted #f) (outputs (value)) (inputs ())))) (resources ()) (params ()) (web-ui-options ())) #<remote-object> "ocapn://i2agghxy5ieq33eyynsfczu7gqqdxq5tqzmpb5qx4wl7pyk2dvza.tcp-tls/s/M1pv8eyYKI9fyVqXkC5cOGy7ypQxersHNVkhi9Y--SY?" ())
In automate/model.scm:
     83:2  1 (raise-automate-error _ _ . _)
In ice-9/boot-9.scm:
  1705:22  0 (raise-exception _ #:continuable? _)

pumphouse refused tests/nap: Unknown error occurred with remote object
attached to pumphouse ocapn://mlgz77fful47iy7upthhzev3k6y3ycotg56inqnsmwbu4vj2yiua.tcp-tls/s/HI8MpvDIXhaCU2V797Pr83jOnL2ZScz5HGhgaWNv-to?port=55785&host=%3A%3A1
2026-09-21 07:11:57 (with-exception-handler) INFO: POST /output/cabea87b7583b1b4/tick 200 49ms
2026-09-21 07:11:57 (with-exception-handler) INFO: POST /output/9f0fdce2eab88741/tick 200 40ms
2026-09-21 07:11:57 (with-exception-handler) INFO: POST /output/79b327f3d006ad95/tick 200 42ms
2026-09-21 07:11:57 (with-exception-handler) INFO: POST /output/4f9b466f592256e7/tick 200 32ms
2026-09-21 07:11:57 (with-exception-handler) INFO: POST /output/22ebd3ea0e163427/tick 200 9ms
attached to pumphouse /tmp/automate-pumphouse-ekrdqd/address
2026-09-21 07:11:57 (with-exception-handler) INFO: POST /output/5df86d38ac0f0dbb/tick 200 21ms
Error in IO handling wrapped resource #<input-output: socket 23>:
#<&compound-exception components: (#<&external-error> #<&origin origin: "accept"> #<&message message: "~A"> #<&irritants irritants: ("Too many open files")> #<&exception-with-kind-and-args kind: system-error args: ("accept" "~A" ("Too many open files") (24))>)>
warning: mutating the process environment while multiple threads are running;
         further behavior unspecified.
In fibers.scm:
     85:4 13 (%run-fibers _ _ _ _)
In fibers/interrupts.scm:
     98:4 12 (with-interrupts/thread-cputime _ _ _ _)
In fibers/scheduler.scm:
   380:26 11 (run-scheduler #<scheduler 7f0a5168f930 (remote-peers: (7f0a5168fc40))> _)
In ice-9/boot-9.scm:
  1778:15 10 (with-exception-handler #<procedure 7f0a51686f00 at ice-9/boot-9.scm:1882:7 (exn)> _ #:unwind? _ #:unwind-for-type _)
  1784:12  9 (with-exception-handler _ _ #:unwind? _ #:unwind-for-type _)
In fibers/scheduler.scm:
   344:10  8 (next-task)
In fibers.scm:
    179:8  7 (_)
In goblins/actor-lib/io.scm:
    60:10  6 (_)
    85:15  5 (_ _)
In ice-9/boot-9.scm:
  1784:12  4 (with-exception-handler _ _ #:unwind? _ #:unwind-for-type _)
In goblins/actor-lib/io.scm:
    70:18  3 (run-and-send)
In ice-9/suspendable-ports.scm:
   733:12  2 (_ #<input-output: socket 23> _)
In unknown file:
           1 (accept #<input-output: socket 23> 2048)
In ice-9/boot-9.scm:
  1705:22  0 (raise-exception _ #:continuable? _)

Uncaught exception in task:
In fibers.scm:
    179:8  8 (_)
In goblins/actor-lib/io.scm:
    60:10  7 (_)
    85:15  6 (_ _)
In ice-9/boot-9.scm:
  1784:12  5 (with-exception-handler _ _ #:unwind? _ #:unwind-for-type _)
In goblins/actor-lib/io.scm:
    70:18  4 (run-and-send)
In ice-9/suspendable-ports.scm:
   733:12  3 (_ #<input-output: socket 23> _)
In unknown file:
           2 (accept #<input-output: socket 23> 2048)
In ice-9/boot-9.scm:
  1706:22  1 (raise-exception _ #:continuable? _)
  1705:22  0 (raise-exception _ #:continuable? _)
ice-9/boot-9.scm:1705:22: In procedure raise-exception:
ERROR:
  1. &non-continuable
Backtrace:
In ice-9/boot-9.scm:
  1784:12  6 (with-exception-handler _ _ #:unwind? _ #:unwind-for-type _)
In unknown file:
           5 (apply-smob/0 #<thunk 7f0a54a42340>)
In ice-9/boot-9.scm:
    733:2  4 (call-with-prompt _ _ #<procedure default-prompt-handler (k proc)>)
In ice-9/eval.scm:
    619:8  3 (_ #(#(#<directory (guile-user) 7f0a54a45c80>)))
In automate/pipeline/daemon.scm:
    561:5  2 (daemon-main _ _ #:contain _)
In automate/pipeline.scm:
   638:22  1 (serve #<<pipeline-process> directory: "/tmp/automate-cfoNbs" socket-path: "/tmp/automate-cfoNbs/intro.sock" intro-vat: #<vat id: 0 name: intro> vat: #<vat id: 1 name: pipeline> netlayer: #<local-object ^unix-domain-socket-netlayer> mycapn: #<local-object ^mycapn> mailbox: #<<mailbox> mutex: #<mutex 7f0a50fbfe00> condition: #<condition-variable 7f0a5016d390> items: ()> output-directory: "/tmp/automate-output-P6WWoc">)
In unknown file:
           0 (open-file "/tmp/automate-output-P6WWoc/e39a9ac0f1be7fa7/tick" "ab")

ERROR: In procedure open-file:
In procedure open-file: Too many open files: "/tmp/automate-output-P6WWoc/e39a9ac0f1be7fa7/tick"
Error in IO handling wrapped resource #<input-output: file 781>:
#<&compound-exception components: (#<&external-error> #<&origin origin: "fport_read"> #<&message message: "~A"> #<&irritants irritants: ("Connection reset by peer")> #<&exception-with-kind-and-args kind: system-error args: ("fport_read" "~A" ("Connection reset by peer") (104))>)>
In fibers.scm:
     85:4 17 (%run-fibers _ _ _ _)
In fibers/interrupts.scm:
     98:4 16 (with-interrupts/thread-cputime _ _ _ _)
Error in IO handling wrapped resource #<input-output: file 644>:
#<&compound-exception components: (#<&external-error> #<&origin origin: "fport_read"> #<&message message: "~A"> #<&irritants irritants: ("Connection reset by peer")> #<&exception-with-kind-and-args kind: system-error args: ("fport_read" "~A" ("Connection reset by peer") (104))>)>
In ice-9/boot-9.scm:
In fibers/scheduler.scm:
  1778:15 19    380:26 15 (run-scheduler #<scheduler 7f103257de00 (remote-peers: (7f103257de70))> _)
In ice-9/boot-9.scm:
  1778:15 14 (with-exception-handler #<program 7f1032d9af00 7f1036be7bf8> _ #:unwind? _ #:unwind-for-type _)
(with-exception-handler #<procedure 7f103397ef30 at ice-9/boot-9.scm:1882:7 (exn)> _ #:unwind? _ #:unwind-for-type _)
In fibers.scm:
  1784:12 13 (with-exception-handler _ _ #:unwind? _ #:unwind-for-type _)
   164:13 18 (run-fibers _ #:hz _ #:scheduler _ #:parallelism _ #:cpus _ #:install-suspendable-ports? _ #:drain? _)
     85:4 17 (%run-fibers _ _ _ _)
In fibers/scheduler.scm:
In fibers/interrupts.scm:
     98:4 16    344:10 12 (next-task)
(with-interrupts/thread-cputime _ _ _ _)
In fibers.scm:
In fibers/scheduler.scm:
    179:8 11 (_)
In goblins/actor-lib/io.scm:
    60:10 10 (_)
   380:26 15 (run-scheduler #<scheduler 7f103257de70 (remote-peers: (7f103257de00))> _)
    85:15  9 (_ _)
In ice-9/boot-9.scm:
In ice-9/boot-9.scm:
  1784:12  8 (with-exception-handler _ _ #:unwind? _ #:unwind-for-type _)
  1778:15 14 
In goblins/actor-lib/io.scm:
    70:18  7 (run-and-send)
In ice-9/control.scm:
(with-exception-handler #<procedure 7f1032d86300 at ice-9/boot-9.scm:1882:7 (exn)> _ #:unwind? _ #:unwind-for-type _)
    91:24  6 (call-with-escape-continuation _)
In goblins/contrib/syrup.scm:
  1784:12 13 (with-exception-handler _ _ #:unwind? _ #:unwind-for-type _)
    306:7  5 (read-next)
In fibers/scheduler.scm:
In ice-9/suspendable-ports.scm:
   344:10 12 (next-task)
    558:2  4 (peek-char _)
In fibers.scm:
    179:8 11 (_)
In   n 84:27   33: 
(fill-input #<input-output: file 781> _ _)
    60:10 10 (_)

     72:4  2     85:15  9 (_ _)
(read-bytes #<input-output: file 781> #vu8(60 49 48 39 111 112 58 100 101 108 105 118 101 114 60 49 49 39 100 101 115 99 58 101 120 112 111 114 116 52 43 62 91 49 49 39 111 117 116 112 117 116 45 115 105 110 107 49 54 34 57 50 54 97 98 57 51 57 101 101 56 49 100 53 49 53 93 49 48 51 43 60 49 56 39 100 101 115 99 58 105 109 112 111 114 116 45 111 98 106 101 99 116 49 49 52 43 62 62 49 48 39 111 112 58 100 101 108 105 118 101 114 60 49 49 39 100 101 115 99 58 101 # …) …)
In unknown file:
           1 
In ice-9/boot-9.scm:
(port-read #<input-output: file 781> #vu8(60 49 48 39 111 112 58 100 101 108 105 118 101 114 60 49 49 39 100 101 115 99 58 101 120 112 111 114 116 52 43 62 91 49 49 39 111 117 116 112 117 116 45 115 105 110 107 49 54 34 57 50 54 97 98 57 51 57 101 101 56 49 100 53 49 53 93 49 48 51 43 60 49 56 39 100 101 115 99 58 105 109 112 111 114 116 45 111 98 106 101 99 116 49 49 52 43 62 62 49 48 39 111 112 58 100 101 108 105 118 101 114 60 49 49 39 100 101 115 99 58 101 120 112 111 114 …) …)
  1784:12  8 
In ice-9/boot-9.scm:
(with-exception-handler _ _ #:unwind? _ #:unwind-for-type _)
  1705:22  0 (raise-exception _ #:continuable? _)

Uncaught exception in task:
In goblins/actor-lib/io.scm:
In fibers.scm:
    179:8 15 (_)
    70:18  7 (run-and-send)
In goblins/actor-lib/io.scm:
In ice-9/control.scm:
    60:10 14 (_)
    91:24  6 (call-with-escape-continuation _)
    85:15 13 (_ _)
In goblins/contrib/syrup.scm:
In ice-9/boot-9.scm:
  1784:12 12 (with-exception-handler _ _ #:unwind? _ #:unwind-for-type _)
In goblins/actor-lib/io.scm:
    70:18 11 (run-and-send)
In ice-9/control.scm:
    91:24 10 (call-with-escape-continuation _)
In goblins/contrib/syrup.scm:
    306:7  5 (read-next)
In ice-9/suspendable-ports.scm:
    306:7  9 (read-next)
In ice-9/suspendable-ports.scm:
    558:2  4 (peek-char _)
    558:2  8 (peek-char _)
   184:27  7 (fill-input #<input-output: file 781> _ _)
   184:27  3 (fill-input #<input-output: file 644> _ _)
     72:4  6      72:4  2 (read-bytes #<input-output: file 781> #vu8(60 49 48 39 111 112 58 100 101 108 105 118 101 114 60 49 49 39 100 101 115 99 58 101 120 112 111 114 116 52 43 62 91 49 49 39 111 117 116 112 117 116 45 115 105 110 107 49 54 34 57 50 54 97 98 57 51 57 101 101 56 49 100 53 49 53 93 49 48 51 43 60 49 56 39 100 101 115 99 58 105 109 112 111 114 116 45 111 98 106 101 99 116 49 49 52 43 62 62 49 48 39 111 112 58 100 101 108 105 118 101 114 60 49 49 39 100 101 115 99 58 101 120 112 111 114 …) …)
In unknown file:
           5 (read-bytes #<input-output: file 644> #vu8(62 57 50 43 62 105 109 112 111 114 116 45 111 98 106 101 99 116 39 116 105 99 107 55 39 101 114 114 111 114 101 100 53 98 49 56 55 57 98 55 100 101 53 97 98 54 43 91 54 39 101 120 105 116 101 100 52 39 116 105 99 107 48 43 93 93 50 55 52 43 60 49 56 39 100 101 115 99 58 105 109 112 111 114 116 45 111 98 106 101 99 116 50 56 53 43 62 62 60 49 48 39 111 112 58 100 101 108 105 118 101 114 60 49 49 39 100 101 115 99 58 101 # …) …)
(port-read #<input-output: file 781> #vu8(60 49 48 39 111 112 58 100 101 108 105 118 101 114 60 49 49 39 100 101 115 99 58 101 120 112 111 114 116 52 43 62 91 49 49 39 111 117 116 112 117 116 45 115 105 110 107 49 54 34 57 50 54 97 98 57 51 57 101 101 56 49 100 53 49 53 93 49 48 51 43 60 49 56 39 100 101 115 99 58 105 109 112 111 114 116 45 111 98 106 101 99 116 49 49 52 43 62 62 49 48 39 111 112 58 100 101 108 105 118 101 114 60 49 49 39 100 101 115 99 58 101 120 112 111 114 …) …)
Exception thrown while printing backtrace:
Throw to key `encoding-error' with args `("put-char" "conversion to port encoding failed" 84 #<output: file 2> #\I)'.

Uncaught exception in task:
In ice-9/boot-9.scm:
  1705:22  4 (raise-exception _ #:continuable? _)
In fibers.scm:
    179:8 15 (_)
In goblins/actor-lib/io.scm:
    60:10
In  14 goblins/core.scm:
(_)
   1987:7  3 (<-np-extern _ . _)
    85:15 13 (_ _)
In fibers/operations.scm:
   200:200:10In   2  ice-9/boot-9.scm:
(perform-operation _)
  1784:12 12 
In fibers/scheduler.scm:
    461:6  1 (suspend-current-task _)
In ice-9/boot-9.scm:
(with-exception-handler _ _ #:unwind? _ #:unwind-for-type _)
  1705:22  0 (raise-exception _ #:continuable? _)
In goblins/actor-lib/io.scm:
    70:18 11 (run-and-send)
In ice-9/control.scm:
    91:24 10 (call-with-escape-continuation _)
ice-9/boot-9.scm:1705:22: In procedure raise-exception:
Attempt to suspend fiber within continuation barrier
In goblins/contrib/syrup.scm:
Error in IO handling wrapped resource #<input-output: file 510>:
    306:7  9 #<&compound-exception components: (#<&external-error> #<&origin origin: "fport_read"> #<&message message: "~A"> #<&irritants irritants: ("Connection reset by peer")> #<&exception-with-kind-and-args kind: system-error args: ("fport_read" "~A" ("Connection reset by peer") (104))>)>
Exception thrown while printing backtrace:
Throw to key `encoding-error' with args `("put-char" "conversion to port encoding failed" 84 #<output: file 2> #\()'.
In fibers.scm:
     85:4 17 ice-9/boot-9.scm:1705:22: In proc(%run-fibers _ _ _ _)cdure raise-exception:
Attempt to suspend fiber within continuation barrier
In fibers/interrupts.scm:
     98:4 16 (with-interrupts/thread-cputime _ _ _ _)
In fibers/scheduler.scm:
   380:26 15 (run-scheduler #<scheduler 7f103257de00 (remote-peers: (7f103257de70))> _)
In ice-9/boot-9.scm:
  1778:15 14 (with-exception-handler #<procedure 7f1017a83b70 at ice-9/boot-9.scm:1882:7 (exn)> _ #:unwind? _ #:unwind-for-type _)
  1784:12 13 (with-exception-handler _ _ #:unwind? _ #:unwind-for-type _)
In fibers/scheduler.scm:
   344:10 12 (next-task)
In fibers.scm:
    179:8 11 (_)
In goblins/actor-lib/io.scm:
    60:10 10 (_)
    85:15  9 (_ _)
In ice-9/boot-9.scm:
  1784:12  8 (with-exception-handler _ _ #:unwind? _ #:unwind-for-type _)
In goblins/actor-lib/io.scm:
    70:18  7 (run-and-send)
In ice-9/control.scm:
    91:24  6 (call-with-escape-continuation _)
In goblins/contrib/syrup.scm:
    306:7  5 (read-next)
In ice-9/suspendable-ports.scm:
    558:2  4 (peek-char _)
   184:27  3 (fill-input #<input-output: file 510> _ _)
     72:4  2 (read-bytes #<input-output: file 510> #vu8(93 62 49 51 39 111 112 58 103 99 45 97 110 115 119 101 114 115 91 51 51 50 43 93 62 60 49 51 39 111 112 58 103 99 45 97 110 115 119 101 114 115 91 51 51 54 43 93 62 60 49 51 39 111 112 58 103 99 45 97 110 115 119 101 114 115 91 51 49 50 43 93 62 60 49 51 39 111 112 58 103 99 45 97 110 115 119 101 114 115 91 51 49 54 43 93 62 60 49 51 39 111 112 58 103 99 45 97 110 115 119 101 114 115 91 51 49 53 43 93 62 60 49 51 39 111 112 58 103 99 …) …)
In unknown file:
           1 (port-read #<input-output: file 510> #vu8(93 62 49 51 39 111 112 58 103 99 45 97 110 115 119 101 114 115 91 51 51 50 43 93 62 60 49 51 39 111 112 58 103 99 45 97 110 115 119 101 114 115 91 51 51 54 43 93 62 60 49 51 39 111 112 58 103 99 45 97 110 115 119 101 114 115 91 51 49 50 43 93 62 60 49 51 39 111 112 58 103 99 45 97 110 115 119 101 114 115 91 51 49 54 43 93 62 60 49 51 39 111 112 58 103 99 45 97 110 115 119 101 114 115 91 51 49 53 43 93 62 60 49 51 39 111 112 58 103 99 # …) …)
In ice-9/boot-9.scm:
  1705:22  0 (raise-exception _ #:continuable? _)

Uncaught exception in task:
In fibers.scm:
    179:8 12 (_)
In goblins/actor-lib/io.scm:
    60:10 11 (_)
    85:15 10 (_ _)
In ice-9/boot-9.scm:
  1784:12  9 (with-exception-handler _ _ #:unwind? _ #:unwind-for-type _)
In goblins/actor-lib/io.scm:
    70:18  8 (run-and-send)
In ice-9/control.scm:
    91:24  7 (call-with-escape-continuation _)
In goblins/contrib/syrup.scm:
    306:7  6 (read-next)
In ice-9/suspendable-ports.scm:
    558:2  5 (peek-char _)
   184:27  4 (fill-input #<input-output: file 510> _ _)
     72:4  3 (read-bytes #<input-output: file 510> #vu8(93 62 49 51 39 111 112 58 103 99 45 97 110 115 119 101 114 115 91 51 51 50 43 93 62 60 49 51 39 111 112 58 103 99 45 97 110 115 119 101 114 115 91 51 51 54 43 93 62 60 49 51 39 111 112 58 103 99 45 97 110 115 119 101 114 115 91 51 49 50 43 93 62 60 49 51 39 111 112 58 103 99 45 97 110 115 119 101 114 115 91 51 49 54 43 93 62 60 49 51 39 111 112 58 103 99 45 97 110 115 119 101 114 115 91 51 49 53 43 93 62 60 49 51 39 111 112 58 103 99 …) …)
In unknown file:
           2 (port-read #<input-output: file 510> #vu8(93 62 49 51 39 111 112 58 103 99 45 97 110 115 119 101 114 115 91 51 51 50 43 93 62 60 49 51 39 111 112 58 103 99 45 97 110 115 119 101 114 115 91 51 51 54 43 93 62 60 49 51 39 111 112 58 103 99 45 97 110 115 119 101 114 115 91 51 49 50 43 93 62 60 49 51 39 111 112 58 103 99 45 97 110 115 119 101 114 115 91 51 49 54 43 93 62 60 49 51 39 111 112 58 103 99 45 97 110 115 119 101 114 115 91 51 49 53 43 93 62 60 49 51 39 111 112 58 103 99 # …) …)
In ice-9/boot-9.scm:
  1706:22  1 (raise-exception _ #:continuable? _)
  1705:22  0 (raise-exception _ #:continuable? _)
ice-9/boot-9.scm:1705:22: In procedure raise-exception:
ERROR:
  1. &non-continuable
Error in IO handling wrapped resource #<input-output: file 781>:
#<&compound-exception components: (#<&external-error> #<&origin origin: "fport_write"> #<&message message: "~A"> #<&irritants irritants: ("Broken pipe")> #<&exception-with-kind-and-args kind: system-error args: ("fport_write" "~A" ("Broken pipe") (32))>)>
In fibers.scm:
     85:4 13 (%run-fibers _ _ _ _)
In fibers/interrupts.scm:
     98:4 12 (with-interrupts/thread-cputime _ _ _ _)
In fibers/scheduler.scm:
   380:26 11 (run-scheduler #<scheduler 7f103257de00 (remote-peers: (7f103257de70))> _)
In ice-9/boot-9.scm:
  1778:15 10 (with-exception-handler #<procedure 7f10297ed720 at ice-9/boot-9.scm:1882:7 (exn)> _ #:unwind? _ #:unwind-for-type _)
  1784:12  9 (with-exception-handler _ _ #:unwind? _ #:unwind-for-type _)
In fibers/scheduler.scm:
   344:10  8 (next-task)
In fibers.scm:
    179:8  7 (_)
In goblins/actor-lib/io.scm:
    60:10  6 (_)
    85:15  5 (_ _)
In ice-9/boot-9.scm:
  1784:12  4 (with-exception-handler _ _ #:unwind? _ #:unwind-for-type _)
In goblins/actor-lib/io.scm:
    70:18  3 (run-and-send)
In ice-9/suspendable-ports.scm:
     83:4  2 (write-bytes #<input-output: file 781> #vu8(60 49 48 39 111 112 58 100 101 108 105 118 101 114 60 49 49 39 100 101 115 99 58 101 120 112 111 114 116 49 56 43 62 91 51 39 114 117 110 91 49 49 39 114 117 110 45 114 101 113 117 101 115 116 60 52 39 112 97 105 114 50 39 105 100 49 54 34 98 100 101 54 57 100 101 99 57 50 101 54 56 49 52 48 62 91 49 48 39 112 97 114 97 109 101 116 101 114 115 60 52 39 112 97 105 114 49 39 110 51 43 62 93 91 53 39 99 97 117 115 101 60 52 39 112 97 # …) …)
In unknown file:
           1 (port-write #<input-output: file 781> #vu8(60 49 48 39 111 112 58 100 101 108 105 118 101 114 60 49 49 39 100 101 115 99 58 101 120 112 111 114 116 49 56 43 62 91 51 39 114 117 110 91 49 49 39 114 117 110 45 114 101 113 117 101 115 116 60 52 39 112 97 105 114 50 39 105 100 49 54 34 98 100 101 54 57 100 101 99 57 50 101 54 56 49 52 48 62 91 49 48 39 112 97 114 97 109 101 116 101 114 115 60 52 39 112 97 105 114 49 39 110 51 43 62 93 91 53 39 99 97 117 115 101 60 52 39 112 97 105 …) …)
In ice-9/boot-9.scm:
  1705:22  0 (raise-exception _ #:continuable? _)

Uncaught exception in task:
In fibers.scm:
    179:8  8 (_)
In goblins/actor-lib/io.scm:
    60:10  7 (_)
    85:15  6 (_ _)
In ice-9/boot-9.scm:
  1784:12  5 (with-exception-handler _ _ #:unwind? _ #:unwind-for-type _)
In goblins/actor-lib/io.scm:
    70:18  4 (run-and-send)
In ice-9/suspendable-ports.scm:
     83:4  3 (write-bytes #<input-output: file 781> #vu8(60 49 48 39 111 112 58 100 101 108 105 118 101 114 60 49 49 39 100 101 115 99 58 101 120 112 111 114 116 49 56 43 62 91 51 39 114 117 110 91 49 49 39 114 117 110 45 114 101 113 117 101 115 116 60 52 39 112 97 105 114 50 39 105 100 49 54 34 98 100 101 54 57 100 101 99 57 50 101 54 56 49 52 48 62 91 49 48 39 112 97 114 97 109 101 116 101 114 115 60 52 39 112 97 105 114 49 39 110 51 43 62 93 91 53 39 99 97 117 115 101 60 52 39 112 97 # …) …)
In unknown file:
           2 (port-write #<input-output: file 781> #vu8(60 49 48 39 111 112 58 100 101 108 105 118 101 114 60 49 49 39 100 101 115 99 58 101 120 112 111 114 116 49 56 43 62 91 51 39 114 117 110 91 49 49 39 114 117 110 45 114 101 113 117 101 115 116 60 52 39 112 97 105 114 50 39 105 100 49 54 34 98 100 101 54 57 100 101 99 57 50 101 54 56 49 52 48 62 91 49 48 39 112 97 114 97 109 101 116 101 114 115 60 52 39 112 97 105 114 49 39 110 51 43 62 93 91 53 39 99 97 117 115 101 60 52 39 112 97 105 …) …)
In ice-9/boot-9.scm:
  1706:22  1 (raise-exception _ #:continuable? _)
  1705:22  0 (raise-exception _ #:continuable? _)
ice-9/boot-9.scm:1705:22: In procedure raise-exception:
ERROR:
  1. &non-continuable
Error in IO handling wrapped resource #<input-output: file 644>:
#<&compound-exception components: (#<&external-error> #<&origin origin: "fport_write"> #<&message message: "~A"> #<&irritants irritants: ("Broken pipe")> #<&exception-with-kind-and-args kind: system-error args: ("fport_write" "~A" ("Broken pipe") (32))>)>
In fibers.scm:
     85:4 13 (%run-fibers _ _ _ _)
In fibers/interrupts.scm:
     98:4 12 (with-interrupts/thread-cputime _ _ _ _)
In fibers/scheduler.scm:
   380:26 11 (run-scheduler #<scheduler 7f103257de00 (remote-peers: (7f103257de70))> _)
In ice-9/boot-9.scm:
  1778:15 10 (with-exception-handler #<procedure 7f1017560ea0 at ice-9/boot-9.scm:1882:7 (exn)> _ #:unwind? _ #:unwind-for-type _)
  1784:12  9 (with-exception-handler _ _ #:unwind? _ #:unwind-for-type _)
In fibers/scheduler.scm:
   344:10  8 (next-task)
In fibers.scm:
    179:8  7 (_)
In goblins/actor-lib/io.scm:
    60:10  6 (_)
    85:15  5 (_ _)
In ice-9/boot-9.scm:
  1784:12  4 (with-exception-handler _ _ #:unwind? _ #:unwind-for-type _)
In goblins/actor-lib/io.scm:
    70:18  3 (run-and-send)
In ice-9/suspendable-ports.scm:
     83:4  2 (write-bytes #<input-output: file 644> #vu8(60 49 51 39 111 112 58 103 99 45 101 120 112 111 114 116 115 91 50 56 54 43 93 91 49 43 93 62 116 50 57 50 43 62 91 55 39 102 117 108 102 105 108 108 50 39 111 107 93 102 102 62 47 47 49 50 55 46 48 46 48 46 49 58 52 52 48 53 51 93 102 102 62 51 99 55 100 102 52 55 102 54 49 48 62 91 49 48 39 112 97 114 97 109 101 116 101 114 115 60 52 39 112 97 105 114 49 39 110 51 43 62 93 91 53 39 99 97 117 115 101 60 52 39 112 97 105 114 52 39 # …) …)
In unknown file:
           1 (port-write #<input-output: file 644> #vu8(60 49 51 39 111 112 58 103 99 45 101 120 112 111 114 116 115 91 50 56 54 43 93 91 49 43 93 62 116 50 57 50 43 62 91 55 39 102 117 108 102 105 108 108 50 39 111 107 93 102 102 62 47 47 49 50 55 46 48 46 48 46 49 58 52 52 48 53 51 93 102 102 62 51 99 55 100 102 52 55 102 54 49 48 62 91 49 48 39 112 97 114 97 109 101 116 101 114 115 60 52 39 112 97 105 114 49 39 110 51 43 62 93 91 53 39 99 97 117 115 101 60 52 39 112 97 105 114 52 39 107 …) …)
In ice-9/boot-9.scm:
  1705:22  0 (raise-exception _ #:continuable? _)

Uncaught exception in task:
In fibers.scm:
    179:8  8 (_)
In goblins/actor-lib/io.scm:
    60:10  7 (_)
    85:15  6 (_ _)
In ice-9/boot-9.scm:
  1784:12  5 (with-exception-handler _ _ #:unwind? _ #:unwind-for-type _)
In goblins/actor-lib/io.scm:
    70:18  4 (run-and-send)
In ice-9/suspendable-ports.scm:
     83:4  3 (write-bytes #<input-output: file 644> #vu8(60 49 51 39 111 112 58 103 99 45 101 120 112 111 114 116 115 91 50 56 54 43 93 91 49 43 93 62 116 50 57 50 43 62 91 55 39 102 117 108 102 105 108 108 50 39 111 107 93 102 102 62 47 47 49 50 55 46 48 46 48 46 49 58 52 52 48 53 51 93 102 102 62 51 99 55 100 102 52 55 102 54 49 48 62 91 49 48 39 112 97 114 97 109 101 116 101 114 115 60 52 39 112 97 105 114 49 39 110 51 43 62 93 91 53 39 99 97 117 115 101 60 52 39 112 97 105 114 52 39 # …) …)
In unknown file:
           2 (port-write #<input-output: file 644> #vu8(60 49 51 39 111 112 58 103 99 45 101 120 112 111 114 116 115 91 50 56 54 43 93 91 49 43 93 62 116 50 57 50 43 62 91 55 39 102 117 108 102 105 108 108 50 39 111 107 93 102 102 62 47 47 49 50 55 46 48 46 48 46 49 58 52 52 48 53 51 93 102 102 62 51 99 55 100 102 52 55 102 54 49 48 62 91 49 48 39 112 97 114 97 109 101 116 101 114 115 60 52 39 112 97 105 114 49 39 110 51 43 62 93 91 53 39 99 97 117 115 101 60 52 39 112 97 105 114 52 39 107 …) …)
In ice-9/boot-9.scm:
  1706:22  1 (raise-exception _ #:continuable? _)
  1705:22  0 (raise-exception _ #:continuable? _)
ice-9/boot-9.scm:1705:22: In procedure raise-exception:
ERROR:
  1. &non-continuable
Error in IO handling wrapped resource #<input-output: file 510>:
#<&compound-exception components: (#<&external-error> #<&origin origin: "fport_write"> #<&message message: "~A"> #<&irritants irritants: ("Broken pipe")> #<&exception-with-kind-and-args kind: system-error args: ("fport_write" "~A" ("Broken pipe") (32))>)>
In ice-9/boot-9.scm:
  1778:15 15 (with-exception-handler #<procedure 7f103397ef30 at ice-9/boot-9.scm:1882:7 (exn)> _ #:unwind? _ #:unwind-for-type _)
In fibers.scm:
   164:13 14 (run-fibers _ #:hz _ #:scheduler _ #:parallelism _ #:cpus _ #:install-suspendable-ports? _ #:drain? _)
     85:4 13 (%run-fibers _ _ _ _)
In fibers/interrupts.scm:
     98:4 12 (with-interrupts/thread-cputime _ _ _ _)
In fibers/scheduler.scm:
   380:26 11 (run-scheduler #<scheduler 7f103257de70 (remote-peers: (7f103257de00))> _)
In ice-9/boot-9.scm:
  1778:15 10 (with-exception-handler #<procedure 7f1017b4b240 at ice-9/boot-9.scm:1882:7 (exn)> _ #:unwind? _ #:unwind-for-type _)
  1784:12  9 (with-exception-handler _ _ #:unwind? _ #:unwind-for-type _)
In fibers/scheduler.scm:
   344:10  8 (next-task)
In fibers.scm:
    179:8  7 (_)
In goblins/actor-lib/io.scm:
    60:10  6 (_)
    85:15  5 (_ _)
In ice-9/boot-9.scm:
  1784:12  4 (with-exception-handler _ _ #:unwind? _ #:unwind-for-type _)
In goblins/actor-lib/io.scm:
    70:18  3 (run-and-send)
In ice-9/suspendable-ports.scm:
     83:4  2 (write-bytes #<input-output: file 510> #vu8(60 49 51 39 111 112 58 103 99 45 97 110 115 119 101 114 115 91 49 55 43 93 62 91 49 43 93 62 116 51 53 52 43 62 91 55 39 102 117 108 102 105 108 108 50 39 111 107 93 102 102 62 51 39 117 114 108 50 57 34 104 116 116 112 58 47 47 49 50 55 46 48 46 48 46 49 58 52 52 48 53 51 47 111 117 116 112 117 116 62 60 52 39 112 97 105 114 53 39 116 111 107 101 110 51 50 34 57 48 49 50 52 97 49 54 57 48 49 100 53 101 48 54 100 54 99 100 53 98 102 …) …)
In unknown file:
           1 (port-write #<input-output: file 510> #vu8(60 49 51 39 111 112 58 103 99 45 97 110 115 119 101 114 115 91 49 55 43 93 62 91 49 43 93 62 116 51 53 52 43 62 91 55 39 102 117 108 102 105 108 108 50 39 111 107 93 102 102 62 51 39 117 114 108 50 57 34 104 116 116 112 58 47 47 49 50 55 46 48 46 48 46 49 58 52 52 48 53 51 47 111 117 116 112 117 116 62 60 52 39 112 97 105 114 53 39 116 111 107 101 110 51 50 34 57 48 49 50 52 97 49 54 57 48 49 100 53 101 48 54 100 54 99 100 53 98 102 # …) …)
In ice-9/boot-9.scm:
  1705:22  0 (raise-exception _ #:continuable? _)

Uncaught exception in task:
In fibers.scm:
    179:8  8 (_)
In goblins/actor-lib/io.scm:
    60:10  7 (_)
    85:15  6 (_ _)
In ice-9/boot-9.scm:
  1784:12  5 (with-exception-handler _ _ #:unwind? _ #:unwind-for-type _)
In goblins/actor-lib/io.scm:
    70:18  4 (run-and-send)
In ice-9/suspendable-ports.scm:
     83:4  3 (write-bytes #<input-output: file 510> #vu8(60 49 51 39 111 112 58 103 99 45 97 110 115 119 101 114 115 91 49 55 43 93 62 91 49 43 93 62 116 51 53 52 43 62 91 55 39 102 117 108 102 105 108 108 50 39 111 107 93 102 102 62 51 39 117 114 108 50 57 34 104 116 116 112 58 47 47 49 50 55 46 48 46 48 46 49 58 52 52 48 53 51 47 111 117 116 112 117 116 62 60 52 39 112 97 105 114 53 39 116 111 107 101 110 51 50 34 57 48 49 50 52 97 49 54 57 48 49 100 53 101 48 54 100 54 99 100 53 98 102 …) …)
In unknown file:
           2 (port-write #<input-output: file 510> #vu8(60 49 51 39 111 112 58 103 99 45 97 110 115 119 101 114 115 91 49 55 43 93 62 91 49 43 93 62 116 51 53 52 43 62 91 55 39 102 117 108 102 105 108 108 50 39 111 107 93 102 102 62 51 39 117 114 108 50 57 34 104 116 116 112 58 47 47 49 50 55 46 48 46 48 46 49 58 52 52 48 53 51 47 111 117 116 112 117 116 62 60 52 39 112 97 105 114 53 39 116 111 107 101 110 51 50 34 57 48 49 50 52 97 49 54 57 48 49 100 53 101 48 54 100 54 99 100 53 98 102 # …) …)
In ice-9/boot-9.scm:
  1706:22  1 (raise-exception _ #:continuable? _)
  1705:22  0 (raise-exception _ #:continuable? _)
ice-9/boot-9.scm:1705:22: In procedure raise-exception:
ERROR:
  1. &non-continuable
GET /events/output/2240281835bc04af/chatty: error replying to client
2026-09-21 07:12:17 (with-exception-handler) INFO: GET /events/output/2240281835bc04af/chatty 200 incomplete

Goblins exception:
In message to #<local-object ^admin>:
  (run tests/gated (run-request (id . "7a54c5ebb8474327") (parameters) (cause . #f) (ancestors)))
ice-9/boot-9.scm:1705:22: In procedure raise-exception:
ERROR:
  1. &automate-error:
      kind: not-attached
      irritants: (tests/gated stale)
  2. &message: "no pipeline process is attached under this name"
  3. &irritants: (tests/gated stale)
In goblins/core.scm:
   1074:7  4 (syscaller-$ _ #<local-object ^admin> (run tests/gated (run-request (id . "7a54c5ebb8474327") (parameters) (cause . #f) (ancestors))))
In automate/pumphouse.scm:
   145:15  3 (request-run! #<<pumphouse> records: #<local-object ^records> lives: #<hash-table 7f1036d7d3a0 11/31> shared: #<hash-table 7f1036d7d380 1/31> gates: #<hash-table 7f1036d7d360 1/31> timers: #<hash-table 7f1036d7d340 1/31> tokens: #<hash-table 7f1036d7d320 90/113> registrations: #<hash-table 7f1036d7d300 1/31> sink: "http://127.0.0.1:44053/output" web: "http://127.0.0.1:44053" publish: #<procedure 7f1036e3eae0 at automate/pumphouse/process.scm:129:2 (object swiss-num)>> tests/gated …)
    107:6  2 (live-of _ _)
In automate/model.scm:
     83:2  1 (raise-automate-error _ _ . _)
In ice-9/boot-9.scm:
  1705:22  0 (raise-exception _ #:continuable? _)

;;; note: auto-compilation is enabled, set GUILE_AUTO_COMPILE=0
;;;       or pass the --no-auto-compile argument to disable.
;;; compiling /home/chris/automate.cbaines.net/guile-automate/checks/workspace/3a135f8edd833cd3/work/source/./tests/run.scm
;;; WARNING: compilation of /home/chris/automate.cbaines.net/guile-automate/checks/workspace/3a135f8edd833cd3/work/source/./tests/run.scm failed:
;;; failed to create path for auto-compiled file "/home/chris/automate.cbaines.net/guile-automate/checks/workspace/3a135f8edd833cd3/work/source/./tests/run.scm"
;;; compiling /home/chris/automate.cbaines.net/guile-automate/checks/workspace/3a135f8edd833cd3/work/source/tests/support.scm
;;; WARNING: compilation of /home/chris/automate.cbaines.net/guile-automate/checks/workspace/3a135f8edd833cd3/work/source/tests/support.scm failed:
;;; failed to create path for auto-compiled file "/home/chris/automate.cbaines.net/guile-automate/checks/workspace/3a135f8edd833cd3/work/source/tests/support.scm"
;;; compiling /home/chris/automate.cbaines.net/guile-automate/checks/workspace/3a135f8edd833cd3/work/source/tests/pumphouse.scm
;;; WARNING: compilation of /home/chris/automate.cbaines.net/guile-automate/checks/workspace/3a135f8edd833cd3/work/source/tests/pumphouse.scm failed:
;;; failed to create path for auto-compiled file "/home/chris/automate.cbaines.net/guile-automate/checks/workspace/3a135f8edd833cd3/work/source/tests/pumphouse.scm"
== pumphouse.scm
  fail: while the daemon stays attached under the name
    expected: live
    actual:   attached
  fail: first unlock is noted
    error:    (timeout approve)
  fail: repeated unlock by the same party is noted
    error:    (timeout approve)
  fail: gate status
    error:    (timeout approve)
  fail: second party approves
    error:    (timeout approve)
  fail: gated run succeeded
    expected: succeeded
    actual:   #f
  fail: the gate's value is the approval
    error:    #<&compound-exception components: (#<&assertion-failure> #<&origin origin: "car"> #<&message message: "Wrong type argument in position 1 (expecting pair): ~S"> #<&irritants irritants: (#f)> #<&exception-with-kind-and-args kind: wrong-type-arg args: ("car" "Wrong type argument in position 1 (expecting pair): ~S" (#f) (#f))>)>
  fail: unlocks are recorded
    error:    #<&compound-exception components: (#<&assertion-failure> #<&origin origin: "car"> #<&message message: "Wrong type argument in position 1 (expecting pair): ~S"> #<&irritants irritants: (#f)> #<&exception-with-kind-and-args kind: wrong-type-arg args: ("car" "Wrong type argument in position 1 (expecting pair): ~S" (#f) (#f))>)>
  fail: gate endpoint is gone after the run
    expected: ()
    actual:   (approve)
  suite died: ERROR:
  1. &mystery-exception
  2. &message: "Unknown error occurred with remote object"
  3. &irritants: ()

stop 862: kill #<unspecified>, waitpid (862 . 9)
stop 717: kill #<unspecified>, waitpid (717 . 256)
stop 708: kill #<unspecified>, waitpid (708 . 9)
FAIL tests/pumphouse.scm (exit status: 1)

============================================================================
Testsuite summary for guile-automate 0.0.0-dev
============================================================================
# TOTAL: 19
# PASS:  17
# SKIP:  0
# XFAIL: 0
# FAIL:  2
# XPASS: 0
# ERROR: 0
============================================================================
See ./test-suite.log for debugging.
============================================================================
make[3]: *** [Makefile:894: test-suite.log] Error 1
make[3]: Leaving directory '/home/chris/automate.cbaines.net/guile-automate/checks/workspace/3a135f8edd833cd3/work/source'
make[2]: *** [Makefile:1029: check-TESTS] Error 2
make[2]: Leaving directory '/home/chris/automate.cbaines.net/guile-automate/checks/workspace/3a135f8edd833cd3/work/source'
make[1]: *** [Makefile:1250: check-am] Error 2
make[1]: Leaving directory '/home/chris/automate.cbaines.net/guile-automate/checks/workspace/3a135f8edd833cd3/work/source'
make: *** [Makefile:780: check-recursive] Error 1
error: #<&invoke-error program: "/gnu/store/1m1yzwgyjlai1bal0w2dfxfma8ajkask-profile/bin/bash" arguments: ("-c" "set -eo pipefail\nexport GUIX_PROFILE=/gnu/store/1m1yzwgyjlai1bal0w2dfxfma8ajkask-profile\nsource \"$GUIX_PROFILE/etc/profile\"\ncd /home/chris/automate.cbaines.net/guile-automate/checks/workspace/3a135f8edd833cd3/work/source\nmake check VERBOSE=1") exit-status: 2 term-signal: #f stop-signal: #f>
backtrace:
  automate/pipeline/step.scm:209:64 (_)
  ice-9/eval.scm:619:8 (_)
  guix/build/utils.scm:822:6 (invoke)