4c2e5799d09af886 / check errored

Defined at .automate/pipelines.scm:151

Making check in .
make[1]: Entering directory '/home/chris/automate.cbaines.net/guile-automate/checks/workspace/4c2e5799d09af886/work/source'
make  check-TESTS
make[2]: Entering directory '/home/chris/automate.cbaines.net/guile-automate/checks/workspace/4c2e5799d09af886/work/source'
make[3]: Entering directory '/home/chris/automate.cbaines.net/guile-automate/checks/workspace/4c2e5799d09af886/work/source'
PASS: tests/check.scm
PASS: tests/contain.scm
PASS: tests/errors.scm
PASS: tests/events.scm
PASS: tests/forgejo.scm
PASS: tests/http.scm
PASS: tests/layout.scm
PASS: tests/masking.scm
PASS: tests/metrics.scm
PASS: tests/pages.scm
PASS: tests/model.scm
PASS: tests/pipeline.scm
FAIL: tests/pumphouse.scm
PASS: tests/records.scm
PASS: tests/scope.scm
PASS: tests/source.scm
PASS: tests/step-scheduling.scm
PASS: tests/uploader.scm
================================================
   guile-automate 0.0.0-dev: ./test-suite.log
================================================

# TOTAL: 18
# PASS:  17
# SKIP:  0
# XFAIL: 0
# FAIL:  1
# XPASS: 0
# ERROR: 0

System information (uname -a): Linux 6.18.13-gnu #1 SMP PREEMPT_DYNAMIC 1 x86_64
Distribution information (/etc/os-release):
NAME="Guix System"
ID=guix
PRETTY_NAME="Guix System"
LOGO=guix-icon
HOME_URL="https://guix.gnu.org"
DOCUMENTATION_URL="https://guix.gnu.org/en/manual"
SUPPORT_URL="https://guix.gnu.org/en/help"
BUG_REPORT_URL="https://lists.gnu.org/mailman/listinfo/bug-guix"

.. contents:: :depth: 2

FAIL: tests/pumphouse
=====================

http on port 46691
pumphouse address: /tmp/automate-pumphouse-U2Fxxh/address
remote registrar: ocapn://dmhpoodqaeomfcah3pzijteccvpeizerikdoxjd2dix6c7wnr3bq.tcp-tls/s/LtCvRbOYSWx_1ifa8B2vgRanVVEgJNZ_fkdeZtIaQqs?port=34267&host=%3A%3A1
remote admin: ocapn://dmhpoodqaeomfcah3pzijteccvpeizerikdoxjd2dix6c7wnr3bq.tcp-tls/s/cNWB64maOgBZVkxGnQIk2erGYrvakBSKDCGG0A5rQCk?port=34267&host=%3A%3A1
warning: steps run unconfined: this command cannot run itself again as guile
attached to pumphouse /tmp/automate-pumphouse-U2Fxxh/address
2026-09-20 20:46:00 (with-exception-handler) INFO: POST /output/5e5e7e3cd07a4f42/tick 200 8ms

Goblins exception:
In message to #<local-object ^admin>:
  (run tests/nothing (run-request (id . "2ec1a69656992da4") (parameters (n . 5)) (cause . #f) (ancestors)))
ice-9/boot-9.scm:1705:22: In procedure raise-exception:
ERROR:
  1. &automate-error:
      kind: not-attached
      irritants: (tests/nothing #f)
  2. &message: "no pipeline process is attached under this name"
  3. &irritants: (tests/nothing #f)
warning: mutating the process environment while multiple threads are running;
         further behavior unspecified.
In goblins/core.scm:
   1074:7  4 (syscaller-$ _ #<local-object ^admin> (run tests/nothing (run-request (id . "2ec1a69656992da4") (parameters (n . 5)) (cause . #f) (ancestors))))
In automate/pumphouse.scm:
   136:15  3 (request-run! #<<pumphouse> records: #<local-object ^records> lives: #<hash-table 7fa52fca66e0 9/31> shared: #<hash-table 7fa52fca66c0 0/31> gates: #<hash-table 7fa52fca66a0 0/31> timers: #<hash-table 7fa52fca6680 1/31> tokens: #<hash-table 7fa52fca64a0 9/31> registrations: #<hash-table 7fa52fca61e0 0/31> sink: "http://127.0.0.1:46691/output" web: "http://127.0.0.1:46691" publish: #<procedure 7fa52fd75ac0 at automate/pumphouse/process.scm:129:2 (object swiss-num)>> tests/nothing #)
     99:6  2 (live-of _ _)
In automate/model.scm:
     83:2  1 (raise-automate-error _ _ . _)
In ice-9/boot-9.scm:
  1705:22  0 (raise-exception _ #:continuable? _)

2026-09-20 20:46:01 (with-exception-handler) INFO: POST /output/ac4f8ef17c51e660/tick 200 30ms
2026-09-20 20:46:01 (with-exception-handler) INFO: POST /output/6372e03cddb0a102/tick 200 2ms
2026-09-20 20:46:01 (with-exception-handler) INFO: POST /output/bf50b83cfbaf4ca4/tick 200 20ms
2026-09-20 20:46:01 (with-exception-handler) INFO: POST /output/505b78f9ffb87849/tick 200 36ms
2026-09-20 20:46:01 (with-exception-handler) INFO: POST /output/52529452d265132c/tick 200 58ms
2026-09-20 20:46:01 (with-exception-handler) INFO: POST /output/2b8fe4c68e446b92/tick 200 13ms
2026-09-20 20:46:01 INFO: dropping a connection that failed to hand shake: #<&compound-exception components: (#<&error> #<&irritants irritants: (#<gnutls-error-enum Error in the pull function.> handshake)> #<&exception-with-kind-and-args kind: gnutls-error args: (#<gnutls-error-enum Error in the pull function.> handshake)>)>
2026-09-20 20:46:01 INFO: dropping a connection that failed to hand shake: #<&compound-exception components: (#<&external-error> #<&origin origin: "fport_write"> #<&message message: "~A"> #<&irritants irritants: ("Broken pipe")> #<&exception-with-kind-and-args kind: system-error args: ("fport_write" "~A" ("Broken pipe") (32))>)>
2026-09-20 20:46:02 INFO: dropping a connection that failed to hand shake: #<&compound-exception components: (#<&error> #<&irritants irritants: (#<gnutls-error-enum Error in the pull function.> handshake)> #<&exception-with-kind-and-args kind: gnutls-error args: (#<gnutls-error-enum Error in the pull function.> handshake)>)>

Goblins exception:
In message to #<local-object ^records>:
  (registration (/) 1789933562)
ice-9/boot-9.scm:1705:22: In procedure raise-exception:
ERROR:
  1. &automate-error:
      kind: invalid-scope
      irritants: ((/))
  2. &message: "not a list of pipeline names and prefixes"
  3. &irritants: ((/))
In goblins/core.scm:
   1074:7  4 (syscaller-$ _ #<local-object ^records> _)
In unknown file:
           3 (_ #<procedure cons (_ _)>)
In automate/pumphouse/scope.scm:
     44:4  2 (datastore-registration! #<<datastore> directory: "/tmp/automate-pumphouse-U2Fxxh" pumphouse: #<<sqlite-db> pointer: #<pointer 0x7fa524001ae8> open?: #t stmts: #<hash-table 7fa52fcf1ae0 17/31>> pipelines: #<hash-table 7fa52fcf1260 9/31>> (/) 1789933562)
In automate/model.scm:
     83:2  1 (raise-automate-error _ _ . _)
In ice-9/boot-9.scm:
  1705:22  0 (raise-exception _ #:continuable? _)

2026-09-20 20:46:02 (with-exception-handler) INFO: POST /output/3ab8dcfeab1c6cb8/tick 200 3ms
2026-09-20 20:46:02 (with-exception-handler) INFO: POST /output/1901aadf3164be7e/tick 200 8ms
2026-09-20 20:46:02 (with-exception-handler) INFO: POST /output/71ce8bc800937ba4/tick 200 1ms
2026-09-20 20:46:02 (with-exception-handler) INFO: POST /output/396f225f39fd6d1c/tick 200 3ms
2026-09-20 20:46:02 (with-exception-handler) INFO: POST /output/00b394ef8ff21378/tick 200 2ms
warning: steps run unconfined: this command cannot run itself again as guile

Goblins exception:
In message to #<local-object ^scoped-registrar>:
  (register tests/nap "/tmp/automate-def-rnT0oI" (structure (version 2) (name tests/nap) (steps ((step (name nap) (label #f) (group #f) (timeout #f) (error-permitted #f) (outputs (value)) (inputs ())))) (resources ()) (params ()) (web-ui-options ())) #<remote-object> "ocapn://2zjgurw2s3zw5bwlgruy65aocb2bdth27lplbm7q2kh4v57gu6eq.tcp-tls/s/6WK-Yx4WdxJ7-oFY_MyvGCwmPxLAcZPVAFr_PVA1Q7s?" ())
ice-9/boot-9.scm:1705:22: In procedure raise-exception:
ERROR:
  1. &automate-error:
      kind: not-permitted
      irritants: (tests/nap (tests/only tests/scoped/))
  2. &message: "this registration does not cover the pipeline"
  3. &irritants: (tests/nap (tests/only tests/scoped/))
In goblins/core.scm:
   1074:7  3 (syscaller-$ _ #<local-object ^scoped-registrar> (register tests/nap "/tmp/automate-def-rnT0oI" (structure (version 2) (name tests/nap) (steps ((step (name nap) (label #f) (group #f) (timeout #f) (error-permitted #f) (outputs (value)) (inputs ())))) (resources ()) (params ()) (web-ui-options ())) #<remote-object> "ocapn://2zjgurw2s3zw5bwlgruy65aocb2bdth27lplbm7q2kh4v57gu6eq.tcp-tls/s/6WK-Yx4WdxJ7-oFY_MyvGCwmPxLAcZPVAFr_PVA1Q7s?" ()))
In automate/pumphouse.scm:
    296:6  2 (register tests/nap "/tmp/automate-def-rnT0oI" (structure (version 2) (name tests/nap) (steps ((step (name nap) (label #f) (group #f) (timeout #f) (error-permitted #f) (outputs (value)) (inputs ())))) (resources ()) (params ()) (web-ui-options ())) #<remote-object> "ocapn://2zjgurw2s3zw5bwlgruy65aocb2bdth27lplbm7q2kh4v57gu6eq.tcp-tls/s/6WK-Yx4WdxJ7-oFY_MyvGCwmPxLAcZPVAFr_PVA1Q7s?" ())
In automate/model.scm:
     83:2  1 (raise-automate-error _ _ . _)
In ice-9/boot-9.scm:
  1705:22  0 (raise-exception _ #:continuable? _)

pumphouse refused tests/nap: Unknown error occurred with remote object
attached to pumphouse ocapn://dmhpoodqaeomfcah3pzijteccvpeizerikdoxjd2dix6c7wnr3bq.tcp-tls/s/CkCAcLhIa0fzdpAMoNohHbPCrBn35vwjEy1jbn7-c3U?port=34267&host=%3A%3A1
2026-09-20 20:46:03 (with-exception-handler) INFO: POST /output/b1324fdcc9a0cb1f/tick 200 9ms
2026-09-20 20:46:03 (with-exception-handler) INFO: POST /output/4754bb200e757c63/tick 200 63ms
2026-09-20 20:46:03 (with-exception-handler) INFO: POST /output/5064b08477f0a72b/tick 200 9ms
2026-09-20 20:46:04 (with-exception-handler) INFO: POST /output/f75ae2e40f5d0665/tick 200 9ms
2026-09-20 20:46:04 (with-exception-handler) INFO: POST /output/91e4b08d94190402/tick 200 4ms
2026-09-20 20:46:05 (with-exception-handler) INFO: POST /output/afbbc7dbcd8dc0b9/tick 200 10ms
2026-09-20 20:46:05 (with-exception-handler) INFO: POST /output/d540045a6cf3b33c/tick 200 81ms
2026-09-20 20:46:05 (with-exception-handler) INFO: POST /output/3db8bd74c56ff2ab/tick 200 54ms
2026-09-20 20:46:05 (with-exception-handler) INFO: POST /output/05353e1e63997fc6/tick 200 34ms
2026-09-20 20:46:05 (with-exception-handler) INFO: POST /output/d5349f756f70d091/tick 200 30ms
2026-09-20 20:46:05 (with-exception-handler) INFO: POST /output/1e78e4540eace9e5/tick 200 5ms
2026-09-20 20:46:06 (with-exception-handler) INFO: POST /output/36d9c4cc2300e29b/tick 200 5ms
2026-09-20 20:46:06 (with-exception-handler) INFO: POST /output/daf4abd61e8711e7/tick 200 7ms
2026-09-20 20:46:06 (with-exception-handler) INFO: POST /output/107386d80c9e5991/tick 200 25ms
2026-09-20 20:46:06 (with-exception-handler) INFO: POST /output/fd8de266045a77a5/tick 200 10ms
2026-09-20 20:46:06 (with-exception-handler) INFO: POST /output/59ff8391db68c37a/tick 200 17ms
Error in IO handling wrapped resource #<input-output: file 49>:
#<&compound-exception components: (#<&external-error> #<&origin origin: "fport_write"> #<&message message: "~A"> #<&irritants irritants: ("Broken pipe")> #<&exception-with-kind-and-args kind: system-error args: ("fport_write" "~A" ("Broken pipe") (32))>)>
In fibers.scm:
     85:4 13 (%run-fibers _ _ _ _)
In fibers/interrupts.scm:
     98:4 12 (with-interrupts/thread-cputime _ _ _ _)
In fibers/scheduler.scm:
   380:26 11 (run-scheduler #<scheduler 7fa52b59de00 (remote-peers: (7fa52b59de70))> _)
In ice-9/boot-9.scm:
  1778:15 10 (with-exception-handler #<procedure 7fa52bd8ee10 at ice-9/boot-9.scm:1882:7 (exn)> _ #:unwind? _ #:unwind-for-type _)
  1784:12  9 (with-exception-handler _ _ #:unwind? _ #:unwind-for-type _)
In fibers/scheduler.scm:
   344:10  8 (next-task)
In fibers.scm:
    179:8  7 (_)
In goblins/actor-lib/io.scm:
    60:10  6 (_)
    85:15  5 (_ _)
In ice-9/boot-9.scm:
  1784:12  4 (with-exception-handler _ _ #:unwind? _ #:unwind-for-type _)
In goblins/actor-lib/io.scm:
    70:18  3 (run-and-send)
In ice-9/suspendable-ports.scm:
     83:4  2 (write-bytes #<input-output: file 49> #vu8(60 49 51 39 111 112 58 103 99 45 101 120 112 111 114 116 115 91 53 56 52 43 93 91 49 43 93 62 116 54 48 56 43 62 91 55 39 102 117 108 102 105 108 108 50 39 111 107 93 102 102 62 115 116 60 52 39 112 97 105 114 50 39 105 100 49 54 34 98 49 102 98 50 55 97 51 48 101 57 48 57 100 56 100 62 91 49 48 39 112 97 114 97 109 101 116 101 114 115 60 52 39 112 97 105 114 49 39 110 51 43 62 93 91 53 39 99 97 117 115 101 60 52 39 112 97 105 114 52 …) …)
In unknown file:
           1 (port-write #<input-output: file 49> #vu8(60 49 51 39 111 112 58 103 99 45 101 120 112 111 114 116 115 91 53 56 52 43 93 91 49 43 93 62 116 54 48 56 43 62 91 55 39 102 117 108 102 105 108 108 50 39 111 107 93 102 102 62 115 116 60 52 39 112 97 105 114 50 39 105 100 49 54 34 98 49 102 98 50 55 97 51 48 101 57 48 57 100 56 100 62 91 49 48 39 112 97 114 97 109 101 116 101 114 115 60 52 39 112 97 105 114 49 39 110 51 43 62 93 91 53 39 99 97 117 115 101 60 52 39 112 97 105 114 52 # …) …)
In ice-9/boot-9.scm:
  1705:22  0 (raise-exception _ #:continuable? _)

Uncaught exception in task:
In fibers.scm:
    179:8  8 (_)
In goblins/actor-lib/io.scm:
    60:10  7 (_)
    85:15  6 (_ _)
In ice-9/boot-9.scm:
  1784:12  5 (with-exception-handler _ _ #:unwind? _ #:unwind-for-type _)
In goblins/actor-lib/io.scm:
    70:18  4 (run-and-send)
In ice-9/suspendable-ports.scm:
     83:4  3 (write-bytes #<input-output: file 49> #vu8(60 49 51 39 111 112 58 103 99 45 101 120 112 111 114 116 115 91 53 56 52 43 93 91 49 43 93 62 116 54 48 56 43 62 91 55 39 102 117 108 102 105 108 108 50 39 111 107 93 102 102 62 115 116 60 52 39 112 97 105 114 50 39 105 100 49 54 34 98 49 102 98 50 55 97 51 48 101 57 48 57 100 56 100 62 91 49 48 39 112 97 114 97 109 101 116 101 114 115 60 52 39 112 97 105 114 49 39 110 51 43 62 93 91 53 39 99 97 117 115 101 60 52 39 112 97 105 114 52 …) …)
In unknown file:
           2 (port-write #<input-output: file 49> #vu8(60 49 51 39 111 112 58 103 99 45 101 120 112 111 114 116 115 91 53 56 52 43 93 91 49 43 93 62 116 54 48 56 43 62 91 55 39 102 117 108 102 105 108 108 50 39 111 107 93 102 102 62 115 116 60 52 39 112 97 105 114 50 39 105 100 49 54 34 98 49 102 98 50 55 97 51 48 101 57 48 57 100 56 100 62 91 49 48 39 112 97 114 97 109 101 116 101 114 115 60 52 39 112 97 105 114 49 39 110 51 43 62 93 91 53 39 99 97 117 115 101 60 52 39 112 97 105 114 52 # …) …)
In ice-9/boot-9.scm:
  1706:22  1 (raise-exception _ #:continuable? _)
  1705:22  0 (raise-exception _ #:continuable? _)
ice-9/boot-9.scm:1705:22: In procedure raise-exception:
ERROR:
  1. &non-continuable
Error in IO handling wrapped resource #<input-output: file 49>:
#<&compound-exception components: (#<&external-error> #<&origin origin: "fport_read"> #<&message message: "~A"> #<&irritants irritants: ("Connection reset by peer")> #<&exception-with-kind-and-args kind: system-error args: ("fport_read" "~A" ("Connection reset by peer") (104))>)>
In ice-9/boot-9.scm:
  1778:15 19 (with-exception-handler #<procedure 7fa52c98ff30 at ice-9/boot-9.scm:1882:7 (exn)> _ #:unwind? _ #:unwind-for-type _)
In fibers.scm:
   164:13 18 (run-fibers _ #:hz _ #:scheduler _ #:parallelism _ #:cpus _ #:install-suspendable-ports? _ #:drain? _)
     85:4 17 (%run-fibers _ _ _ _)
In fibers/interrupts.scm:
     98:4 16 (with-interrupts/thread-cputime _ _ _ _)
In fibers/scheduler.scm:
   380:26 15 (run-scheduler #<scheduler 7fa52b59de70 (remote-peers: (7fa52b59de00))> _)
In ice-9/boot-9.scm:
  1778:15 14 (with-exception-handler #<procedure 7fa52bd85660 at ice-9/boot-9.scm:1882:7 (exn)> _ #:unwind? _ #:unwind-for-type _)
  1784:12 13 (with-exception-handler _ _ #:unwind? _ #:unwind-for-type _)
In fibers/scheduler.scm:
   344:10 12 (next-task)
In fibers.scm:
    179:8 11 (_)
In goblins/actor-lib/io.scm:
    60:10 10 (_)
    85:15  9 (_ _)
In ice-9/boot-9.scm:
  1784:12  8 (with-exception-handler _ _ #:unwind? _ #:unwind-for-type _)
In goblins/actor-lib/io.scm:
    70:18  7 (run-and-send)
In ice-9/control.scm:
    91:24  6 (call-with-escape-continuation _)
In goblins/contrib/syrup.scm:
    306:7  5 (read-next)
In ice-9/suspendable-ports.scm:
    558:2  4 (peek-char _)
   184:27  3 (fill-input #<input-output: file 49> _ _)
     72:4  2 (read-bytes #<input-output: file 49> #vu8(60 49 48 39 111 112 58 100 101 108 105 118 101 114 60 49 49 39 100 101 115 99 58 101 120 112 111 114 116 49 48 43 62 91 53 39 101 118 101 110 116 49 54 34 98 49 102 98 50 55 97 51 48 101 57 48 57 100 56 100 48 43 91 55 39 115 116 97 114 116 101 100 52 39 116 105 99 107 93 93 54 48 49 43 60 49 56 39 100 101 115 99 58 105 109 112 111 114 116 45 111 98 106 101 99 116 54 49 49 43 62 62 60 49 48 39 111 112 58 100 101 108 105 118 101 114 60 …) …)
In unknown file:
           1 (port-read #<input-output: file 49> #vu8(60 49 48 39 111 112 58 100 101 108 105 118 101 114 60 49 49 39 100 101 115 99 58 101 120 112 111 114 116 49 48 43 62 91 53 39 101 118 101 110 116 49 54 34 98 49 102 98 50 55 97 51 48 101 57 48 57 100 56 100 48 43 91 55 39 115 116 97 114 116 101 100 52 39 116 105 99 107 93 93 54 48 49 43 60 49 56 39 100 101 115 99 58 105 109 112 111 114 116 45 111 98 106 101 99 116 54 49 49 43 62 62 60 49 48 39 111 112 58 100 101 108 105 118 101 114 60 # …) …)
In ice-9/boot-9.scm:
  1705:22  0 (raise-exception _ #:continuable? _)

Uncaught exception in task:
In fibers.scm:
    179:8 12 (_)
In goblins/actor-lib/io.scm:
    60:10 11 (_)
    85:15 10 (_ _)
In ice-9/boot-9.scm:
  1784:12  9 (with-exception-handler _ _ #:unwind? _ #:unwind-for-type _)
In goblins/actor-lib/io.scm:
    70:18  8 (run-and-send)
In ice-9/control.scm:
    91:24  7 (call-with-escape-continuation _)
In goblins/contrib/syrup.scm:
    306:7  6 (read-next)
In ice-9/suspendable-ports.scm:
    558:2  5 (peek-char _)
   184:27  4 (fill-input #<input-output: file 49> _ _)
     72:4  3 (read-bytes #<input-output: file 49> #vu8(60 49 48 39 111 112 58 100 101 108 105 118 101 114 60 49 49 39 100 101 115 99 58 101 120 112 111 114 116 49 48 43 62 91 53 39 101 118 101 110 116 49 54 34 98 49 102 98 50 55 97 51 48 101 57 48 57 100 56 100 48 43 91 55 39 115 116 97 114 116 101 100 52 39 116 105 99 107 93 93 54 48 49 43 60 49 56 39 100 101 115 99 58 105 109 112 111 114 116 45 111 98 106 101 99 116 54 49 49 43 62 62 60 49 48 39 111 112 58 100 101 108 105 118 101 114 60 …) …)
In unknown file:
           2 (port-read #<input-output: file 49> #vu8(60 49 48 39 111 112 58 100 101 108 105 118 101 114 60 49 49 39 100 101 115 99 58 101 120 112 111 114 116 49 48 43 62 91 53 39 101 118 101 110 116 49 54 34 98 49 102 98 50 55 97 51 48 101 57 48 57 100 56 100 48 43 91 55 39 115 116 97 114 116 101 100 52 39 116 105 99 107 93 93 54 48 49 43 60 49 56 39 100 101 115 99 58 105 109 112 111 114 116 45 111 98 106 101 99 116 54 49 49 43 62 62 60 49 48 39 111 112 58 100 101 108 105 118 101 114 60 # …) …)
In ice-9/boot-9.scm:
  1706:22  1 (raise-exception _ #:continuable? _)
  1705:22  0 (raise-exception _ #:continuable? _)
ice-9/boot-9.scm:1705:22: In procedure raise-exception:
ERROR:
  1. &non-continuable
== pumphouse.scm
  fail: limited run succeeded
    expected: succeeded
    actual:   #f
  suite died: In procedure car: Wrong type argument in position 1 (expecting pair): #f

stop 9682: kill #<unspecified>, waitpid (9682 . 9)
stop 9526: kill #<unspecified>, waitpid (9526 . 13)
stop 9517: kill #<unspecified>, waitpid (9517 . 9)
;;; note: auto-compilation is enabled, set GUILE_AUTO_COMPILE=0
;;;       or pass the --no-auto-compile argument to disable.
;;; compiling /home/chris/automate.cbaines.net/guile-automate/checks/workspace/4c2e5799d09af886/work/source/./tests/run.scm
;;; WARNING: compilation of /home/chris/automate.cbaines.net/guile-automate/checks/workspace/4c2e5799d09af886/work/source/./tests/run.scm failed:
;;; failed to create path for auto-compiled file "/home/chris/automate.cbaines.net/guile-automate/checks/workspace/4c2e5799d09af886/work/source/./tests/run.scm"
;;; compiling /home/chris/automate.cbaines.net/guile-automate/checks/workspace/4c2e5799d09af886/work/source/tests/support.scm
;;; WARNING: compilation of /home/chris/automate.cbaines.net/guile-automate/checks/workspace/4c2e5799d09af886/work/source/tests/support.scm failed:
;;; failed to create path for auto-compiled file "/home/chris/automate.cbaines.net/guile-automate/checks/workspace/4c2e5799d09af886/work/source/tests/support.scm"
;;; compiling /home/chris/automate.cbaines.net/guile-automate/checks/workspace/4c2e5799d09af886/work/source/tests/pumphouse.scm
;;; WARNING: compilation of /home/chris/automate.cbaines.net/guile-automate/checks/workspace/4c2e5799d09af886/work/source/tests/pumphouse.scm failed:
;;; failed to create path for auto-compiled file "/home/chris/automate.cbaines.net/guile-automate/checks/workspace/4c2e5799d09af886/work/source/tests/pumphouse.scm"
FAIL tests/pumphouse.scm (exit status: 1)

============================================================================
Testsuite summary for guile-automate 0.0.0-dev
============================================================================
# TOTAL: 18
# PASS:  17
# SKIP:  0
# XFAIL: 0
# FAIL:  1
# XPASS: 0
# ERROR: 0
============================================================================
See ./test-suite.log for debugging.
============================================================================
make[3]: *** [Makefile:892: test-suite.log] Error 1
make[3]: Leaving directory '/home/chris/automate.cbaines.net/guile-automate/checks/workspace/4c2e5799d09af886/work/source'
make[2]: *** [Makefile:1027: check-TESTS] Error 2
make[2]: Leaving directory '/home/chris/automate.cbaines.net/guile-automate/checks/workspace/4c2e5799d09af886/work/source'
make[1]: *** [Makefile:1248: check-am] Error 2
make[1]: Leaving directory '/home/chris/automate.cbaines.net/guile-automate/checks/workspace/4c2e5799d09af886/work/source'
make: *** [Makefile:778: check-recursive] Error 1
error: #<&invoke-error program: "/gnu/store/jsrbz9xvhjag4nxfj999fnd22jwlpgr2-profile/bin/bash" arguments: ("-c" "set -eo pipefail\nexport GUIX_PROFILE=/gnu/store/jsrbz9xvhjag4nxfj999fnd22jwlpgr2-profile\nsource \"$GUIX_PROFILE/etc/profile\"\ncd /home/chris/automate.cbaines.net/guile-automate/checks/workspace/4c2e5799d09af886/work/source\nmake check VERBOSE=1") exit-status: 2 term-signal: #f stop-signal: #f>