52d31537ee842d0c / lower errored
- Started
- Duration
- 5m 10s
Defined at .automate/pipelines.scm:192
guix repl: warning: 'nix-protocol-error?' is deprecated, use 'store-protocol-error?' instead guix repl: warning: 'nix-protocol-error-message' is deprecated, use 'store-protocol-error-message' instead substitute: substitute: [Klooking for substitutes on 'https://bordeaux.guix.gnu.org'... 0.0% substitute: [Klooking for substitutes on 'https://bordeaux.guix.gnu.org'... 100.0% substitute: substitute: [Klooking for substitutes on 'https://ci.guix.gnu.org'... 0.0% substitute: [Klooking for substitutes on 'https://ci.guix.gnu.org'... 100.0% building path(s) `/gnu/store/j9h7qdlzcvz7jfyb3ybmn8260n132xpj-guile-automate-0.0.0-dev' starting phase `separate-from-pid1' build process now running as PID 4 phase `separate-from-pid1' succeeded after 0.0 seconds starting phase `set-SOURCE-DATE-EPOCH' phase `set-SOURCE-DATE-EPOCH' succeeded after 0.0 seconds starting phase `set-paths' environment variable `PATH' set to `/gnu/store/k7vkw9x3wl3lni6a0i2w8xz2z8ylrqyz-guile-3.0.11/bin:/gnu/store/8lbxqsdjb6h32npjf1xg0vfs4a14j3c3-autoconf-2.69/bin:/gnu/store/pq8iw7w4ii30cy8kd5zwmxib36ziwccn-automake-1.17/bin:/gnu/store/vrwsp65rnf487x907m16033yx9x585dc-make-4.4.1/bin:/gnu/store/2862nsy960k83ci9k4jdmvwp100q07gs-pkg-config-0.29.2/bin:/gnu/store/wp75a72a13s2x1dk4d2vc4m4ma9gaxyx-texinfo-7.3/bin:/gnu/store/r5gafvw9iapq6173liw37bzxj40bslhs-guile-documenta-0.4.0/bin:/gnu/store/hia0r9nnmqaxjwlgwjay50a3x43scrci-bash-minimal-5.2.37/bin:/gnu/store/k83f6pby77lzbilg4gdv99s63ib5jr44-coreutils-9.1/bin:/gnu/store/p2h7xqh23qsjlbapadpmfzxibxqfahpc-tar-1.35/bin:/gnu/store/gsr333qygwvf1zjdsc413hs07pd3ygwc-gzip-1.14/bin:/gnu/store/jwp4z6flb9hqfjwvvbkzij7b893j382y-bzip2-1.0.8/bin:/gnu/store/gziyc8kh2wd5gq3ah8vjvpr73my4cgam-xz-5.4.5/bin:/gnu/store/7a6l3fzjvr3nvbnw579wdkhhszzzh3ql-guix-1.5.0-6.64d4de2/bin:/gnu/store/fp4rjwzvrm309wg11jahx8qcm7ypkai3-guile-ares-rs-0.9.8/bin:/gnu/store/hfx188ymz9y9ialr175lqifn3b6xfdnz-shepherd-1.0.9/bin:/gnu/store/hfx188ymz9y9ialr175lqifn3b6xfdnz-shepherd-1.0.9/sbin' environment variable `GUILE_LOAD_PATH' set to `/gnu/store/r5gafvw9iapq6173liw37bzxj40bslhs-guile-documenta-0.4.0/share/guile/site/3.0:/gnu/store/qzml053shmjml5vj6rbcfss5247h20f6-guile-syntax-highlight-0.3.1/share/guile/site/3.0:/gnu/store/7a6l3fzjvr3nvbnw579wdkhhszzzh3ql-guix-1.5.0-6.64d4de2/share/guile/site/3.0:/gnu/store/zplkplr3qmp5dpvhcxpgqr1lg44wmxyk-guile-goblins-0.18.0/share/guile/site/3.0:/gnu/store/5la7a0imnji190xnfmxf0jrsp82dn9hq-guile-fibers-1.4.3/share/guile/site/3.0:/gnu/store/z4fnbwa7d6dprqvd7f89wcifq6ggr2wm-guile-gcrypt-0.5.0/share/guile/site/3.0:/gnu/store/b9928rpaj24whj9cz36yd1h28w7pwphq-guile-gnutls-5.0.2/share/guile/site/3.0:/gnu/store/nw7d5iijwm9sa16k2swxjalgp0vlm01v-guile-json-4.7.3/share/guile/site/3.0:/gnu/store/gyf1hm3gzbq00aw3m9x1xickf3zs3pq8-guile-knots-0.1-39.3417d25/share/guile/site/3.0:/gnu/store/wsg7chjw2cg6xnp4il5caff5w0w69ikc-guile-sqlite3-0.1.3/share/guile/site/3.0:/gnu/store/8n90dzhz177l1lz8bjrxsgbiyh1kmjap-guile-zlib-0.2.2/share/guile/site/3.0:/gnu/store/2qm9a3n19pnznv791jvglb4sgh1jda3s-guile-safsaf-0.5-1.8b35410/share/guile/site/3.0:/gnu/store/9ia4lplmfhpdxnnkvk0zyhyainyn0r0q-guile-prometheus-0-11.8f70b4b/share/guile/site/3.0:/gnu/store/fp4rjwzvrm309wg11jahx8qcm7ypkai3-guile-ares-rs-0.9.8/share/guile/site/3.0:/gnu/store/hfx188ymz9y9ialr175lqifn3b6xfdnz-shepherd-1.0.9/share/guile/site/3.0:/gnu/store/x9ypa71lzv9jrd5n0qxq51hxnra83z2x-guile-lib-0.2.8.1/share/guile/site/3.0:/gnu/store/9rd4c5w765bmsx0cimk0idpfasicvcdr-guile-config-0.5.1/share/guile/site/3.0:/gnu/store/lsys62yw1wnmchmvv3q5x7bzkghyasil-guile-zstd-0.1.1/share/guile/site/3.0:/gnu/store/gq36qbm22984252qxrzrgvrqzx807kd0-guile-lzlib-0.4.0/share/guile/site/3.0:/gnu/store/axcsnac5kji5p4apyf67jqgpbvs47hcm-guile-git-0.12.1/share/guile/site/3.0:/gnu/store/3xl1r2ppwspvhrlv4rzdcw3izhnvlkzm-guile-ssh-1.0.0/share/guile/site/3.0:/gnu/store/dkzraln87ih1cbl36npg9fgyfqnmpqhh-guile-semver-0.2.0/share/guile/site/3.0:/gnu/store/06k0pq8d20w6f3ymkgdwkm6k6rf2v7yj-guile-lib-0.2.8.1/share/guile/site/3.0:/gnu/store/gl031z5csmpkyvicv8q4a3wjjgl5gqbi-guile-avahi-0.4.1/share/guile/site/3.0:/gnu/store/k1yhnx32pjwr409ag3l25816ylasvzrf-guile-websocket-0.3.0/share/guile/site/3.0:/gnu/store/c7k95lcd985bph7kycpjcwsbw0ky0yw1-guile-bstructs-0.2.0/share/guile/site/3.0:/gnu/store/a7k8b77qmv34vjbw5gkgm160zph4lxlg-guile-webutils-0.1-1.d309d65/share/guile/site/3.0:/gnu/store/cjnz2ikdas5ih7x2gs95fgi9q6f376gk-guile-bytestructures-2.0.2/share/guile/site/3.0:/gnu/store/kwd8v8nwvw00d6akyr58d5bjqjcmfy5d-guile-irregex-0.9.12/share/guile/site/3.0' environment variable `GUILE_LOAD_COMPILED_PATH' set to `/gnu/store/r5gafvw9iapq6173liw37bzxj40bslhs-guile-documenta-0.4.0/lib/guile/3.0/site-ccache:/gnu/store/r5gafvw9iapq6173liw37bzxj40bslhs-guile-documenta-0.4.0/share/guile/site/3.0:/gnu/store/qzml053shmjml5vj6rbcfss5247h20f6-guile-syntax-highlight-0.3.1/lib/guile/3.0/site-ccache:/gnu/store/qzml053shmjml5vj6rbcfss5247h20f6-guile-syntax-highlight-0.3.1/share/guile/site/3.0:/gnu/store/7a6l3fzjvr3nvbnw579wdkhhszzzh3ql-guix-1.5.0-6.64d4de2/lib/guile/3.0/site-ccache:/gnu/store/7a6l3fzjvr3nvbnw579wdkhhszzzh3ql-guix-1.5.0-6.64d4de2/share/guile/site/3.0:/gnu/store/zplkplr3qmp5dpvhcxpgqr1lg44wmxyk-guile-goblins-0.18.0/lib/guile/3.0/site-ccache:/gnu/store/zplkplr3qmp5dpvhcxpgqr1lg44wmxyk-guile-goblins-0.18.0/share/guile/site/3.0:/gnu/store/5la7a0imnji190xnfmxf0jrsp82dn9hq-guile-fibers-1.4.3/lib/guile/3.0/site-ccache:/gnu/store/5la7a0imnji190xnfmxf0jrsp82dn9hq-guile-fibers-1.4.3/share/guile/site/3.0:/gnu/store/z4fnbwa7d6dprqvd7f89wcifq6ggr2wm-guile-gcrypt-0.5.0/lib/guile/3.0/site-ccache:/gnu/store/z4fnbwa7d6dprqvd7f89wcifq6ggr2wm-guile-gcrypt-0.5.0/share/guile/site/3.0:/gnu/store/b9928rpaj24whj9cz36yd1h28w7pwphq-guile-gnutls-5.0.2/lib/guile/3.0/site-ccache:/gnu/store/b9928rpaj24whj9cz36yd1h28w7pwphq-guile-gnutls-5.0.2/share/guile/site/3.0:/gnu/store/nw7d5iijwm9sa16k2swxjalgp0vlm01v-guile-json-4.7.3/lib/guile/3.0/site-ccache:/gnu/store/nw7d5iijwm9sa16k2swxjalgp0vlm01v-guile-json-4.7.3/share/guile/site/3.0:/gnu/store/gyf1hm3gzbq00aw3m9x1xickf3zs3pq8-guile-knots-0.1-39.3417d25/lib/guile/3.0/site-ccache:/gnu/store/gyf1hm3gzbq00aw3m9x1xickf3zs3pq8-guile-knots-0.1-39.3417d25/share/guile/site/3.0:/gnu/store/wsg7chjw2cg6xnp4il5caff5w0w69ikc-guile-sqlite3-0.1.3/lib/guile/3.0/site-ccache:/gnu/store/wsg7chjw2cg6xnp4il5caff5w0w69ikc-guile-sqlite3-0.1.3/share/guile/site/3.0:/gnu/store/8n90dzhz177l1lz8bjrxsgbiyh1kmjap-guile-zlib-0.2.2/lib/guile/3.0/site-ccache:/gnu/store/8n90dzhz177l1lz8bjrxsgbiyh1kmjap-guile-zlib-0.2.2/share/guile/site/3.0:/gnu/store/2qm9a3n19pnznv791jvglb4sgh1jda3s-guile-safsaf-0.5-1.8b35410/lib/guile/3.0/site-ccache:/gnu/store/2qm9a3n19pnznv791jvglb4sgh1jda3s-guile-safsaf-0.5-1.8b35410/share/guile/site/3.0:/gnu/store/9ia4lplmfhpdxnnkvk0zyhyainyn0r0q-guile-prometheus-0-11.8f70b4b/lib/guile/3.0/site-ccache:/gnu/store/9ia4lplmfhpdxnnkvk0zyhyainyn0r0q-guile-prometheus-0-11.8f70b4b/share/guile/site/3.0:/gnu/store/fp4rjwzvrm309wg11jahx8qcm7ypkai3-guile-ares-rs-0.9.8/lib/guile/3.0/site-ccache:/gnu/store/fp4rjwzvrm309wg11jahx8qcm7ypkai3-guile-ares-rs-0.9.8/share/guile/site/3.0:/gnu/store/hfx188ymz9y9ialr175lqifn3b6xfdnz-shepherd-1.0.9/lib/guile/3.0/site-ccache:/gnu/store/hfx188ymz9y9ialr175lqifn3b6xfdnz-shepherd-1.0.9/share/guile/site/3.0:/gnu/store/x9ypa71lzv9jrd5n0qxq51hxnra83z2x-guile-lib-0.2.8.1/lib/guile/3.0/site-ccache:/gnu/store/x9ypa71lzv9jrd5n0qxq51hxnra83z2x-guile-lib-0.2.8.1/share/guile/site/3.0:/gnu/store/9rd4c5w765bmsx0cimk0idpfasicvcdr-guile-config-0.5.1/lib/guile/3.0/site-ccache:/gnu/store/9rd4c5w765bmsx0cimk0idpfasicvcdr-guile-config-0.5.1/share/guile/site/3.0:/gnu/store/lsys62yw1wnmchmvv3q5x7bzkghyasil-guile-zstd-0.1.1/lib/guile/3.0/site-ccache:/gnu/store/lsys62yw1wnmchmvv3q5x7bzkghyasil-guile-zstd-0.1.1/share/guile/site/3.0:/gnu/store/gq36qbm22984252qxrzrgvrqzx807kd0-guile-lzlib-0.4.0/lib/guile/3.0/site-ccache:/gnu/store/gq36qbm22984252qxrzrgvrqzx807kd0-guile-lzlib-0.4.0/share/guile/site/3.0:/gnu/store/axcsnac5kji5p4apyf67jqgpbvs47hcm-guile-git-0.12.1/lib/guile/3.0/site-ccache:/gnu/store/axcsnac5kji5p4apyf67jqgpbvs47hcm-guile-git-0.12.1/share/guile/site/3.0:/gnu/store/3xl1r2ppwspvhrlv4rzdcw3izhnvlkzm-guile-ssh-1.0.0/lib/guile/3.0/site-ccache:/gnu/store/3xl1r2ppwspvhrlv4rzdcw3izhnvlkzm-guile-ssh-1.0.0/share/guile/site/3.0:/gnu/store/dkzraln87ih1cbl36npg9fgyfqnmpqhh-guile-semver-0.2.0/lib/guile/3.0/site-ccache:/gnu/store/dkzraln87ih1cbl36npg9fgyfqnmpqhh-guile-semver-0.2.0/share/guile/site/3.0:/gnu/store/06k0pq8d20w6f3ymkgdwkm6k6rf2v7yj-guile-lib-0.2.8.1/lib/guile/3.0/site-ccache:/gnu/store/06k0pq8d20w6f3ymkgdwkm6k6rf2v7yj-guile-lib-0.2.8.1/share/guile/site/3.0:/gnu/store/gl031z5csmpkyvicv8q4a3wjjgl5gqbi-guile-avahi-0.4.1/lib/guile/3.0/site-ccache:/gnu/store/gl031z5csmpkyvicv8q4a3wjjgl5gqbi-guile-avahi-0.4.1/share/guile/site/3.0:/gnu/store/k1yhnx32pjwr409ag3l25816ylasvzrf-guile-websocket-0.3.0/lib/guile/3.0/site-ccache:/gnu/store/k1yhnx32pjwr409ag3l25816ylasvzrf-guile-websocket-0.3.0/share/guile/site/3.0:/gnu/store/c7k95lcd985bph7kycpjcwsbw0ky0yw1-guile-bstructs-0.2.0/lib/guile/3.0/site-ccache:/gnu/store/c7k95lcd985bph7kycpjcwsbw0ky0yw1-guile-bstructs-0.2.0/share/guile/site/3.0:/gnu/store/a7k8b77qmv34vjbw5gkgm160zph4lxlg-guile-webutils-0.1-1.d309d65/share/guile/site/3.0:/gnu/store/cjnz2ikdas5ih7x2gs95fgi9q6f376gk-guile-bytestructures-2.0.2/lib/guile/3.0/site-ccache:/gnu/store/cjnz2ikdas5ih7x2gs95fgi9q6f376gk-guile-bytestructures-2.0.2/share/guile/site/3.0:/gnu/store/kwd8v8nwvw00d6akyr58d5bjqjcmfy5d-guile-irregex-0.9.12/lib/guile/3.0/site-ccache:/gnu/store/kwd8v8nwvw00d6akyr58d5bjqjcmfy5d-guile-irregex-0.9.12/share/guile/site/3.0' environment variable `GUILE_EXTENSIONS_PATH' set to `/gnu/store/5la7a0imnji190xnfmxf0jrsp82dn9hq-guile-fibers-1.4.3/lib/guile/3.0/extensions:/gnu/store/b9928rpaj24whj9cz36yd1h28w7pwphq-guile-gnutls-5.0.2/lib/guile/3.0/extensions:/gnu/store/gl031z5csmpkyvicv8q4a3wjjgl5gqbi-guile-avahi-0.4.1/lib/guile/3.0/extensions' environment variable `ACLOCAL_PATH' set to `/gnu/store/k7vkw9x3wl3lni6a0i2w8xz2z8ylrqyz-guile-3.0.11/share/aclocal:/gnu/store/pq8iw7w4ii30cy8kd5zwmxib36ziwccn-automake-1.17/share/aclocal:/gnu/store/2862nsy960k83ci9k4jdmvwp100q07gs-pkg-config-0.29.2/share/aclocal' environment variable `PKG_CONFIG_PATH' set to `/gnu/store/k7vkw9x3wl3lni6a0i2w8xz2z8ylrqyz-guile-3.0.11/lib/pkgconfig:/gnu/store/gziyc8kh2wd5gq3ah8vjvpr73my4cgam-xz-5.4.5/lib/pkgconfig:/gnu/store/ykhx0hclxjg59l43dlhq0iivc785g1cf-libgc-8.2.8/lib/pkgconfig:/gnu/store/x9ypa71lzv9jrd5n0qxq51hxnra83z2x-guile-lib-0.2.8.1/lib/pkgconfig:/gnu/store/06k0pq8d20w6f3ymkgdwkm6k6rf2v7yj-guile-lib-0.2.8.1/lib/pkgconfig' environment variable `INFOPATH' set to `/gnu/store/k7vkw9x3wl3lni6a0i2w8xz2z8ylrqyz-guile-3.0.11/share/info:/gnu/store/8lbxqsdjb6h32npjf1xg0vfs4a14j3c3-autoconf-2.69/share/info:/gnu/store/pq8iw7w4ii30cy8kd5zwmxib36ziwccn-automake-1.17/share/info:/gnu/store/vrwsp65rnf487x907m16033yx9x585dc-make-4.4.1/share/info:/gnu/store/wp75a72a13s2x1dk4d2vc4m4ma9gaxyx-texinfo-7.3/share/info:/gnu/store/hia0r9nnmqaxjwlgwjay50a3x43scrci-bash-minimal-5.2.37/share/info:/gnu/store/k83f6pby77lzbilg4gdv99s63ib5jr44-coreutils-9.1/share/info:/gnu/store/p2h7xqh23qsjlbapadpmfzxibxqfahpc-tar-1.35/share/info:/gnu/store/gsr333qygwvf1zjdsc413hs07pd3ygwc-gzip-1.14/share/info:/gnu/store/7a6l3fzjvr3nvbnw579wdkhhszzzh3ql-guix-1.5.0-6.64d4de2/share/info:/gnu/store/zplkplr3qmp5dpvhcxpgqr1lg44wmxyk-guile-goblins-0.18.0/share/info:/gnu/store/5la7a0imnji190xnfmxf0jrsp82dn9hq-guile-fibers-1.4.3/share/info:/gnu/store/z4fnbwa7d6dprqvd7f89wcifq6ggr2wm-guile-gcrypt-0.5.0/share/info:/gnu/store/b9928rpaj24whj9cz36yd1h28w7pwphq-guile-gnutls-5.0.2/share/info:/gnu/store/2qm9a3n19pnznv791jvglb4sgh1jda3s-guile-safsaf-0.5-1.8b35410/share/info:/gnu/store/hfx188ymz9y9ialr175lqifn3b6xfdnz-shepherd-1.0.9/share/info:/gnu/store/81gcnknln3563vx75kw8fx27lgcd57xr-libunistring-1.3/share/info:/gnu/store/x9ypa71lzv9jrd5n0qxq51hxnra83z2x-guile-lib-0.2.8.1/share/info:/gnu/store/9rd4c5w765bmsx0cimk0idpfasicvcdr-guile-config-0.5.1/share/info:/gnu/store/axcsnac5kji5p4apyf67jqgpbvs47hcm-guile-git-0.12.1/share/info:/gnu/store/3xl1r2ppwspvhrlv4rzdcw3izhnvlkzm-guile-ssh-1.0.0/share/info:/gnu/store/06k0pq8d20w6f3ymkgdwkm6k6rf2v7yj-guile-lib-0.2.8.1/share/info:/gnu/store/gl031z5csmpkyvicv8q4a3wjjgl5gqbi-guile-avahi-0.4.1/share/info:/gnu/store/c7k95lcd985bph7kycpjcwsbw0ky0yw1-guile-bstructs-0.2.0/share/info' environment variable `BASH_LOADABLES_PATH' unset environment variable `GUIX_EXTENSIONS_PATH' unset environment variable `SSL_CERT_DIR' unset phase `set-paths' succeeded after 0.0 seconds starting phase `set-locale-path' phase `set-locale-path' succeeded after 0.0 seconds starting phase `install-locale' using 'C.UTF-8' locale for category "LC_ALL" phase `install-locale' succeeded after 0.0 seconds sh: warning: setlocale: LC_ALL: cannot change locale (C.UTF-8): No such file or directory starting phase `unpack' `/gnu/store/4j3mz5rxhl62khk7r3xbkxfhxi4w4rcj-guile-automate-checkout/COPYING' -> `./COPYING' `/gnu/store/4j3mz5rxhl62khk7r3xbkxfhxi4w4rcj-guile-automate-checkout/CLAUDE.md' -> `./CLAUDE.md' `/gnu/store/4j3mz5rxhl62khk7r3xbkxfhxi4w4rcj-guile-automate-checkout/.dir-locals.el' -> `./.dir-locals.el' `/gnu/store/4j3mz5rxhl62khk7r3xbkxfhxi4w4rcj-guile-automate-checkout/manifest.scm' -> `./manifest.scm' `/gnu/store/4j3mz5rxhl62khk7r3xbkxfhxi4w4rcj-guile-automate-checkout/automate.scm' -> `./automate.scm' `/gnu/store/4j3mz5rxhl62khk7r3xbkxfhxi4w4rcj-guile-automate-checkout/STYLE.md' -> `./STYLE.md' `/gnu/store/4j3mz5rxhl62khk7r3xbkxfhxi4w4rcj-guile-automate-checkout/DESIGN.md' -> `./DESIGN.md' `/gnu/store/4j3mz5rxhl62khk7r3xbkxfhxi4w4rcj-guile-automate-checkout/.envrc' -> `./.envrc' `/gnu/store/4j3mz5rxhl62khk7r3xbkxfhxi4w4rcj-guile-automate-checkout/guix.scm' -> `./guix.scm' `/gnu/store/4j3mz5rxhl62khk7r3xbkxfhxi4w4rcj-guile-automate-checkout/README.md' -> `./README.md' `/gnu/store/4j3mz5rxhl62khk7r3xbkxfhxi4w4rcj-guile-automate-checkout/.guix-channel' -> `./.guix-channel' `/gnu/store/4j3mz5rxhl62khk7r3xbkxfhxi4w4rcj-guile-automate-checkout/automate/pumphouse.scm' -> `./automate/pumphouse.scm' `/gnu/store/4j3mz5rxhl62khk7r3xbkxfhxi4w4rcj-guile-automate-checkout/automate/source.scm' -> `./automate/source.scm' `/gnu/store/4j3mz5rxhl62khk7r3xbkxfhxi4w4rcj-guile-automate-checkout/automate/config.scm' -> `./automate/config.scm' `/gnu/store/4j3mz5rxhl62khk7r3xbkxfhxi4w4rcj-guile-automate-checkout/automate/resources.scm' -> `./automate/resources.scm' `/gnu/store/4j3mz5rxhl62khk7r3xbkxfhxi4w4rcj-guile-automate-checkout/automate/model.scm' -> `./automate/model.scm' `/gnu/store/4j3mz5rxhl62khk7r3xbkxfhxi4w4rcj-guile-automate-checkout/automate/structure.scm' -> `./automate/structure.scm' `/gnu/store/4j3mz5rxhl62khk7r3xbkxfhxi4w4rcj-guile-automate-checkout/automate/pipeline.scm' -> `./automate/pipeline.scm' `/gnu/store/4j3mz5rxhl62khk7r3xbkxfhxi4w4rcj-guile-automate-checkout/automate/command-line.scm' -> `./automate/command-line.scm' `/gnu/store/4j3mz5rxhl62khk7r3xbkxfhxi4w4rcj-guile-automate-checkout/automate/shepherd/pipeline-shepherd.scm' -> `./automate/shepherd/pipeline-shepherd.scm' `/gnu/store/4j3mz5rxhl62khk7r3xbkxfhxi4w4rcj-guile-automate-checkout/automate/shepherd/bridge.scm' -> `./automate/shepherd/bridge.scm' `/gnu/store/4j3mz5rxhl62khk7r3xbkxfhxi4w4rcj-guile-automate-checkout/automate/shepherd/services.scm' -> `./automate/shepherd/services.scm' `/gnu/store/4j3mz5rxhl62khk7r3xbkxfhxi4w4rcj-guile-automate-checkout/automate/shepherd/herd.scm' -> `./automate/shepherd/herd.scm' `/gnu/store/4j3mz5rxhl62khk7r3xbkxfhxi4w4rcj-guile-automate-checkout/automate/resources/file-output.scm' -> `./automate/resources/file-output.scm' `/gnu/store/4j3mz5rxhl62khk7r3xbkxfhxi4w4rcj-guile-automate-checkout/automate/resources/limiter.scm' -> `./automate/resources/limiter.scm' `/gnu/store/4j3mz5rxhl62khk7r3xbkxfhxi4w4rcj-guile-automate-checkout/automate/resources/guix-daemon.scm' -> `./automate/resources/guix-daemon.scm' `/gnu/store/4j3mz5rxhl62khk7r3xbkxfhxi4w4rcj-guile-automate-checkout/automate/resources/materialise.scm' -> `./automate/resources/materialise.scm' `/gnu/store/4j3mz5rxhl62khk7r3xbkxfhxi4w4rcj-guile-automate-checkout/automate/resources/gate.scm' -> `./automate/resources/gate.scm' `/gnu/store/4j3mz5rxhl62khk7r3xbkxfhxi4w4rcj-guile-automate-checkout/automate/resources/shepherd.scm' -> `./automate/resources/shepherd.scm' `/gnu/store/4j3mz5rxhl62khk7r3xbkxfhxi4w4rcj-guile-automate-checkout/automate/utils/files.scm' -> `./automate/utils/files.scm' `/gnu/store/4j3mz5rxhl62khk7r3xbkxfhxi4w4rcj-guile-automate-checkout/automate/utils/sqlite.scm' -> `./automate/utils/sqlite.scm' `/gnu/store/4j3mz5rxhl62khk7r3xbkxfhxi4w4rcj-guile-automate-checkout/automate/utils/sockets.scm' -> `./automate/utils/sockets.scm' `/gnu/store/4j3mz5rxhl62khk7r3xbkxfhxi4w4rcj-guile-automate-checkout/automate/utils/goblins.scm' -> `./automate/utils/goblins.scm' `/gnu/store/4j3mz5rxhl62khk7r3xbkxfhxi4w4rcj-guile-automate-checkout/automate/utils/processes.scm' -> `./automate/utils/processes.scm' `/gnu/store/4j3mz5rxhl62khk7r3xbkxfhxi4w4rcj-guile-automate-checkout/automate/utils/options.scm' -> `./automate/utils/options.scm' `/gnu/store/4j3mz5rxhl62khk7r3xbkxfhxi4w4rcj-guile-automate-checkout/automate/utils/tcp-tls-netlayer.scm' -> `./automate/utils/tcp-tls-netlayer.scm' `/gnu/store/4j3mz5rxhl62khk7r3xbkxfhxi4w4rcj-guile-automate-checkout/automate/pipeline/one-shot.scm' -> `./automate/pipeline/one-shot.scm' `/gnu/store/4j3mz5rxhl62khk7r3xbkxfhxi4w4rcj-guile-automate-checkout/automate/pipeline/repl-client.scm' -> `./automate/pipeline/repl-client.scm' `/gnu/store/4j3mz5rxhl62khk7r3xbkxfhxi4w4rcj-guile-automate-checkout/automate/pipeline/step-scheduling.scm' -> `./automate/pipeline/step-scheduling.scm' `/gnu/store/4j3mz5rxhl62khk7r3xbkxfhxi4w4rcj-guile-automate-checkout/automate/pipeline/uploader.scm' -> `./automate/pipeline/uploader.scm' `/gnu/store/4j3mz5rxhl62khk7r3xbkxfhxi4w4rcj-guile-automate-checkout/automate/pipeline/masking.scm' -> `./automate/pipeline/masking.scm' `/gnu/store/4j3mz5rxhl62khk7r3xbkxfhxi4w4rcj-guile-automate-checkout/automate/pipeline/repl.scm' -> `./automate/pipeline/repl.scm' `/gnu/store/4j3mz5rxhl62khk7r3xbkxfhxi4w4rcj-guile-automate-checkout/automate/pipeline/lower.scm' -> `./automate/pipeline/lower.scm' `/gnu/store/4j3mz5rxhl62khk7r3xbkxfhxi4w4rcj-guile-automate-checkout/automate/pipeline/output-marks.scm' -> `./automate/pipeline/output-marks.scm' `/gnu/store/4j3mz5rxhl62khk7r3xbkxfhxi4w4rcj-guile-automate-checkout/automate/pipeline/step.scm' -> `./automate/pipeline/step.scm' `/gnu/store/4j3mz5rxhl62khk7r3xbkxfhxi4w4rcj-guile-automate-checkout/automate/pipeline/run-request.scm' -> `./automate/pipeline/run-request.scm' `/gnu/store/4j3mz5rxhl62khk7r3xbkxfhxi4w4rcj-guile-automate-checkout/automate/pipeline/confinement.scm' -> `./automate/pipeline/confinement.scm' `/gnu/store/4j3mz5rxhl62khk7r3xbkxfhxi4w4rcj-guile-automate-checkout/automate/pipeline/daemon.scm' -> `./automate/pipeline/daemon.scm' `/gnu/store/4j3mz5rxhl62khk7r3xbkxfhxi4w4rcj-guile-automate-checkout/automate/pipeline/attach.scm' -> `./automate/pipeline/attach.scm' `/gnu/store/4j3mz5rxhl62khk7r3xbkxfhxi4w4rcj-guile-automate-checkout/automate/pipeline/nrepl.scm' -> `./automate/pipeline/nrepl.scm' `/gnu/store/4j3mz5rxhl62khk7r3xbkxfhxi4w4rcj-guile-automate-checkout/automate/pipeline/errors.scm' -> `./automate/pipeline/errors.scm' `/gnu/store/4j3mz5rxhl62khk7r3xbkxfhxi4w4rcj-guile-automate-checkout/automate/pipeline/contain.scm' -> `./automate/pipeline/contain.scm' `/gnu/store/4j3mz5rxhl62khk7r3xbkxfhxi4w4rcj-guile-automate-checkout/automate/helpers/git.scm' -> `./automate/helpers/git.scm' `/gnu/store/4j3mz5rxhl62khk7r3xbkxfhxi4w4rcj-guile-automate-checkout/automate/helpers/notify.scm' -> `./automate/helpers/notify.scm' `/gnu/store/4j3mz5rxhl62khk7r3xbkxfhxi4w4rcj-guile-automate-checkout/automate/helpers/secrets.scm' -> `./automate/helpers/secrets.scm' `/gnu/store/4j3mz5rxhl62khk7r3xbkxfhxi4w4rcj-guile-automate-checkout/automate/helpers/definitions.scm' -> `./automate/helpers/definitions.scm' `/gnu/store/4j3mz5rxhl62khk7r3xbkxfhxi4w4rcj-guile-automate-checkout/automate/helpers/profiles.scm' -> `./automate/helpers/profiles.scm' `/gnu/store/4j3mz5rxhl62khk7r3xbkxfhxi4w4rcj-guile-automate-checkout/automate/helpers/guix.scm' -> `./automate/helpers/guix.scm' `/gnu/store/4j3mz5rxhl62khk7r3xbkxfhxi4w4rcj-guile-automate-checkout/automate/pumphouse/live.scm' -> `./automate/pumphouse/live.scm' `/gnu/store/4j3mz5rxhl62khk7r3xbkxfhxi4w4rcj-guile-automate-checkout/automate/pumphouse/datastore.scm' -> `./automate/pumphouse/datastore.scm' `/gnu/store/4j3mz5rxhl62khk7r3xbkxfhxi4w4rcj-guile-automate-checkout/automate/pumphouse/hub.scm' -> `./automate/pumphouse/hub.scm' `/gnu/store/4j3mz5rxhl62khk7r3xbkxfhxi4w4rcj-guile-automate-checkout/automate/pumphouse/run-query.scm' -> `./automate/pumphouse/run-query.scm' `/gnu/store/4j3mz5rxhl62khk7r3xbkxfhxi4w4rcj-guile-automate-checkout/automate/pumphouse/client.scm' -> `./automate/pumphouse/client.scm' `/gnu/store/4j3mz5rxhl62khk7r3xbkxfhxi4w4rcj-guile-automate-checkout/automate/pumphouse/attachments.scm' -> `./automate/pumphouse/attachments.scm' `/gnu/store/4j3mz5rxhl62khk7r3xbkxfhxi4w4rcj-guile-automate-checkout/automate/pumphouse/schema.scm' -> `./automate/pumphouse/schema.scm' `/gnu/store/4j3mz5rxhl62khk7r3xbkxfhxi4w4rcj-guile-automate-checkout/automate/pumphouse/http.scm' -> `./automate/pumphouse/http.scm' `/gnu/store/4j3mz5rxhl62khk7r3xbkxfhxi4w4rcj-guile-automate-checkout/automate/pumphouse/records.scm' -> `./automate/pumphouse/records.scm' `/gnu/store/4j3mz5rxhl62khk7r3xbkxfhxi4w4rcj-guile-automate-checkout/automate/pumphouse/metrics.scm' -> `./automate/pumphouse/metrics.scm' `/gnu/store/4j3mz5rxhl62khk7r3xbkxfhxi4w4rcj-guile-automate-checkout/automate/pumphouse/process.scm' -> `./automate/pumphouse/process.scm' `/gnu/store/4j3mz5rxhl62khk7r3xbkxfhxi4w4rcj-guile-automate-checkout/automate/pumphouse/scope.scm' -> `./automate/pumphouse/scope.scm' `/gnu/store/4j3mz5rxhl62khk7r3xbkxfhxi4w4rcj-guile-automate-checkout/automate/pumphouse/web/pages.scm' -> `./automate/pumphouse/web/pages.scm' `/gnu/store/4j3mz5rxhl62khk7r3xbkxfhxi4w4rcj-guile-automate-checkout/automate/pumphouse/web/output.scm' -> `./automate/pumphouse/web/output.scm' `/gnu/store/4j3mz5rxhl62khk7r3xbkxfhxi4w4rcj-guile-automate-checkout/automate/pumphouse/web/layout.scm' -> `./automate/pumphouse/web/layout.scm' `/gnu/store/4j3mz5rxhl62khk7r3xbkxfhxi4w4rcj-guile-automate-checkout/automate/pumphouse/web/diagram.scm' -> `./automate/pumphouse/web/diagram.scm' `/gnu/store/4j3mz5rxhl62khk7r3xbkxfhxi4w4rcj-guile-automate-checkout/automate/pumphouse/web/events.scm' -> `./automate/pumphouse/web/events.scm' `/gnu/store/4j3mz5rxhl62khk7r3xbkxfhxi4w4rcj-guile-automate-checkout/automate/pumphouse/web/static/live.js' -> `./automate/pumphouse/web/static/live.js' `/gnu/store/4j3mz5rxhl62khk7r3xbkxfhxi4w4rcj-guile-automate-checkout/automate/pumphouse/web/static/theme.js' -> `./automate/pumphouse/web/static/theme.js' `/gnu/store/4j3mz5rxhl62khk7r3xbkxfhxi4w4rcj-guile-automate-checkout/automate/pumphouse/web/static/logo.svg' -> `./automate/pumphouse/web/static/logo.svg' `/gnu/store/4j3mz5rxhl62khk7r3xbkxfhxi4w4rcj-guile-automate-checkout/automate/pumphouse/web/static/style.css' -> `./automate/pumphouse/web/static/style.css' `/gnu/store/4j3mz5rxhl62khk7r3xbkxfhxi4w4rcj-guile-automate-checkout/automate/forge/forgejo.scm' -> `./automate/forge/forgejo.scm' `/gnu/store/4j3mz5rxhl62khk7r3xbkxfhxi4w4rcj-guile-automate-checkout/automate/forge/webhook.scm' -> `./automate/forge/webhook.scm' `/gnu/store/4j3mz5rxhl62khk7r3xbkxfhxi4w4rcj-guile-automate-checkout/examples/pipeline-shepherd.scm' -> `./examples/pipeline-shepherd.scm' `/gnu/store/4j3mz5rxhl62khk7r3xbkxfhxi4w4rcj-guile-automate-checkout/examples/pumphouse.scm' -> `./examples/pumphouse.scm' `/gnu/store/4j3mz5rxhl62khk7r3xbkxfhxi4w4rcj-guile-automate-checkout/examples/linked.scm' -> `./examples/linked.scm' `/gnu/store/4j3mz5rxhl62khk7r3xbkxfhxi4w4rcj-guile-automate-checkout/examples/pipeline-daemon.scm' -> `./examples/pipeline-daemon.scm' `/gnu/store/4j3mz5rxhl62khk7r3xbkxfhxi4w4rcj-guile-automate-checkout/examples/channels.scm' -> `./examples/channels.scm' `/gnu/store/4j3mz5rxhl62khk7r3xbkxfhxi4w4rcj-guile-automate-checkout/examples/slow.scm' -> `./examples/slow.scm' `/gnu/store/4j3mz5rxhl62khk7r3xbkxfhxi4w4rcj-guile-automate-checkout/examples/hello.scm' -> `./examples/hello.scm' `/gnu/store/4j3mz5rxhl62khk7r3xbkxfhxi4w4rcj-guile-automate-checkout/examples/shepherd-bridge.scm' -> `./examples/shepherd-bridge.scm' `/gnu/store/4j3mz5rxhl62khk7r3xbkxfhxi4w4rcj-guile-automate-checkout/channel/guile-automate/package.scm' -> `./channel/guile-automate/package.scm' `/gnu/store/4j3mz5rxhl62khk7r3xbkxfhxi4w4rcj-guile-automate-checkout/tests/run.scm' -> `./tests/run.scm' `/gnu/store/4j3mz5rxhl62khk7r3xbkxfhxi4w4rcj-guile-automate-checkout/tests/pipeline-shepherd.scm' -> `./tests/pipeline-shepherd.scm' `/gnu/store/4j3mz5rxhl62khk7r3xbkxfhxi4w4rcj-guile-automate-checkout/tests/step-scheduling.scm' -> `./tests/step-scheduling.scm' `/gnu/store/4j3mz5rxhl62khk7r3xbkxfhxi4w4rcj-guile-automate-checkout/tests/pages.scm' -> `./tests/pages.scm' `/gnu/store/4j3mz5rxhl62khk7r3xbkxfhxi4w4rcj-guile-automate-checkout/tests/files.scm' -> `./tests/files.scm' `/gnu/store/4j3mz5rxhl62khk7r3xbkxfhxi4w4rcj-guile-automate-checkout/tests/uploader.scm' -> `./tests/uploader.scm' `/gnu/store/4j3mz5rxhl62khk7r3xbkxfhxi4w4rcj-guile-automate-checkout/tests/masking.scm' -> `./tests/masking.scm' `/gnu/store/4j3mz5rxhl62khk7r3xbkxfhxi4w4rcj-guile-automate-checkout/tests/pumphouse-lost.scm' -> `./tests/pumphouse-lost.scm' `/gnu/store/4j3mz5rxhl62khk7r3xbkxfhxi4w4rcj-guile-automate-checkout/tests/pumphouse.scm' -> `./tests/pumphouse.scm' `/gnu/store/4j3mz5rxhl62khk7r3xbkxfhxi4w4rcj-guile-automate-checkout/tests/repl.scm' -> `./tests/repl.scm' `/gnu/store/4j3mz5rxhl62khk7r3xbkxfhxi4w4rcj-guile-automate-checkout/tests/support.scm' -> `./tests/support.scm' `/gnu/store/4j3mz5rxhl62khk7r3xbkxfhxi4w4rcj-guile-automate-checkout/tests/authority.scm' -> `./tests/authority.scm' `/gnu/store/4j3mz5rxhl62khk7r3xbkxfhxi4w4rcj-guile-automate-checkout/tests/source.scm' -> `./tests/source.scm' `/gnu/store/4j3mz5rxhl62khk7r3xbkxfhxi4w4rcj-guile-automate-checkout/tests/layout.scm' -> `./tests/layout.scm' `/gnu/store/4j3mz5rxhl62khk7r3xbkxfhxi4w4rcj-guile-automate-checkout/tests/pumphouse-timers.scm' -> `./tests/pumphouse-timers.scm' `/gnu/store/4j3mz5rxhl62khk7r3xbkxfhxi4w4rcj-guile-automate-checkout/tests/output-marks.scm' -> `./tests/output-marks.scm' `/gnu/store/4j3mz5rxhl62khk7r3xbkxfhxi4w4rcj-guile-automate-checkout/tests/pumphouse-replay.scm' -> `./tests/pumphouse-replay.scm' `/gnu/store/4j3mz5rxhl62khk7r3xbkxfhxi4w4rcj-guile-automate-checkout/tests/notify.scm' -> `./tests/notify.scm' `/gnu/store/4j3mz5rxhl62khk7r3xbkxfhxi4w4rcj-guile-automate-checkout/tests/pumphouse-shepherd.scm' -> `./tests/pumphouse-shepherd.scm' `/gnu/store/4j3mz5rxhl62khk7r3xbkxfhxi4w4rcj-guile-automate-checkout/tests/run-query.scm' -> `./tests/run-query.scm' `/gnu/store/4j3mz5rxhl62khk7r3xbkxfhxi4w4rcj-guile-automate-checkout/tests/processes.scm' -> `./tests/processes.scm' `/gnu/store/4j3mz5rxhl62khk7r3xbkxfhxi4w4rcj-guile-automate-checkout/tests/http.scm' -> `./tests/http.scm' `/gnu/store/4j3mz5rxhl62khk7r3xbkxfhxi4w4rcj-guile-automate-checkout/tests/model.scm' -> `./tests/model.scm' `/gnu/store/4j3mz5rxhl62khk7r3xbkxfhxi4w4rcj-guile-automate-checkout/tests/records.scm' -> `./tests/records.scm' `/gnu/store/4j3mz5rxhl62khk7r3xbkxfhxi4w4rcj-guile-automate-checkout/tests/metrics.scm' -> `./tests/metrics.scm' `/gnu/store/4j3mz5rxhl62khk7r3xbkxfhxi4w4rcj-guile-automate-checkout/tests/forgejo.scm' -> `./tests/forgejo.scm' `/gnu/store/4j3mz5rxhl62khk7r3xbkxfhxi4w4rcj-guile-automate-checkout/tests/attach.scm' -> `./tests/attach.scm' `/gnu/store/4j3mz5rxhl62khk7r3xbkxfhxi4w4rcj-guile-automate-checkout/tests/pipeline.scm' -> `./tests/pipeline.scm' `/gnu/store/4j3mz5rxhl62khk7r3xbkxfhxi4w4rcj-guile-automate-checkout/tests/scope.scm' -> `./tests/scope.scm' `/gnu/store/4j3mz5rxhl62khk7r3xbkxfhxi4w4rcj-guile-automate-checkout/tests/pumphouse-draining.scm' -> `./tests/pumphouse-draining.scm' `/gnu/store/4j3mz5rxhl62khk7r3xbkxfhxi4w4rcj-guile-automate-checkout/tests/pumphouse-restart.scm' -> `./tests/pumphouse-restart.scm' `/gnu/store/4j3mz5rxhl62khk7r3xbkxfhxi4w4rcj-guile-automate-checkout/tests/check.scm' -> `./tests/check.scm' `/gnu/store/4j3mz5rxhl62khk7r3xbkxfhxi4w4rcj-guile-automate-checkout/tests/relay.scm' -> `./tests/relay.scm' `/gnu/store/4j3mz5rxhl62khk7r3xbkxfhxi4w4rcj-guile-automate-checkout/tests/shepherd-bridge.scm' -> `./tests/shepherd-bridge.scm' `/gnu/store/4j3mz5rxhl62khk7r3xbkxfhxi4w4rcj-guile-automate-checkout/tests/errors.scm' -> `./tests/errors.scm' `/gnu/store/4j3mz5rxhl62khk7r3xbkxfhxi4w4rcj-guile-automate-checkout/tests/events.scm' -> `./tests/events.scm' `/gnu/store/4j3mz5rxhl62khk7r3xbkxfhxi4w4rcj-guile-automate-checkout/tests/pumphouse-stopping.scm' -> `./tests/pumphouse-stopping.scm' `/gnu/store/4j3mz5rxhl62khk7r3xbkxfhxi4w4rcj-guile-automate-checkout/tests/reconnect.scm' -> `./tests/reconnect.scm' `/gnu/store/4j3mz5rxhl62khk7r3xbkxfhxi4w4rcj-guile-automate-checkout/tests/contain.scm' -> `./tests/contain.scm' `/gnu/store/4j3mz5rxhl62khk7r3xbkxfhxi4w4rcj-guile-automate-checkout/tests/integration/lowering.scm' -> `./tests/integration/lowering.scm' `/gnu/store/4j3mz5rxhl62khk7r3xbkxfhxi4w4rcj-guile-automate-checkout/tests/steps/step.scm' -> `./tests/steps/step.scm' `/gnu/store/4j3mz5rxhl62khk7r3xbkxfhxi4w4rcj-guile-automate-checkout/tests/steps/contain.scm' -> `./tests/steps/contain.scm' `/gnu/store/4j3mz5rxhl62khk7r3xbkxfhxi4w4rcj-guile-automate-checkout/tests/pumphouse/support.scm' -> `./tests/pumphouse/support.scm' phase `unpack' succeeded after 0.0 seconds sh: warning: setlocale: LC_ALL: cannot change locale (C.UTF-8): No such file or directory starting phase `patch-usr-bin-file' phase `patch-usr-bin-file' succeeded after 0.0 seconds sh: warning: setlocale: LC_ALL: cannot change locale (C.UTF-8): No such file or directory starting phase `patch-source-shebangs' phase `patch-source-shebangs' succeeded after 0.0 seconds sh: warning: setlocale: LC_ALL: cannot change locale (C.UTF-8): No such file or directory starting phase `patch-generated-file-shebangs' phase `patch-generated-file-shebangs' succeeded after 0.0 seconds sh: warning: setlocale: LC_ALL: cannot change locale (C.UTF-8): No such file or directory starting phase `build' Compiling with Guile 3.0... compile flags: ("-Wunbound-variable" "-Warity-mismatch" "-Wformat") wrote `/gnu/store/j9h7qdlzcvz7jfyb3ybmn8260n132xpj-guile-automate-0.0.0-dev/lib/guile/3.0/site-ccache/./automate/command-line.go' [ 1/65] Compiling... wrote `/gnu/store/j9h7qdlzcvz7jfyb3ybmn8260n132xpj-guile-automate-0.0.0-dev/lib/guile/3.0/site-ccache/./automate/config.go' [ 2/65] Compiling... wrote `/gnu/store/j9h7qdlzcvz7jfyb3ybmn8260n132xpj-guile-automate-0.0.0-dev/lib/guile/3.0/site-ccache/./automate/forge/forgejo.go' [ 3/65] Compiling... wrote `/gnu/store/j9h7qdlzcvz7jfyb3ybmn8260n132xpj-guile-automate-0.0.0-dev/lib/guile/3.0/site-ccache/./automate/forge/webhook.go' [ 4/65] Compiling... wrote `/gnu/store/j9h7qdlzcvz7jfyb3ybmn8260n132xpj-guile-automate-0.0.0-dev/lib/guile/3.0/site-ccache/./automate/helpers/definitions.go' [ 5/65] Compiling... wrote `/gnu/store/j9h7qdlzcvz7jfyb3ybmn8260n132xpj-guile-automate-0.0.0-dev/lib/guile/3.0/site-ccache/./automate/helpers/git.go' [ 6/65] Compiling... wrote `/gnu/store/j9h7qdlzcvz7jfyb3ybmn8260n132xpj-guile-automate-0.0.0-dev/lib/guile/3.0/site-ccache/./automate/helpers/notify.go' [ 7/65] Compiling... wrote `/gnu/store/j9h7qdlzcvz7jfyb3ybmn8260n132xpj-guile-automate-0.0.0-dev/lib/guile/3.0/site-ccache/./automate/helpers/profiles.go' [ 8/65] Compiling... wrote `/gnu/store/j9h7qdlzcvz7jfyb3ybmn8260n132xpj-guile-automate-0.0.0-dev/lib/guile/3.0/site-ccache/./automate/helpers/secrets.go' [ 9/65] Compiling... wrote `/gnu/store/j9h7qdlzcvz7jfyb3ybmn8260n132xpj-guile-automate-0.0.0-dev/lib/guile/3.0/site-ccache/./automate/model.go' [10/65] Compiling... wrote `/gnu/store/j9h7qdlzcvz7jfyb3ybmn8260n132xpj-guile-automate-0.0.0-dev/lib/guile/3.0/site-ccache/./automate/pipeline.go' [11/65] Compiling... wrote `/gnu/store/j9h7qdlzcvz7jfyb3ybmn8260n132xpj-guile-automate-0.0.0-dev/lib/guile/3.0/site-ccache/./automate/pipeline/attach.go' [12/65] Compiling... wrote `/gnu/store/j9h7qdlzcvz7jfyb3ybmn8260n132xpj-guile-automate-0.0.0-dev/lib/guile/3.0/site-ccache/./automate/pipeline/confinement.go' [13/65] Compiling... wrote `/gnu/store/j9h7qdlzcvz7jfyb3ybmn8260n132xpj-guile-automate-0.0.0-dev/lib/guile/3.0/site-ccache/./automate/pipeline/contain.go' [14/65] Compiling... wrote `/gnu/store/j9h7qdlzcvz7jfyb3ybmn8260n132xpj-guile-automate-0.0.0-dev/lib/guile/3.0/site-ccache/./automate/pipeline/daemon.go' [15/65] Compiling... wrote `/gnu/store/j9h7qdlzcvz7jfyb3ybmn8260n132xpj-guile-automate-0.0.0-dev/lib/guile/3.0/site-ccache/./automate/pipeline/errors.go' [16/65] Compiling... wrote `/gnu/store/j9h7qdlzcvz7jfyb3ybmn8260n132xpj-guile-automate-0.0.0-dev/lib/guile/3.0/site-ccache/./automate/pipeline/masking.go' [17/65] Compiling... wrote `/gnu/store/j9h7qdlzcvz7jfyb3ybmn8260n132xpj-guile-automate-0.0.0-dev/lib/guile/3.0/site-ccache/./automate/pipeline/nrepl.go' [18/65] Compiling... wrote `/gnu/store/j9h7qdlzcvz7jfyb3ybmn8260n132xpj-guile-automate-0.0.0-dev/lib/guile/3.0/site-ccache/./automate/pipeline/one-shot.go' [19/65] Compiling... wrote `/gnu/store/j9h7qdlzcvz7jfyb3ybmn8260n132xpj-guile-automate-0.0.0-dev/lib/guile/3.0/site-ccache/./automate/pipeline/output-marks.go' [20/65] Compiling... wrote `/gnu/store/j9h7qdlzcvz7jfyb3ybmn8260n132xpj-guile-automate-0.0.0-dev/lib/guile/3.0/site-ccache/./automate/pipeline/repl-client.go' [21/65] Compiling... wrote `/gnu/store/j9h7qdlzcvz7jfyb3ybmn8260n132xpj-guile-automate-0.0.0-dev/lib/guile/3.0/site-ccache/./automate/pipeline/repl.go' [22/65] Compiling... wrote `/gnu/store/j9h7qdlzcvz7jfyb3ybmn8260n132xpj-guile-automate-0.0.0-dev/lib/guile/3.0/site-ccache/./automate/pipeline/run-request.go' [23/65] Compiling... wrote `/gnu/store/j9h7qdlzcvz7jfyb3ybmn8260n132xpj-guile-automate-0.0.0-dev/lib/guile/3.0/site-ccache/./automate/pipeline/step-scheduling.go' [24/65] Compiling... wrote `/gnu/store/j9h7qdlzcvz7jfyb3ybmn8260n132xpj-guile-automate-0.0.0-dev/lib/guile/3.0/site-ccache/./automate/pipeline/step.go' [25/65] Compiling... wrote `/gnu/store/j9h7qdlzcvz7jfyb3ybmn8260n132xpj-guile-automate-0.0.0-dev/lib/guile/3.0/site-ccache/./automate/pipeline/uploader.go' [26/65] Compiling... wrote `/gnu/store/j9h7qdlzcvz7jfyb3ybmn8260n132xpj-guile-automate-0.0.0-dev/lib/guile/3.0/site-ccache/./automate/pumphouse.go' [27/65] Compiling... wrote `/gnu/store/j9h7qdlzcvz7jfyb3ybmn8260n132xpj-guile-automate-0.0.0-dev/lib/guile/3.0/site-ccache/./automate/pumphouse/attachments.go' [28/65] Compiling... wrote `/gnu/store/j9h7qdlzcvz7jfyb3ybmn8260n132xpj-guile-automate-0.0.0-dev/lib/guile/3.0/site-ccache/./automate/pumphouse/client.go' [29/65] Compiling... wrote `/gnu/store/j9h7qdlzcvz7jfyb3ybmn8260n132xpj-guile-automate-0.0.0-dev/lib/guile/3.0/site-ccache/./automate/pumphouse/datastore.go' [30/65] Compiling... automate/pumphouse/http.scm:236:36: warning: "no answer from ~a in ~a ~\\nseconds": unsupported format option ~ , use (ice-9 format) instead wrote `/gnu/store/j9h7qdlzcvz7jfyb3ybmn8260n132xpj-guile-automate-0.0.0-dev/lib/guile/3.0/site-ccache/./automate/pumphouse/http.go' [31/65] Compiling... wrote `/gnu/store/j9h7qdlzcvz7jfyb3ybmn8260n132xpj-guile-automate-0.0.0-dev/lib/guile/3.0/site-ccache/./automate/pumphouse/hub.go' [32/65] Compiling... wrote `/gnu/store/j9h7qdlzcvz7jfyb3ybmn8260n132xpj-guile-automate-0.0.0-dev/lib/guile/3.0/site-ccache/./automate/pumphouse/live.go' [33/65] Compiling... wrote `/gnu/store/j9h7qdlzcvz7jfyb3ybmn8260n132xpj-guile-automate-0.0.0-dev/lib/guile/3.0/site-ccache/./automate/pumphouse/metrics.go' [34/65] Compiling... wrote `/gnu/store/j9h7qdlzcvz7jfyb3ybmn8260n132xpj-guile-automate-0.0.0-dev/lib/guile/3.0/site-ccache/./automate/pumphouse/process.go' [35/65] Compiling... wrote `/gnu/store/j9h7qdlzcvz7jfyb3ybmn8260n132xpj-guile-automate-0.0.0-dev/lib/guile/3.0/site-ccache/./automate/pumphouse/records.go' [36/65] Compiling... wrote `/gnu/store/j9h7qdlzcvz7jfyb3ybmn8260n132xpj-guile-automate-0.0.0-dev/lib/guile/3.0/site-ccache/./automate/pumphouse/run-query.go' [37/65] Compiling... wrote `/gnu/store/j9h7qdlzcvz7jfyb3ybmn8260n132xpj-guile-automate-0.0.0-dev/lib/guile/3.0/site-ccache/./automate/pumphouse/schema.go' [38/65] Compiling... wrote `/gnu/store/j9h7qdlzcvz7jfyb3ybmn8260n132xpj-guile-automate-0.0.0-dev/lib/guile/3.0/site-ccache/./automate/pumphouse/scope.go' [39/65] Compiling... wrote `/gnu/store/j9h7qdlzcvz7jfyb3ybmn8260n132xpj-guile-automate-0.0.0-dev/lib/guile/3.0/site-ccache/./automate/pumphouse/web/diagram.go' [40/65] Compiling... wrote `/gnu/store/j9h7qdlzcvz7jfyb3ybmn8260n132xpj-guile-automate-0.0.0-dev/lib/guile/3.0/site-ccache/./automate/pumphouse/web/events.go' [41/65] Compiling... wrote `/gnu/store/j9h7qdlzcvz7jfyb3ybmn8260n132xpj-guile-automate-0.0.0-dev/lib/guile/3.0/site-ccache/./automate/pumphouse/web/layout.go' [42/65] Compiling... wrote `/gnu/store/j9h7qdlzcvz7jfyb3ybmn8260n132xpj-guile-automate-0.0.0-dev/lib/guile/3.0/site-ccache/./automate/pumphouse/web/output.go' [43/65] Compiling... wrote `/gnu/store/j9h7qdlzcvz7jfyb3ybmn8260n132xpj-guile-automate-0.0.0-dev/lib/guile/3.0/site-ccache/./automate/pumphouse/web/pages.go' [44/65] Compiling... wrote `/gnu/store/j9h7qdlzcvz7jfyb3ybmn8260n132xpj-guile-automate-0.0.0-dev/lib/guile/3.0/site-ccache/./automate/resources.go' [45/65] Compiling... wrote `/gnu/store/j9h7qdlzcvz7jfyb3ybmn8260n132xpj-guile-automate-0.0.0-dev/lib/guile/3.0/site-ccache/./automate/resources/file-output.go' [46/65] Compiling... wrote `/gnu/store/j9h7qdlzcvz7jfyb3ybmn8260n132xpj-guile-automate-0.0.0-dev/lib/guile/3.0/site-ccache/./automate/resources/gate.go' [47/65] Compiling... wrote `/gnu/store/j9h7qdlzcvz7jfyb3ybmn8260n132xpj-guile-automate-0.0.0-dev/lib/guile/3.0/site-ccache/./automate/resources/guix-daemon.go' [48/65] Compiling... wrote `/gnu/store/j9h7qdlzcvz7jfyb3ybmn8260n132xpj-guile-automate-0.0.0-dev/lib/guile/3.0/site-ccache/./automate/resources/limiter.go' [49/65] Compiling... wrote `/gnu/store/j9h7qdlzcvz7jfyb3ybmn8260n132xpj-guile-automate-0.0.0-dev/lib/guile/3.0/site-ccache/./automate/resources/materialise.go' [50/65] Compiling... wrote `/gnu/store/j9h7qdlzcvz7jfyb3ybmn8260n132xpj-guile-automate-0.0.0-dev/lib/guile/3.0/site-ccache/./automate/resources/shepherd.go' [51/65] Compiling... wrote `/gnu/store/j9h7qdlzcvz7jfyb3ybmn8260n132xpj-guile-automate-0.0.0-dev/lib/guile/3.0/site-ccache/./automate/shepherd/bridge.go' [52/65] Compiling... wrote `/gnu/store/j9h7qdlzcvz7jfyb3ybmn8260n132xpj-guile-automate-0.0.0-dev/lib/guile/3.0/site-ccache/./automate/shepherd/herd.go' [53/65] Compiling... wrote `/gnu/store/j9h7qdlzcvz7jfyb3ybmn8260n132xpj-guile-automate-0.0.0-dev/lib/guile/3.0/site-ccache/./automate/shepherd/pipeline-shepherd.go' [54/65] Compiling... wrote `/gnu/store/j9h7qdlzcvz7jfyb3ybmn8260n132xpj-guile-automate-0.0.0-dev/lib/guile/3.0/site-ccache/./automate/shepherd/services.go' [55/65] Compiling... wrote `/gnu/store/j9h7qdlzcvz7jfyb3ybmn8260n132xpj-guile-automate-0.0.0-dev/lib/guile/3.0/site-ccache/./automate/source.go' [56/65] Compiling... wrote `/gnu/store/j9h7qdlzcvz7jfyb3ybmn8260n132xpj-guile-automate-0.0.0-dev/lib/guile/3.0/site-ccache/./automate/structure.go' [57/65] Compiling... wrote `/gnu/store/j9h7qdlzcvz7jfyb3ybmn8260n132xpj-guile-automate-0.0.0-dev/lib/guile/3.0/site-ccache/./automate/utils/files.go' [58/65] Compiling... wrote `/gnu/store/j9h7qdlzcvz7jfyb3ybmn8260n132xpj-guile-automate-0.0.0-dev/lib/guile/3.0/site-ccache/./automate/utils/goblins.go' [59/65] Compiling... wrote `/gnu/store/j9h7qdlzcvz7jfyb3ybmn8260n132xpj-guile-automate-0.0.0-dev/lib/guile/3.0/site-ccache/./automate/utils/options.go' [60/65] Compiling... wrote `/gnu/store/j9h7qdlzcvz7jfyb3ybmn8260n132xpj-guile-automate-0.0.0-dev/lib/guile/3.0/site-ccache/./automate/utils/processes.go' [61/65] Compiling... wrote `/gnu/store/j9h7qdlzcvz7jfyb3ybmn8260n132xpj-guile-automate-0.0.0-dev/lib/guile/3.0/site-ccache/./automate/utils/sockets.go' [62/65] Compiling... wrote `/gnu/store/j9h7qdlzcvz7jfyb3ybmn8260n132xpj-guile-automate-0.0.0-dev/lib/guile/3.0/site-ccache/./automate/utils/sqlite.go' [63/65] Compiling... wrote `/gnu/store/j9h7qdlzcvz7jfyb3ybmn8260n132xpj-guile-automate-0.0.0-dev/lib/guile/3.0/site-ccache/./automate/utils/tcp-tls-netlayer.go' [64/65] Compiling... wrote `/gnu/store/j9h7qdlzcvz7jfyb3ybmn8260n132xpj-guile-automate-0.0.0-dev/lib/guile/3.0/site-ccache/./channel/guile-automate/package.go' [65/65] Compiling... phase `build' succeeded after 111.6 seconds sh: warning: setlocale: LC_ALL: cannot change locale (C.UTF-8): No such file or directory starting phase `remove-non-modules' phase `remove-non-modules' succeeded after 0.0 seconds sh: warning: setlocale: LC_ALL: cannot change locale (C.UTF-8): No such file or directory starting phase `install-static-files' `automate/pumphouse/web/static/live.js' -> `/gnu/store/j9h7qdlzcvz7jfyb3ybmn8260n132xpj-guile-automate-0.0.0-dev/share/guile/site/3.0/automate/pumphouse/web/static/live.js' `automate/pumphouse/web/static/theme.js' -> `/gnu/store/j9h7qdlzcvz7jfyb3ybmn8260n132xpj-guile-automate-0.0.0-dev/share/guile/site/3.0/automate/pumphouse/web/static/theme.js' `automate/pumphouse/web/static/logo.svg' -> `/gnu/store/j9h7qdlzcvz7jfyb3ybmn8260n132xpj-guile-automate-0.0.0-dev/share/guile/site/3.0/automate/pumphouse/web/static/logo.svg' `automate/pumphouse/web/static/style.css' -> `/gnu/store/j9h7qdlzcvz7jfyb3ybmn8260n132xpj-guile-automate-0.0.0-dev/share/guile/site/3.0/automate/pumphouse/web/static/style.css' phase `install-static-files' succeeded after 0.0 seconds sh: warning: setlocale: LC_ALL: cannot change locale (C.UTF-8): No such file or directory starting phase `check' == attach.scm stopped at the start of this step resumed error: boom 1 two irritants: "boom" 1 two backtrace: automate/pipeline/step.scm:675:62 (_) ice-9/boot-9.scm:2058:7 (error) stopped at the end of this step resumed stopped at the end of this step resumed stopped at the start of this step resumed ;;; note: auto-compilation is enabled, set GUILE_AUTO_COMPILE=0 ;;; or pass the --no-auto-compile argument to disable. ;;; compiling /tmp/guix-build-guile-automate-0.0.0-dev.drv-0/source/tests/run.scm ;;; compiling ./tests/support.scm ;;; compiled /tmp/guix-build-guile-automate-0.0.0-dev.drv-0/source/.cache/guile/ccache/3.0-LE-8-4.7/tmp/guix-build-guile-automate-0.0.0-dev.drv-0/source/tests/support.scm.go ;;; compiled /tmp/guix-build-guile-automate-0.0.0-dev.drv-0/source/.cache/guile/ccache/3.0-LE-8-4.7/tmp/guix-build-guile-automate-0.0.0-dev.drv-0/source/tests/run.scm.go ;;; compiling /tmp/guix-build-guile-automate-0.0.0-dev.drv-0/source/tests/attach.scm ;;; compiled /tmp/guix-build-guile-automate-0.0.0-dev.drv-0/source/.cache/guile/ccache/3.0-LE-8-4.7/tmp/guix-build-guile-automate-0.0.0-dev.drv-0/source/tests/attach.scm.go Error in IO handling wrapped resource #<input-output: file 104>: #<&compound-exception components: (#<&external-error> #<&origin origin: "fport_read"> #<&message message: "~A"> #<&irritants irritants: ("Connection reset by peer")> #<&exception-with-kind-and-args kind: system-error args: ("fport_read" "~A" ("Connection reset by peer") (104))>)> warning: mutating the process environment while multiple threads are running; further behavior unspecified. In ice-9/boot-9.scm: 1778:15 19 (with-exception-handler #<procedure 7ffff5a60570 at ice-9/boot-9.scm:1882:7 (exn)> _ #:unwind? _ #:unwind-for-type _) In fibers.scm: 164:13 18 (run-fibers _ #:hz _ #:scheduler _ #:parallelism _ #:cpus _ #:install-suspendable-ports? _ #:drain? _) 85:4 17 (%run-fibers _ _ _ _) In fibers/interrupts.scm: 98:4 16 (with-interrupts/thread-cputime _ _ _ _) In fibers/scheduler.scm: 380:26 15 (run-scheduler #<scheduler 7ffff1030e70 (remote-peers: (7ffff1030070))> _) In ice-9/boot-9.scm: 1778:15 14 (with-exception-handler #<procedure 7ffff4181300 at ice-9/boot-9.scm:1882:7 (exn)> _ #:unwind? _ #:unwind-for-type _) 1784:12 13 (with-exception-handler _ _ #:unwind? _ #:unwind-for-type _) In fibers/scheduler.scm: 344:10 12 (next-task) In fibers.scm: 179:8 11 (_) In goblins/actor-lib/io.scm: 60:10 10 (_) 85:15 9 (_ _) In ice-9/boot-9.scm: 1784:12 8 (with-exception-handler _ _ #:unwind? _ #:unwind-for-type _) In goblins/actor-lib/io.scm: 70:18 7 (run-and-send) In ice-9/control.scm: 91:24 6 (call-with-escape-continuation _) In goblins/contrib/syrup.scm: 306:7 5 (read-next) In ice-9/suspendable-ports.scm: 558:2 4 (peek-char _) 184:27 3 (fill-input #<input-output: file 104> _ _) 72:4 2 (read-bytes #<input-output: file 104> #vu8(60 49 48 39 111 112 58 100 101 108 105 118 101 114 60 49 49 39 100 101 115 99 58 101 120 112 111 114 116 50 43 62 91 54 39 97 116 116 97 99 104 60 49 56 39 100 101 115 99 58 105 109 112 111 114 116 45 111 98 106 101 99 116 51 43 62 93 50 43 60 49 56 39 100 101 115 99 58 105 109 112 111 114 116 45 111 98 106 101 99 116 52 43 62 62 98 106 101 99 116 49 43 62 62 222 153 42 103 100 244 9 29 153 99 199 157 205 19 93 93 93 60 49 48 39 111 # …) …) In unknown file: 1 (port-read #<input-output: file 104> #vu8(60 49 48 39 111 112 58 100 101 108 105 118 101 114 60 49 49 39 100 101 115 99 58 101 120 112 111 114 116 50 43 62 91 54 39 97 116 116 97 99 104 60 49 56 39 100 101 115 99 58 105 109 112 111 114 116 45 111 98 106 101 99 116 51 43 62 93 50 43 60 49 56 39 100 101 115 99 58 105 109 112 111 114 116 45 111 98 106 101 99 116 52 43 62 62 98 106 101 99 116 49 43 62 62 222 153 42 103 100 244 9 29 153 99 199 157 205 19 93 93 93 60 49 48 39 111 99 …) …) In ice-9/boot-9.scm: 1705:22 0 (raise-exception _ #:continuable? _) Uncaught exception in task: In fibers.scm: 179:8 15 (_) In goblins/actor-lib/io.scm: 60:10 14 (_) 85:15 13 (_ _) In ice-9/boot-9.scm: 1784:12 12 (with-exception-handler _ _ #:unwind? _ #:unwind-for-type _) In goblins/actor-lib/io.scm: 70:18 11 (run-and-send) In ice-9/control.scm: 91:24 10 (call-with-escape-continuation _) In goblins/contrib/syrup.scm: 306:7 9 (read-next) In ice-9/suspendable-ports.scm: 558:2 8 (peek-char _) 184:27 7 (fill-input #<input-output: file 104> _ _) 72:4 6 (read-bytes #<input-output: file 104> #vu8(60 49 48 39 111 112 58 100 101 108 105 118 101 114 60 49 49 39 100 101 115 99 58 101 120 112 111 114 116 50 43 62 91 54 39 97 116 116 97 99 104 60 49 56 39 100 101 115 99 58 105 109 112 111 114 116 45 111 98 106 101 99 116 51 43 62 93 50 43 60 49 56 39 100 101 115 99 58 105 109 112 111 114 116 45 111 98 106 101 99 116 52 43 62 62 98 106 101 99 116 49 43 62 62 222 153 42 103 100 244 9 29 153 99 199 157 205 19 93 93 93 60 49 48 39 111 # …) …) In unknown file: 5 (port-read #<input-output: file 104> #vu8(60 49 48 39 111 112 58 100 101 108 105 118 101 114 60 49 49 39 100 101 115 99 58 101 120 112 111 114 116 50 43 62 91 54 39 97 116 116 97 99 104 60 49 56 39 100 101 115 99 58 105 109 112 111 114 116 45 111 98 106 101 99 116 51 43 62 93 50 43 60 49 56 39 100 101 115 99 58 105 109 112 111 114 116 45 111 98 106 101 99 116 52 43 62 62 98 106 101 99 116 49 43 62 62 222 153 42 103 100 244 9 29 153 99 199 157 205 19 93 93 93 60 49 48 39 111 99 …) …) In ice-9/boot-9.scm: 1705:22 4 (raise-exception _ #:continuable? _) In goblins/core.scm: 1987:7 3 (<-np-extern _ . _) In fibers/operations.scm: 200:10 2 (perform-operation _) In fibers/scheduler.scm: 461:6 1 (suspend-current-task _) In ice-9/boot-9.scm: 1705:22 0 (raise-exception _ #:continuable? _) ice-9/boot-9.scm:1705:22: In procedure raise-exception: Attempt to suspend fiber within continuation barrier ;;; compiling /tmp/guix-build-guile-automate-0.0.0-dev.drv-0/source/tests/authority.scm ;;; compiled /tmp/guix-build-guile-automate-0.0.0-dev.drv-0/source/.cache/guile/ccache/3.0-LE-8-4.7/tmp/guix-build-guile-automate-0.0.0-dev.drv-0/source/tests/authority.scm.go Goblins exception: In message to #<local-object ^session>: (trigger other/elsewhere "run-1" (run-request (id . "f5e42df1b9f210b3") (parameters) (cause . #f) (ancestors))) ice-9/boot-9.scm:1705:22: In procedure raise-exception: ERROR: 1. &automate-error: kind: not-permitted irritants: (caller other/elsewhere) 2. &message: "this pipeline does not declare that it runs that one" 3. &irritants: (caller other/elsewhere) In goblins/core.scm: 1074:7 3 (syscaller-$ _ #<local-object ^session> (trigger other/elsewhere "run-1" (run-request (id . "f5e42df1b9f210b3") (parameters) (cause . #f) (ancestors)))) In automate/pumphouse.scm: 423:6 2 (trigger other/elsewhere "run-1" (run-request (id . "f5e42df1b9f210b3") (parameters) (cause . #f) (ancestors))) In automate/model.scm: 119:2 1 (raise-automate-error _ _ . _) In ice-9/boot-9.scm: 1705:22 0 (raise-exception _ #:continuable? _) session caller on here trigger: this pipeline does not declare that it runs that one: caller, other/elsewhere Goblins exception: In message to #<local-object ^session>: (trigger other/elsewhere "run-1" (run-request (id . "03fbb3456cc1b0ee") (parameters) (cause . #f) (ancestors))) ice-9/boot-9.scm:1705:22: In procedure raise-exception: ERROR: 1. &automate-error: kind: not-permitted irritants: (caller other/elsewhere) 2. &message: "this pipeline does not declare that it runs that one" 3. &irritants: (caller other/elsewhere) In goblins/core.scm: 1074:7 3 (syscaller-$ _ #<local-object ^session> (trigger other/elsewhere "run-1" (run-request (id . "03fbb3456cc1b0ee") (parameters) (cause . #f) (ancestors)))) In automate/pumphouse.scm: 423:6 2 (trigger other/elsewhere "run-1" (run-request (id . "03fbb3456cc1b0ee") (parameters) (cause . #f) (ancestors))) In automate/model.scm: 119:2 1 (raise-automate-error _ _ . _) In ice-9/boot-9.scm: 1705:22 0 (raise-exception _ #:continuable? _) session caller on here trigger: this pipeline does not declare that it runs that one: caller, other/elsewhere Goblins exception: In message to #<local-object fulfilled-handler>: (#f) ice-9/boot-9.scm:1705:22: In procedure raise-exception: ERROR: 1. &automate-error: kind: not-attached irritants: (other/called #f) 2. &message: "no pipeline process serving the pipeline's definition is attached" 3. &irritants: (other/called #f) In goblins/core.scm: 1074:7 3 (syscaller-$ _ #<local-object fulfilled-handler> (#f)) 2038:14 2 (_ . _) In automate/model.scm: 119:2 1 (raise-automate-error _ _ . _) In ice-9/boot-9.scm: 1705:22 0 (raise-exception _ #:continuable? _) session caller on here trigger: no pipeline process serving the pipeline's definition is attached: other/called, #f Goblins exception: In message to #<local-object fulfilled-handler>: (#f) ice-9/boot-9.scm:1705:22: In procedure raise-exception: ERROR: 1. &automate-error: kind: not-attached irritants: (other/fired #f) 2. &message: "no pipeline process serving the pipeline's definition is attached" 3. &irritants: (other/fired #f) In goblins/core.scm: 1074:7 3 (syscaller-$ _ #<local-object fulfilled-handler> (#f)) 2038:14 2 (_ . _) In automate/model.scm: 119:2 1 (raise-automate-error _ _ . _) In ice-9/boot-9.scm: 1705:22 0 (raise-exception _ #:continuable? _) session caller on here trigger: no pipeline process serving the pipeline's definition is attached: other/fired, #f Goblins exception: In message to #<local-object ^session>: (trigger other/called "run-2" (run-request (id . "215bd82e20a54712") (parameters) (cause . #f) (ancestors))) ice-9/boot-9.scm:1705:22: In procedure raise-exception: ERROR: 1. &automate-error: kind: not-permitted irritants: (quiet other/called) 2. &message: "this pipeline does not declare that it runs that one" 3. &irritants: (quiet other/called) In goblins/core.scm: 1074:7 3 (syscaller-$ _ #<local-object ^session> (trigger other/called "run-2" (run-request (id . "215bd82e20a54712") (parameters) (cause . #f) (ancestors)))) In automate/pumphouse.scm: 423:6 2 (trigger other/called "run-2" (run-request (id . "215bd82e20a54712") (parameters) (cause . #f) (ancestors))) In automate/model.scm: 119:2 1 (raise-automate-error _ _ . _) In ice-9/boot-9.scm: 1705:22 0 (raise-exception _ #:continuable? _) session quiet on here trigger: this pipeline does not declare that it runs that one: quiet, other/called Goblins exception: In message to #<local-object ^session>: (find-runs other/called ()) ice-9/boot-9.scm:1705:22: In procedure raise-exception: ERROR: 1. &automate-error: kind: not-permitted irritants: (reader other/called) 2. &message: "this pipeline does not declare that it lists the runs of that one" 3. &irritants: (reader other/called) In goblins/core.scm: 1074:7 3 (syscaller-$ _ #<local-object ^session> (find-runs other/called ())) In automate/pumphouse.scm: 381:6 2 (find-runs other/called ()) In automate/model.scm: 119:2 1 (raise-automate-error _ _ . _) In ice-9/boot-9.scm: 1705:22 0 (raise-exception _ #:continuable? _) session reader on here find-runs: this pipeline does not declare that it lists the runs of that one: reader, other/called Goblins exception: In message to #<local-object ^session>: (abort "controller-1" "controller-1" "enough") ice-9/boot-9.scm:1705:22: In procedure raise-exception: ERROR: 1. &automate-error: kind: not-permitted irritants: ("controller-1") 2. &message: "a run may not abort itself" 3. &irritants: ("controller-1") In goblins/core.scm: 1074:7 3 (syscaller-$ _ #<local-object ^session> (abort "controller-1" "controller-1" "enough")) In automate/pumphouse.scm: 391:6 2 (abort "controller-1" "controller-1" "enough") In automate/model.scm: 119:2 1 (raise-automate-error _ _ . _) In ice-9/boot-9.scm: 1705:22 0 (raise-exception _ #:continuable? _) session controller on here abort: a run may not abort itself: "controller-1" Goblins exception: In message to #<local-object fulfilled-handler>: (#f) ice-9/boot-9.scm:1705:22: In procedure raise-exception: ERROR: 1. &automate-error: kind: not-attached irritants: (other/trunk "trunk-1") 2. &message: "no pipeline process holds the run" 3. &irritants: (other/trunk "trunk-1") In goblins/core.scm: 1074:7 4 (syscaller-$ _ #<local-object fulfilled-handler> (#f)) 2038:14 3 (_ . _) In automate/pumphouse.scm: 167:20 2 (_ _) In automate/model.scm: 119:2 1 (raise-automate-error _ _ . _) In ice-9/boot-9.scm: 1705:22 0 (raise-exception _ #:continuable? _) session controller on here abort: no pipeline process holds the run: other/trunk, "trunk-1" Goblins exception: In message to #<local-object fulfilled-handler>: (other/elsewhere) ice-9/boot-9.scm:1705:22: In procedure raise-exception: ERROR: 1. &automate-error: kind: not-permitted irritants: (controller other/elsewhere) 2. &message: "this pipeline does not declare that it aborts the runs of that one" 3. &irritants: (controller other/elsewhere) In goblins/core.scm: 1074:7 4 (syscaller-$ _ #<local-object fulfilled-handler> (other/elsewhere)) 2038:14 3 (_ . _) In automate/pumphouse.scm: 179:8 2 (_ other/elsewhere) In automate/model.scm: 119:2 1 (raise-automate-error _ _ . _) In ice-9/boot-9.scm: 1705:22 0 (raise-exception _ #:continuable? _) session controller on here abort: this pipeline does not declare that it aborts the runs of that one: controller, other/elsewhere Goblins exception: In message to #<local-object fulfilled-handler>: (#f) ice-9/boot-9.scm:1705:22: In procedure raise-exception: ERROR: 1. &automate-error: kind: no-such-run irritants: ("nowhere") 2. &message: "no run of that id" 3. &irritants: ("nowhere") In goblins/core.scm: 1074:7 4 (syscaller-$ _ #<local-object fulfilled-handler> (#f)) 2038:14 3 (_ . _) In automate/pumphouse.scm: 178:10 2 (_ #f) In automate/model.scm: 119:2 1 (raise-automate-error _ _ . _) In ice-9/boot-9.scm: 1705:22 0 (raise-exception _ #:continuable? _) session controller on here abort: no run of that id: "nowhere" Goblins exception: In message to #<local-object ^session>: (drain-and-stop stopper "elsewhere" "stopper-1" "upgrade" #t) ice-9/boot-9.scm:1705:22: In procedure raise-exception: ERROR: 1. &automate-error: kind: not-attached irritants: (stopper "elsewhere") 2. &message: "no pipeline process of that instance is attached under this name" 3. &irritants: (stopper "elsewhere") In goblins/core.scm: 1074:7 4 (syscaller-$ _ #<local-object ^session> (drain-and-stop stopper "elsewhere" "stopper-1" "upgrade" #t)) In automate/pumphouse.scm: 410:8 3 (drain-and-stop stopper "elsewhere" "stopper-1" "upgrade" _) 110:6 2 (drain-processes! #<<pumphouse> records: #<local-object ^authority-records> lives: #<hash-table 7ffff3993300 7/31> serving: #<hash-table 7ffff39932e0 7/31> owners: #<hash-table 7ffff39932a0 1/31> shared: #<hash-table 7ffff3993280 0/31> gates: #<hash-table 7ffff3993220 0/31> stopped: #<hash-table 7ffff3993200 0/31> waiting: #<hash-table 7ffff39931c0 0/31> timers: #<hash-table 7ffff39931a0 0/31> tokens: #<hash-table 7ffff3993160 0/31> registrations: #<hash-table 7ffff3993140 0/31…> …) In automate/model.scm: 119:2 1 (raise-automate-error _ _ . _) In ice-9/boot-9.scm: 1705:22 0 (raise-exception _ #:continuable? _) session stopper on here drain-and-stop: no pipeline process of that instance is attached under this name: stopper, "elsewhere" Goblins exception: In message to #<local-object ^session>: (drain-and-stop other/trunk #f "stopper-1" "upgrade" #t) ice-9/boot-9.scm:1705:22: In procedure raise-exception: ERROR: 1. &automate-error: kind: not-attached irritants: (other/trunk #f) 2. &message: "no pipeline process is attached under this name" 3. &irritants: (other/trunk #f) In goblins/core.scm: 1074:7 4 (syscaller-$ _ #<local-object ^session> (drain-and-stop other/trunk #f "stopper-1" "upgrade" #t)) In automate/pumphouse.scm: 410:8 3 (drain-and-stop other/trunk #f "stopper-1" "upgrade" _) 110:6 2 (drain-processes! #<<pumphouse> records: #<local-object ^authority-records> lives: #<hash-table 7ffff3993300 7/31> serving: #<hash-table 7ffff39932e0 7/31> owners: #<hash-table 7ffff39932a0 1/31> shared: #<hash-table 7ffff3993280 0/31> gates: #<hash-table 7ffff3993220 0/31> stopped: #<hash-table 7ffff3993200 0/31> waiting: #<hash-table 7ffff39931c0 0/31> timers: #<hash-table 7ffff39931a0 0/31> tokens: #<hash-table 7ffff3993160 0/31> registrations: #<hash-table 7ffff3993140 0/31…> …) In automate/model.scm: 119:2 1 (raise-automate-error _ _ . _) In ice-9/boot-9.scm: 1705:22 0 (raise-exception _ #:continuable? _) session stopper on here drain-and-stop: no pipeline process is attached under this name: other/trunk, #f Goblins exception: In message to #<local-object ^session>: (drain-and-stop other/elsewhere #f "stopper-1" "upgrade" #f) ice-9/boot-9.scm:1705:22: In procedure raise-exception: ERROR: 1. &automate-error: kind: not-permitted irritants: (stopper other/elsewhere) 2. &message: "this pipeline does not declare that it stops the processes of that one" 3. &irritants: (stopper other/elsewhere) In goblins/core.scm: 1074:7 3 (syscaller-$ _ #<local-object ^session> (drain-and-stop other/elsewhere #f "stopper-1" "upgrade" #f)) In automate/pumphouse.scm: 406:6 2 (drain-and-stop other/elsewhere #f "stopper-1" "upgrade" #f) In automate/model.scm: 119:2 1 (raise-automate-error _ _ . _) In ice-9/boot-9.scm: 1705:22 0 (raise-exception _ #:continuable? _) session stopper on here drain-and-stop: this pipeline does not declare that it stops the processes of that one: stopper, other/elsewhere Goblins exception: In message to #<local-object ^session>: (drain-and-stop other/elsewhere #f "stopper-1" "upgrade" #t) ice-9/boot-9.scm:1705:22: In procedure raise-exception: ERROR: 1. &automate-error: kind: not-permitted irritants: (stopper other/elsewhere) 2. &message: "this pipeline does not declare that it stops the processes of that one" 3. &irritants: (stopper other/elsewhere) In goblins/core.scm: 1074:7 3 (syscaller-$ _ #<local-object ^session> (drain-and-stop other/elsewhere #f "stopper-1" "upgrade" #t)) In automate/pumphouse.scm: 406:6 2 (drain-and-stop other/elsewhere #f "stopper-1" "upgrade" #t) In automate/model.scm: 119:2 1 (raise-automate-error _ _ . _) In ice-9/boot-9.scm: 1705:22 0 (raise-exception _ #:continuable? _) session stopper on here drain-and-stop: this pipeline does not declare that it stops the processes of that one: stopper, other/elsewhere ;;; compiling /tmp/guix-build-guile-automate-0.0.0-dev.drv-0/source/tests/check.scm ;;; compiling ./automate/pipeline/lower.scm ;;; compiled /tmp/guix-build-guile-automate-0.0.0-dev.drv-0/source/.cache/guile/ccache/3.0-LE-8-4.7/tmp/guix-build-guile-automate-0.0.0-dev.drv-0/source/automate/pipeline/lower.scm.go ;;; compiled /tmp/guix-build-guile-automate-0.0.0-dev.drv-0/source/.cache/guile/ccache/3.0-LE-8-4.7/tmp/guix-build-guile-automate-0.0.0-dev.drv-0/source/tests/check.scm.go ;;; compiling /tmp/guix-build-guile-automate-0.0.0-dev.drv-0/source/tests/contain.scm ;;; compiled /tmp/guix-build-guile-automate-0.0.0-dev.drv-0/source/.cache/guile/ccache/3.0-LE-8-4.7/tmp/guix-build-guile-automate-0.0.0-dev.drv-0/source/tests/contain.scm.go warning: mutating the process environment while multiple threads are running; further behavior unspecified. warning: mutating the process environment while multiple threads are running; further behavior unspecified. warning: mutating the process environment while multiple threads are running; further behavior unspecified. warning: mutating the process environment while multiple threads are running; further behavior unspecified. warning: mutating the process environment while multiple threads are running; further behavior unspecified. warning: mutating the process environment while multiple threads are running; further behavior unspecified. warning: mutating the process environment while multiple threads are running; further behavior unspecified. warning: mutating the process environment while multiple threads are running; further behavior unspecified. warning: mutating the process environment while multiple threads are running; further behavior unspecified. warning: mutating the process environment while multiple threads are running; further behavior unspecified. warning: mutating the process environment while multiple threads are running; further behavior unspecified. warning: mutating the process environment while multiple threads are running; further behavior unspecified. warning: mutating the process environment while multiple threads are running; further behavior unspecified. warning: mutating the process environment while multiple threads are running; further behavior unspecified. ;;; compiling /tmp/guix-build-guile-automate-0.0.0-dev.drv-0/source/tests/errors.scm ;;; compiled /tmp/guix-build-guile-automate-0.0.0-dev.drv-0/source/.cache/guile/ccache/3.0-LE-8-4.7/tmp/guix-build-guile-automate-0.0.0-dev.drv-0/source/tests/errors.scm.go Goblins exception: In message to #<local-object>: (fail) ice-9/boot-9.scm:1705:22: In procedure raise-exception: ERROR: 1. &automate-error: kind: no-timer irritants: (fail) 2. &message: "no timer of this name" 3. &irritants: (fail) In execvp of /tmp/guix-build-guile-automate-0.0.0-dev.drv-0/automate-tests-R3ldiD/automate-notify-8JZaS6/missing: No such file or directory 49 passed, 0 failed == authority.scm 27 passed, 0 failed == check.scm 27 passed, 0 failed == contain.scm 24 passed, 0 failed == errors.scm 17 passed, 0 failed == events.scm 9 passed, 0 failed == files.scm 8 passed, 0 failed == forgejo.scm 97 passed, 0 failed == http.scm 49 passed, 0 failed == layout.scm 46 passed, 0 failed == masking.scm 34 passed, 0 failed == metrics.scm 38 passed, 0 failed == model.scm 166 passed, 0 failed == notify.scm In goblins/core.scm: 1074:7 2 (syscaller-$ _ #<local-object> (fail)) In automate/model.scm: 119:2 1 (raise-automate-error _ _ . _) In ice-9/boot-9.scm: 1705:22 0 (raise-exception _ #:continuable? _) answerer fail: no timer of this name: fail ;;; compiling /tmp/guix-build-guile-automate-0.0.0-dev.drv-0/source/tests/events.scm ;;; compiling /gnu/store/a7k8b77qmv34vjbw5gkgm160zph4lxlg-guile-webutils-0.1-1.d309d65/share/guile/site/3.0/webutils/cookie.scm ;;; compiling /gnu/store/a7k8b77qmv34vjbw5gkgm160zph4lxlg-guile-webutils-0.1-1.d309d65/share/guile/site/3.0/webutils/date.scm ;;; compiled /tmp/guix-build-guile-automate-0.0.0-dev.drv-0/source/.cache/guile/ccache/3.0-LE-8-4.7/gnu/store/a7k8b77qmv34vjbw5gkgm160zph4lxlg-guile-webutils-0.1-1.d309d65/share/guile/site/3.0/webutils/date.scm.go ;;; compiled /tmp/guix-build-guile-automate-0.0.0-dev.drv-0/source/.cache/guile/ccache/3.0-LE-8-4.7/gnu/store/a7k8b77qmv34vjbw5gkgm160zph4lxlg-guile-webutils-0.1-1.d309d65/share/guile/site/3.0/webutils/cookie.scm.go ;;; compiled /tmp/guix-build-guile-automate-0.0.0-dev.drv-0/source/.cache/guile/ccache/3.0-LE-8-4.7/tmp/guix-build-guile-automate-0.0.0-dev.drv-0/source/tests/events.scm.go ;;; compiling /tmp/guix-build-guile-automate-0.0.0-dev.drv-0/source/tests/files.scm ;;; compiled /tmp/guix-build-guile-automate-0.0.0-dev.drv-0/source/.cache/guile/ccache/3.0-LE-8-4.7/tmp/guix-build-guile-automate-0.0.0-dev.drv-0/source/tests/files.scm.go ;;; compiling /tmp/guix-build-guile-automate-0.0.0-dev.drv-0/source/tests/forgejo.scm ;;; compiled /tmp/guix-build-guile-automate-0.0.0-dev.drv-0/source/.cache/guile/ccache/3.0-LE-8-4.7/tmp/guix-build-guile-automate-0.0.0-dev.drv-0/source/tests/forgejo.scm.go ;;; compiling /tmp/guix-build-guile-automate-0.0.0-dev.drv-0/source/tests/http.scm ;;; compiled /tmp/guix-build-guile-automate-0.0.0-dev.drv-0/source/.cache/guile/ccache/3.0-LE-8-4.7/tmp/guix-build-guile-automate-0.0.0-dev.drv-0/source/tests/http.scm.go ;;; compiling /tmp/guix-build-guile-automate-0.0.0-dev.drv-0/source/tests/layout.scm ;;; compiled /tmp/guix-build-guile-automate-0.0.0-dev.drv-0/source/.cache/guile/ccache/3.0-LE-8-4.7/tmp/guix-build-guile-automate-0.0.0-dev.drv-0/source/tests/layout.scm.go ;;; compiling /tmp/guix-build-guile-automate-0.0.0-dev.drv-0/source/tests/masking.scm ;;; compiled /tmp/guix-build-guile-automate-0.0.0-dev.drv-0/source/.cache/guile/ccache/3.0-LE-8-4.7/tmp/guix-build-guile-automate-0.0.0-dev.drv-0/source/tests/masking.scm.go ;;; compiling /tmp/guix-build-guile-automate-0.0.0-dev.drv-0/source/tests/metrics.scm ;;; compiled /tmp/guix-build-guile-automate-0.0.0-dev.drv-0/source/.cache/guile/ccache/3.0-LE-8-4.7/tmp/guix-build-guile-automate-0.0.0-dev.drv-0/source/tests/metrics.scm.go ;;; compiling /tmp/guix-build-guile-automate-0.0.0-dev.drv-0/source/tests/model.scm ;;; compiled /tmp/guix-build-guile-automate-0.0.0-dev.drv-0/source/.cache/guile/ccache/3.0-LE-8-4.7/tmp/guix-build-guile-automate-0.0.0-dev.drv-0/source/tests/model.scm.go ;;; compiling /tmp/guix-build-guile-automate-0.0.0-dev.drv-0/source/tests/notify.scm ;;; compiling ./automate/helpers/guix.scm ;;; compiled /tmp/guix-build-guile-automate-0.0.0-dev.drv-0/source/.cache/guile/ccache/3.0-LE-8-4.7/tmp/guix-build-guile-automate-0.0.0-dev.drv-0/source/automate/helpers/guix.scm.go ;;; compiled /tmp/guix-build-guile-automate-0.0.0-dev.drv-0/source/.cache/guile/ccache/3.0-LE-8-4.7/tmp/guix-build-guile-automate-0.0.0-dev.drv-0/source/tests/notify.scm.go 2026-10-14 17:28:44 (with-exception-handler) INFO: POST /hook 200 1ms 2026-10-14 17:28:44 (with-exception-handler) INFO: POST /refuse 403 0ms 18 passed, 0 failed == output-marks.scm ;;; compiling /tmp/guix-build-guile-automate-0.0.0-dev.drv-0/source/tests/output-marks.scm ;;; compiled /tmp/guix-build-guile-automate-0.0.0-dev.drv-0/source/.cache/guile/ccache/3.0-LE-8-4.7/tmp/guix-build-guile-automate-0.0.0-dev.drv-0/source/tests/output-marks.scm.go 20 passed, 0 failed == pages.scm ;;; compiling /tmp/guix-build-guile-automate-0.0.0-dev.drv-0/source/tests/pages.scm ;;; compiled /tmp/guix-build-guile-automate-0.0.0-dev.drv-0/source/.cache/guile/ccache/3.0-LE-8-4.7/tmp/guix-build-guile-automate-0.0.0-dev.drv-0/source/tests/pages.scm.go 130 passed, 0 failed == pipeline-shepherd.scm ;;; compiling /tmp/guix-build-guile-automate-0.0.0-dev.drv-0/source/tests/pipeline-shepherd.scm ;;; compiled /tmp/guix-build-guile-automate-0.0.0-dev.drv-0/source/.cache/guile/ccache/3.0-LE-8-4.7/tmp/guix-build-guile-automate-0.0.0-dev.drv-0/source/tests/pipeline-shepherd.scm.go GNU Shepherd 1.0.9 (Guile 3.0.9, Fibers 1.4.3, x86_64-unknown-linux-gnu) Starting service root... Service root started. Service root running with value #<<process> id: 625 command: #f>. Service root has been started. Configuration successfully loaded from '/tmp/guix-build-guile-automate-0.0.0-dev.drv-0/automate-tests-R3ldiD/automate-ps-TRjayA/ps/shepherd.scm'. Starting service shepherd-bridge... Service shepherd-bridge started. Service shepherd-bridge running with value #<<process> id: 631 command: ("/gnu/store/k7vkw9x3wl3lni6a0i2w8xz2z8ylrqyz-guile-3.0.11/bin/guile" "-L" "/tmp/guix-build-guile-automate-0.0.0-dev.drv-0/source" "-L" "/gnu/store/r5gafvw9iapq6173liw37bzxj40bslhs-guile-documenta-0.4.0/share/guile/site/3.0" "-L" "/gnu/store/qzml053shmjml5vj6rbcfss5247h20f6-guile-syntax-highlight-0.3.1/share/guile/site/3.0" "-L" "/gnu/store/7a6l3fzjvr3nvbnw579wdkhhszzzh3ql-guix-1.5.0-6.64d4de2/share/guile/site/3.0" "-L" "/gnu/store/zplkplr3qmp5dpvhcxpgqr1lg44wmxyk-guile-goblins-0.18.0/share/guile/site/3.0" "-L" "/gnu/store/5la7a0imnji190xnfmxf0jrsp82dn9hq-guile-fibers-1.4.3/share/guile/site/3.0" "-L" "/gnu/store/z4fnbwa7d6dprqvd7f89wcifq6ggr2wm-guile-gcrypt-0.5.0/share/guile/site/3.0" "-L" "/gnu/store/b9928rpaj24whj9cz36yd1h28w7pwphq-guile-gnutls-5.0.2/share/guile/site/3.0" "-L" "/gnu/store/nw7d5iijwm9sa16k2swxjalgp0vlm01v-guile-json-4.7.3/share/guile/site/3.0" "-L" "/gnu/store/gyf1hm3gzbq00aw3m9x1xickf3zs3pq8-guile-knots-0.1-39.3417d25/share/guile/site/3.0" "-L" "/gnu/store/wsg7chjw2cg6xnp4il5caff5w0w69ikc-guile-sqlite3-0.1.3/share/guile/site/3.0" "-L" "/gnu/store/8n90dzhz177l1lz8bjrxsgbiyh1kmjap-guile-zlib-0.2.2/share/guile/site/3.0" "-L" "/gnu/store/2qm9a3n19pnznv791jvglb4sgh1jda3s-guile-safsaf-0.5-1.8b35410/share/guile/site/3.0" "-L" "/gnu/store/9ia4lplmfhpdxnnkvk0zyhyainyn0r0q-guile-prometheus-0-11.8f70b4b/share/guile/site/3.0" "-L" "/gnu/store/fp4rjwzvrm309wg11jahx8qcm7ypkai3-guile-ares-rs-0.9.8/share/guile/site/3.0" "-L" "/gnu/store/hfx188ymz9y9ialr175lqifn3b6xfdnz-shepherd-1.0.9/share/guile/site/3.0" "-L" "/gnu/store/x9ypa71lzv9jrd5n0qxq51hxnra83z2x-guile-lib-0.2.8.1/share/guile/site/3.0" "-L" "/gnu/store/9rd4c5w765bmsx0cimk0idpfasicvcdr-guile-config-0.5.1/share/guile/site/3.0" "-L" "/gnu/store/lsys62yw1wnmchmvv3q5x7bzkghyasil-guile-zstd-0.1.1/share/guile/site/3.0" "-L" "/gnu/store/gq36qbm22984252qxrzrgvrqzx807kd0-guile-lzlib-0.4.0/share/guile/site/3.0" "-L" "/gnu/store/axcsnac5kji5p4apyf67jqgpbvs47hcm-guile-git-0.12.1/share/guile/site/3.0" "-L" "/gnu/store/3xl1r2ppwspvhrlv4rzdcw3izhnvlkzm-guile-ssh-1.0.0/share/guile/site/3.0" "-L" "/gnu/store/dkzraln87ih1cbl36npg9fgyfqnmpqhh-guile-semver-0.2.0/share/guile/site/3.0" "-L" "/gnu/store/06k0pq8d20w6f3ymkgdwkm6k6rf2v7yj-guile-lib-0.2.8.1/share/guile/site/3.0" "-L" "/gnu/store/gl031z5csmpkyvicv8q4a3wjjgl5gqbi-guile-avahi-0.4.1/share/guile/site/3.0" "-L" "/gnu/store/k1yhnx32pjwr409ag3l25816ylasvzrf-guile-websocket-0.3.0/share/guile/site/3.0" "-L" "/gnu/store/c7k95lcd985bph7kycpjcwsbw0ky0yw1-guile-bstructs-0.2.0/share/guile/site/3.0" "-L" "/gnu/store/a7k8b77qmv34vjbw5gkgm160zph4lxlg-guile-webutils-0.1-1.d309d65/share/guile/site/3.0" "-L" "/gnu/store/cjnz2ikdas5ih7x2gs95fgi9q6f376gk-guile-bytestructures-2.0.2/share/guile/site/3.0" "-L" "/gnu/store/kwd8v8nwvw00d6akyr58d5bjqjcmfy5d-guile-irregex-0.9.12/share/guile/site/3.0" "-L" "/gnu/store/k7vkw9x3wl3lni6a0i2w8xz2z8ylrqyz-guile-3.0.11/share/guile/3.0" "-L" "/gnu/store/k7vkw9x3wl3lni6a0i2w8xz2z8ylrqyz-guile-3.0.11/share/guile/site/3.0" "-L" "/gnu/store/k7vkw9x3wl3lni6a0i2w8xz2z8ylrqyz-guile-3.0.11/share/guile/site" "-L" "/gnu/store/k7vkw9x3wl3lni6a0i2w8xz2z8ylrqyz-guile-3.0.11/share/guile" "-C" "/gnu/store/j9h7qdlzcvz7jfyb3ybmn8260n132xpj-guile-automate-0.0.0-dev/lib/guile/3.0/site-ccache" "-C" "/gnu/store/j9h7qdlzcvz7jfyb3ybmn8260n132xpj-guile-automate-0.0.0-dev/lib/guile/3.0/site-ccache/" "-C" "/gnu/store/r5gafvw9iapq6173liw37bzxj40bslhs-guile-documenta-0.4.0/lib/guile/3.0/site-ccache" "-C" "/gnu/store/r5gafvw9iapq6173liw37bzxj40bslhs-guile-documenta-0.4.0/share/guile/site/3.0" "-C" "/gnu/store/qzml053shmjml5vj6rbcfss5247h20f6-guile-syntax-highlight-0.3.1/lib/guile/3.0/site-ccache" "-C" "/gnu/store/qzml053shmjml5vj6rbcfss5247h20f6-guile-syntax-highlight-0.3.1/share/guile/site/3.0" "-C" "/gnu/store/7a6l3fzjvr3nvbnw579wdkhhszzzh3ql-guix-1.5.0-6.64d4de2/lib/guile/3.0/site-ccache" "-C" "/gnu/store/7a6l3fzjvr3nvbnw579wdkhhszzzh3ql-guix-1.5.0-6.64d4de2/share/guile/site/3.0" "-C" "/gnu/store/zplkplr3qmp5dpvhcxpgqr1lg44wmxyk-guile-goblins-0.18.0/lib/guile/3.0/site-ccache" "-C" "/gnu/store/zplkplr3qmp5dpvhcxpgqr1lg44wmxyk-guile-goblins-0.18.0/share/guile/site/3.0" "-C" "/gnu/store/5la7a0imnji190xnfmxf0jrsp82dn9hq-guile-fibers-1.4.3/lib/guile/3.0/site-ccache" "-C" "/gnu/store/5la7a0imnji190xnfmxf0jrsp82dn9hq-guile-fibers-1.4.3/share/guile/site/3.0" "-C" "/gnu/store/z4fnbwa7d6dprqvd7f89wcifq6ggr2wm-guile-gcrypt-0.5.0/lib/guile/3.0/site-ccache" "-C" "/gnu/store/z4fnbwa7d6dprqvd7f89wcifq6ggr2wm-guile-gcrypt-0.5.0/share/guile/site/3.0" "-C" "/gnu/store/b9928rpaj24whj9cz36yd1h28w7pwphq-guile-gnutls-5.0.2/lib/guile/3.0/site-ccache" "-C" "/gnu/store/b9928rpaj24whj9cz36yd1h28w7pwphq-guile-gnutls-5.0.2/share/guile/site/3.0" "-C" "/gnu/store/nw7d5iijwm9sa16k2swxjalgp0vlm01v-guile-json-4.7.3/lib/guile/3.0/site-ccache" "-C" "/gnu/store/nw7d5iijwm9sa16k2swxjalgp0vlm01v-guile-json-4.7.3/share/guile/site/3.0" "-C" "/gnu/store/gyf1hm3gzbq00aw3m9x1xickf3zs3pq8-guile-knots-0.1-39.3417d25/lib/guile/3.0/site-ccache" "-C" "/gnu/store/gyf1hm3gzbq00aw3m9x1xickf3zs3pq8-guile-knots-0.1-39.3417d25/share/guile/site/3.0" "-C" "/gnu/store/wsg7chjw2cg6xnp4il5caff5w0w69ikc-guile-sqlite3-0.1.3/lib/guile/3.0/site-ccache" "-C" "/gnu/store/wsg7chjw2cg6xnp4il5caff5w0w69ikc-guile-sqlite3-0.1.3/share/guile/site/3.0" "-C" "/gnu/store/8n90dzhz177l1lz8bjrxsgbiyh1kmjap-guile-zlib-0.2.2/lib/guile/3.0/site-ccache" "-C" "/gnu/store/8n90dzhz177l1lz8bjrxsgbiyh1kmjap-guile-zlib-0.2.2/share/guile/site/3.0" "-C" "/gnu/store/2qm9a3n19pnznv791jvglb4sgh1jda3s-guile-safsaf-0.5-1.8b35410/lib/guile/3.0/site-ccache" "-C" "/gnu/store/2qm9a3n19pnznv791jvglb4sgh1jda3s-guile-safsaf-0.5-1.8b35410/share/guile/site/3.0" "-C" "/gnu/store/9ia4lplmfhpdxnnkvk0zyhyainyn0r0q-guile-prometheus-0-11.8f70b4b/lib/guile/3.0/site-ccache" "-C" "/gnu/store/9ia4lplmfhpdxnnkvk0zyhyainyn0r0q-guile-prometheus-0-11.8f70b4b/share/guile/site/3.0" "-C" "/gnu/store/fp4rjwzvrm309wg11jahx8qcm7ypkai3-guile-ares-rs-0.9.8/lib/guile/3.0/site-ccache" "-C" "/gnu/store/fp4rjwzvrm309wg11jahx8qcm7ypkai3-guile-ares-rs-0.9.8/share/guile/site/3.0" "-C" "/gnu/store/hfx188ymz9y9ialr175lqifn3b6xfdnz-shepherd-1.0.9/lib/guile/3.0/site-ccache" "-C" "/gnu/store/hfx188ymz9y9ialr175lqifn3b6xfdnz-shepherd-1.0.9/share/guile/site/3.0" "-C" "/gnu/store/x9ypa71lzv9jrd5n0qxq51hxnra83z2x-guile-lib-0.2.8.1/lib/guile/3.0/site-ccache" "-C" "/gnu/store/x9ypa71lzv9jrd5n0qxq51hxnra83z2x-guile-lib-0.2.8.1/share/guile/site/3.0" "-C" "/gnu/store/9rd4c5w765bmsx0cimk0idpfasicvcdr-guile-config-0.5.1/lib/guile/3.0/site-ccache" "-C" "/gnu/store/9rd4c5w765bmsx0cimk0idpfasicvcdr-guile-config-0.5.1/share/guile/site/3.0" "-C" "/gnu/store/lsys62yw1wnmchmvv3q5x7bzkghyasil-guile-zstd-0.1.1/lib/guile/3.0/site-ccache" "-C" "/gnu/store/lsys62yw1wnmchmvv3q5x7bzkghyasil-guile-zstd-0.1.1/share/guile/site/3.0" "-C" "/gnu/store/gq36qbm22984252qxrzrgvrqzx807kd0-guile-lzlib-0.4.0/lib/guile/3.0/site-ccache" "-C" "/gnu/store/gq36qbm22984252qxrzrgvrqzx807kd0-guile-lzlib-0.4.0/share/guile/site/3.0" "-C" "/gnu/store/axcsnac5kji5p4apyf67jqgpbvs47hcm-guile-git-0.12.1/lib/guile/3.0/site-ccache" "-C" "/gnu/store/axcsnac5kji5p4apyf67jqgpbvs47hcm-guile-git-0.12.1/share/guile/site/3.0" "-C" "/gnu/store/3xl1r2ppwspvhrlv4rzdcw3izhnvlkzm-guile-ssh-1.0.0/lib/guile/3.0/site-ccache" "-C" "/gnu/store/3xl1r2ppwspvhrlv4rzdcw3izhnvlkzm-guile-ssh-1.0.0/share/guile/site/3.0" "-C" "/gnu/store/dkzraln87ih1cbl36npg9fgyfqnmpqhh-guile-semver-0.2.0/lib/guile/3.0/site-ccache" "-C" "/gnu/store/dkzraln87ih1cbl36npg9fgyfqnmpqhh-guile-semver-0.2.0/share/guile/site/3.0" "-C" "/gnu/store/06k0pq8d20w6f3ymkgdwkm6k6rf2v7yj-guile-lib-0.2.8.1/lib/guile/3.0/site-ccache" "-C" "/gnu/store/06k0pq8d20w6f3ymkgdwkm6k6rf2v7yj-guile-lib-0.2.8.1/share/guile/site/3.0" "-C" "/gnu/store/gl031z5csmpkyvicv8q4a3wjjgl5gqbi-guile-avahi-0.4.1/lib/guile/3.0/site-ccache" "-C" "/gnu/store/gl031z5csmpkyvicv8q4a3wjjgl5gqbi-guile-avahi-0.4.1/share/guile/site/3.0" "-C" "/gnu/store/k1yhnx32pjwr409ag3l25816ylasvzrf-guile-websocket-0.3.0/lib/guile/3.0/site-ccache" "-C" "/gnu/store/k1yhnx32pjwr409ag3l25816ylasvzrf-guile-websocket-0.3.0/share/guile/site/3.0" "-C" "/gnu/store/c7k95lcd985bph7kycpjcwsbw0ky0yw1-guile-bstructs-0.2.0/lib/guile/3.0/site-ccache" "-C" "/gnu/store/c7k95lcd985bph7kycpjcwsbw0ky0yw1-guile-bstructs-0.2.0/share/guile/site/3.0" "-C" "/gnu/store/a7k8b77qmv34vjbw5gkgm160zph4lxlg-guile-webutils-0.1-1.d309d65/share/guile/site/3.0" "-C" "/gnu/store/cjnz2ikdas5ih7x2gs95fgi9q6f376gk-guile-bytestructures-2.0.2/lib/guile/3.0/site-ccache" "-C" "/gnu/store/cjnz2ikdas5ih7x2gs95fgi9q6f376gk-guile-bytestructures-2.0.2/share/guile/site/3.0" "-C" "/gnu/store/kwd8v8nwvw00d6akyr58d5bjqjcmfy5d-guile-irregex-0.9.12/lib/guile/3.0/site-ccache" "-C" "/gnu/store/kwd8v8nwvw00d6akyr58d5bjqjcmfy5d-guile-irregex-0.9.12/share/guile/site/3.0" "-C" "/gnu/store/k7vkw9x3wl3lni6a0i2w8xz2z8ylrqyz-guile-3.0.11/lib/guile/3.0/ccache" "-C" "/gnu/store/k7vkw9x3wl3lni6a0i2w8xz2z8ylrqyz-guile-3.0.11/lib/guile/3.0/site-ccache" "/tmp/guix-build-guile-automate-0.0.0-dev.drv-0/automate-tests-R3ldiD/automate-ps-TRjayA/ps/bridge.scm")>. Service shepherd-bridge has been started. Successfully started 1 service in the background. Stopping service root... Exiting shepherd... Stopping service shepherd-bridge... Service shepherd-bridge stopped. Service shepherd-bridge is now stopped. Exiting. GNU Shepherd 1.0.9 (Guile 3.0.9, Fibers 1.4.3, x86_64-unknown-linux-gnu) Starting service root... Service root started. Service root running with value #<<process> id: 646 command: #f>. Service root has been started. Configuration successfully loaded from '/tmp/guix-build-guile-automate-0.0.0-dev.drv-0/automate-tests-R3ldiD/automate-ps-TRjayA/ps/shepherd.scm'. Starting service shepherd-bridge... Starting service sleeper... Service shepherd-bridge started. Service sleeper started. Service shepherd-bridge running with value #<<process> id: 652 command: ("/gnu/store/k7vkw9x3wl3lni6a0i2w8xz2z8ylrqyz-guile-3.0.11/bin/guile" "-L" "/tmp/guix-build-guile-automate-0.0.0-dev.drv-0/source" "-L" "/gnu/store/r5gafvw9iapq6173liw37bzxj40bslhs-guile-documenta-0.4.0/share/guile/site/3.0" "-L" "/gnu/store/qzml053shmjml5vj6rbcfss5247h20f6-guile-syntax-highlight-0.3.1/share/guile/site/3.0" "-L" "/gnu/store/7a6l3fzjvr3nvbnw579wdkhhszzzh3ql-guix-1.5.0-6.64d4de2/share/guile/site/3.0" "-L" "/gnu/store/zplkplr3qmp5dpvhcxpgqr1lg44wmxyk-guile-goblins-0.18.0/share/guile/site/3.0" "-L" "/gnu/store/5la7a0imnji190xnfmxf0jrsp82dn9hq-guile-fibers-1.4.3/share/guile/site/3.0" "-L" "/gnu/store/z4fnbwa7d6dprqvd7f89wcifq6ggr2wm-guile-gcrypt-0.5.0/share/guile/site/3.0" "-L" "/gnu/store/b9928rpaj24whj9cz36yd1h28w7pwphq-guile-gnutls-5.0.2/share/guile/site/3.0" "-L" "/gnu/store/nw7d5iijwm9sa16k2swxjalgp0vlm01v-guile-json-4.7.3/share/guile/site/3.0" "-L" "/gnu/store/gyf1hm3gzbq00aw3m9x1xickf3zs3pq8-guile-knots-0.1-39.3417d25/share/guile/site/3.0" "-L" "/gnu/store/wsg7chjw2cg6xnp4il5caff5w0w69ikc-guile-sqlite3-0.1.3/share/guile/site/3.0" "-L" "/gnu/store/8n90dzhz177l1lz8bjrxsgbiyh1kmjap-guile-zlib-0.2.2/share/guile/site/3.0" "-L" "/gnu/store/2qm9a3n19pnznv791jvglb4sgh1jda3s-guile-safsaf-0.5-1.8b35410/share/guile/site/3.0" "-L" "/gnu/store/9ia4lplmfhpdxnnkvk0zyhyainyn0r0q-guile-prometheus-0-11.8f70b4b/share/guile/site/3.0" "-L" "/gnu/store/fp4rjwzvrm309wg11jahx8qcm7ypkai3-guile-ares-rs-0.9.8/share/guile/site/3.0" "-L" "/gnu/store/hfx188ymz9y9ialr175lqifn3b6xfdnz-shepherd-1.0.9/share/guile/site/3.0" "-L" "/gnu/store/x9ypa71lzv9jrd5n0qxq51hxnra83z2x-guile-lib-0.2.8.1/share/guile/site/3.0" "-L" "/gnu/store/9rd4c5w765bmsx0cimk0idpfasicvcdr-guile-config-0.5.1/share/guile/site/3.0" "-L" "/gnu/store/lsys62yw1wnmchmvv3q5x7bzkghyasil-guile-zstd-0.1.1/share/guile/site/3.0" "-L" "/gnu/store/gq36qbm22984252qxrzrgvrqzx807kd0-guile-lzlib-0.4.0/share/guile/site/3.0" "-L" "/gnu/store/axcsnac5kji5p4apyf67jqgpbvs47hcm-guile-git-0.12.1/share/guile/site/3.0" "-L" "/gnu/store/3xl1r2ppwspvhrlv4rzdcw3izhnvlkzm-guile-ssh-1.0.0/share/guile/site/3.0" "-L" "/gnu/store/dkzraln87ih1cbl36npg9fgyfqnmpqhh-guile-semver-0.2.0/share/guile/site/3.0" "-L" "/gnu/store/06k0pq8d20w6f3ymkgdwkm6k6rf2v7yj-guile-lib-0.2.8.1/share/guile/site/3.0" "-L" "/gnu/store/gl031z5csmpkyvicv8q4a3wjjgl5gqbi-guile-avahi-0.4.1/share/guile/site/3.0" "-L" "/gnu/store/k1yhnx32pjwr409ag3l25816ylasvzrf-guile-websocket-0.3.0/share/guile/site/3.0" "-L" "/gnu/store/c7k95lcd985bph7kycpjcwsbw0ky0yw1-guile-bstructs-0.2.0/share/guile/site/3.0" "-L" "/gnu/store/a7k8b77qmv34vjbw5gkgm160zph4lxlg-guile-webutils-0.1-1.d309d65/share/guile/site/3.0" "-L" "/gnu/store/cjnz2ikdas5ih7x2gs95fgi9q6f376gk-guile-bytestructures-2.0.2/share/guile/site/3.0" "-L" "/gnu/store/kwd8v8nwvw00d6akyr58d5bjqjcmfy5d-guile-irregex-0.9.12/share/guile/site/3.0" "-L" "/gnu/store/k7vkw9x3wl3lni6a0i2w8xz2z8ylrqyz-guile-3.0.11/share/guile/3.0" "-L" "/gnu/store/k7vkw9x3wl3lni6a0i2w8xz2z8ylrqyz-guile-3.0.11/share/guile/site/3.0" "-L" "/gnu/store/k7vkw9x3wl3lni6a0i2w8xz2z8ylrqyz-guile-3.0.11/share/guile/site" "-L" "/gnu/store/k7vkw9x3wl3lni6a0i2w8xz2z8ylrqyz-guile-3.0.11/share/guile" "-C" "/gnu/store/j9h7qdlzcvz7jfyb3ybmn8260n132xpj-guile-automate-0.0.0-dev/lib/guile/3.0/site-ccache" "-C" "/gnu/store/j9h7qdlzcvz7jfyb3ybmn8260n132xpj-guile-automate-0.0.0-dev/lib/guile/3.0/site-ccache/" "-C" "/gnu/store/r5gafvw9iapq6173liw37bzxj40bslhs-guile-documenta-0.4.0/lib/guile/3.0/site-ccache" "-C" "/gnu/store/r5gafvw9iapq6173liw37bzxj40bslhs-guile-documenta-0.4.0/share/guile/site/3.0" "-C" "/gnu/store/qzml053shmjml5vj6rbcfss5247h20f6-guile-syntax-highlight-0.3.1/lib/guile/3.0/site-ccache" "-C" "/gnu/store/qzml053shmjml5vj6rbcfss5247h20f6-guile-syntax-highlight-0.3.1/share/guile/site/3.0" "-C" "/gnu/store/7a6l3fzjvr3nvbnw579wdkhhszzzh3ql-guix-1.5.0-6.64d4de2/lib/guile/3.0/site-ccache" "-C" "/gnu/store/7a6l3fzjvr3nvbnw579wdkhhszzzh3ql-guix-1.5.0-6.64d4de2/share/guile/site/3.0" "-C" "/gnu/store/zplkplr3qmp5dpvhcxpgqr1lg44wmxyk-guile-goblins-0.18.0/lib/guile/3.0/site-ccache" "-C" "/gnu/store/zplkplr3qmp5dpvhcxpgqr1lg44wmxyk-guile-goblins-0.18.0/share/guile/site/3.0" "-C" "/gnu/store/5la7a0imnji190xnfmxf0jrsp82dn9hq-guile-fibers-1.4.3/lib/guile/3.0/site-ccache" "-C" "/gnu/store/5la7a0imnji190xnfmxf0jrsp82dn9hq-guile-fibers-1.4.3/share/guile/site/3.0" "-C" "/gnu/store/z4fnbwa7d6dprqvd7f89wcifq6ggr2wm-guile-gcrypt-0.5.0/lib/guile/3.0/site-ccache" "-C" "/gnu/store/z4fnbwa7d6dprqvd7f89wcifq6ggr2wm-guile-gcrypt-0.5.0/share/guile/site/3.0" "-C" "/gnu/store/b9928rpaj24whj9cz36yd1h28w7pwphq-guile-gnutls-5.0.2/lib/guile/3.0/site-ccache" "-C" "/gnu/store/b9928rpaj24whj9cz36yd1h28w7pwphq-guile-gnutls-5.0.2/share/guile/site/3.0" "-C" "/gnu/store/nw7d5iijwm9sa16k2swxjalgp0vlm01v-guile-json-4.7.3/lib/guile/3.0/site-ccache" "-C" "/gnu/store/nw7d5iijwm9sa16k2swxjalgp0vlm01v-guile-json-4.7.3/share/guile/site/3.0" "-C" "/gnu/store/gyf1hm3gzbq00aw3m9x1xickf3zs3pq8-guile-knots-0.1-39.3417d25/lib/guile/3.0/site-ccache" "-C" "/gnu/store/gyf1hm3gzbq00aw3m9x1xickf3zs3pq8-guile-knots-0.1-39.3417d25/share/guile/site/3.0" "-C" "/gnu/store/wsg7chjw2cg6xnp4il5caff5w0w69ikc-guile-sqlite3-0.1.3/lib/guile/3.0/site-ccache" "-C" "/gnu/store/wsg7chjw2cg6xnp4il5caff5w0w69ikc-guile-sqlite3-0.1.3/share/guile/site/3.0" "-C" "/gnu/store/8n90dzhz177l1lz8bjrxsgbiyh1kmjap-guile-zlib-0.2.2/lib/guile/3.0/site-ccache" "-C" "/gnu/store/8n90dzhz177l1lz8bjrxsgbiyh1kmjap-guile-zlib-0.2.2/share/guile/site/3.0" "-C" "/gnu/store/2qm9a3n19pnznv791jvglb4sgh1jda3s-guile-safsaf-0.5-1.8b35410/lib/guile/3.0/site-ccache" "-C" "/gnu/store/2qm9a3n19pnznv791jvglb4sgh1jda3s-guile-safsaf-0.5-1.8b35410/share/guile/site/3.0" "-C" "/gnu/store/9ia4lplmfhpdxnnkvk0zyhyainyn0r0q-guile-prometheus-0-11.8f70b4b/lib/guile/3.0/site-ccache" "-C" "/gnu/store/9ia4lplmfhpdxnnkvk0zyhyainyn0r0q-guile-prometheus-0-11.8f70b4b/share/guile/site/3.0" "-C" "/gnu/store/fp4rjwzvrm309wg11jahx8qcm7ypkai3-guile-ares-rs-0.9.8/lib/guile/3.0/site-ccache" "-C" "/gnu/store/fp4rjwzvrm309wg11jahx8qcm7ypkai3-guile-ares-rs-0.9.8/share/guile/site/3.0" "-C" "/gnu/store/hfx188ymz9y9ialr175lqifn3b6xfdnz-shepherd-1.0.9/lib/guile/3.0/site-ccache" "-C" "/gnu/store/hfx188ymz9y9ialr175lqifn3b6xfdnz-shepherd-1.0.9/share/guile/site/3.0" "-C" "/gnu/store/x9ypa71lzv9jrd5n0qxq51hxnra83z2x-guile-lib-0.2.8.1/lib/guile/3.0/site-ccache" "-C" "/gnu/store/x9ypa71lzv9jrd5n0qxq51hxnra83z2x-guile-lib-0.2.8.1/share/guile/site/3.0" "-C" "/gnu/store/9rd4c5w765bmsx0cimk0idpfasicvcdr-guile-config-0.5.1/lib/guile/3.0/site-ccache" "-C" "/gnu/store/9rd4c5w765bmsx0cimk0idpfasicvcdr-guile-config-0.5.1/share/guile/site/3.0" "-C" "/gnu/store/lsys62yw1wnmchmvv3q5x7bzkghyasil-guile-zstd-0.1.1/lib/guile/3.0/site-ccache" "-C" "/gnu/store/lsys62yw1wnmchmvv3q5x7bzkghyasil-guile-zstd-0.1.1/share/guile/site/3.0" "-C" "/gnu/store/gq36qbm22984252qxrzrgvrqzx807kd0-guile-lzlib-0.4.0/lib/guile/3.0/site-ccache" "-C" "/gnu/store/gq36qbm22984252qxrzrgvrqzx807kd0-guile-lzlib-0.4.0/share/guile/site/3.0" "-C" "/gnu/store/axcsnac5kji5p4apyf67jqgpbvs47hcm-guile-git-0.12.1/lib/guile/3.0/site-ccache" "-C" "/gnu/store/axcsnac5kji5p4apyf67jqgpbvs47hcm-guile-git-0.12.1/share/guile/site/3.0" "-C" "/gnu/store/3xl1r2ppwspvhrlv4rzdcw3izhnvlkzm-guile-ssh-1.0.0/lib/guile/3.0/site-ccache" "-C" "/gnu/store/3xl1r2ppwspvhrlv4rzdcw3izhnvlkzm-guile-ssh-1.0.0/share/guile/site/3.0" "-C" "/gnu/store/dkzraln87ih1cbl36npg9fgyfqnmpqhh-guile-semver-0.2.0/lib/guile/3.0/site-ccache" "-C" "/gnu/store/dkzraln87ih1cbl36npg9fgyfqnmpqhh-guile-semver-0.2.0/share/guile/site/3.0" "-C" "/gnu/store/06k0pq8d20w6f3ymkgdwkm6k6rf2v7yj-guile-lib-0.2.8.1/lib/guile/3.0/site-ccache" "-C" "/gnu/store/06k0pq8d20w6f3ymkgdwkm6k6rf2v7yj-guile-lib-0.2.8.1/share/guile/site/3.0" "-C" "/gnu/store/gl031z5csmpkyvicv8q4a3wjjgl5gqbi-guile-avahi-0.4.1/lib/guile/3.0/site-ccache" "-C" "/gnu/store/gl031z5csmpkyvicv8q4a3wjjgl5gqbi-guile-avahi-0.4.1/share/guile/site/3.0" "-C" "/gnu/store/k1yhnx32pjwr409ag3l25816ylasvzrf-guile-websocket-0.3.0/lib/guile/3.0/site-ccache" "-C" "/gnu/store/k1yhnx32pjwr409ag3l25816ylasvzrf-guile-websocket-0.3.0/share/guile/site/3.0" "-C" "/gnu/store/c7k95lcd985bph7kycpjcwsbw0ky0yw1-guile-bstructs-0.2.0/lib/guile/3.0/site-ccache" "-C" "/gnu/store/c7k95lcd985bph7kycpjcwsbw0ky0yw1-guile-bstructs-0.2.0/share/guile/site/3.0" "-C" "/gnu/store/a7k8b77qmv34vjbw5gkgm160zph4lxlg-guile-webutils-0.1-1.d309d65/share/guile/site/3.0" "-C" "/gnu/store/cjnz2ikdas5ih7x2gs95fgi9q6f376gk-guile-bytestructures-2.0.2/lib/guile/3.0/site-ccache" "-C" "/gnu/store/cjnz2ikdas5ih7x2gs95fgi9q6f376gk-guile-bytestructures-2.0.2/share/guile/site/3.0" "-C" "/gnu/store/kwd8v8nwvw00d6akyr58d5bjqjcmfy5d-guile-irregex-0.9.12/lib/guile/3.0/site-ccache" "-C" "/gnu/store/kwd8v8nwvw00d6akyr58d5bjqjcmfy5d-guile-irregex-0.9.12/share/guile/site/3.0" "-C" "/gnu/store/k7vkw9x3wl3lni6a0i2w8xz2z8ylrqyz-guile-3.0.11/lib/guile/3.0/ccache" "-C" "/gnu/store/k7vkw9x3wl3lni6a0i2w8xz2z8ylrqyz-guile-3.0.11/lib/guile/3.0/site-ccache" "/tmp/guix-build-guile-automate-0.0.0-dev.drv-0/automate-tests-R3ldiD/automate-ps-TRjayA/ps/bridge.scm")>. Service sleeper running with value #<<process> id: 653 command: ("/gnu/store/k7vkw9x3wl3lni6a0i2w8xz2z8ylrqyz-guile-3.0.11/bin/guile" "--no-auto-compile" "/tmp/guix-build-guile-automate-0.0.0-dev.drv-0/automate-tests-R3ldiD/automate-ps-TRjayA/daemon.scm" "/tmp/guix-build-guile-automate-0.0.0-dev.drv-0/automate-tests-R3ldiD/automate-ps-TRjayA/marker" "--pumphouse=/tmp/guix-build-guile-automate-0.0.0-dev.drv-0/automate-tests-R3ldiD/automate-ps-TRjayA/ps/secrets/sleeper/pumphouse" "--secrets=/tmp/guix-build-guile-automate-0.0.0-dev.drv-0/automate-tests-R3ldiD/automate-ps-TRjayA/ps/secrets/sleeper" "--working-directory=/tmp/guix-build-guile-automate-0.0.0-dev.drv-0/automate-tests-R3ldiD/automate-ps-TRjayA/ps/work/sleeper")>. Service shepherd-bridge has been started. Service sleeper has been started. Successfully started 2 services in the background. Stopping service root... Exiting shepherd... Stopping service shepherd-bridge... Service shepherd-bridge stopped. Service shepherd-bridge is now stopped. Stopping service sleeper... Service sleeper stopped. Service sleeper is now stopped. Exiting. 20 passed, 0 failed == pipeline.scm ;;; compiling /tmp/guix-build-guile-automate-0.0.0-dev.drv-0/source/tests/pipeline.scm ;;; compiled /tmp/guix-build-guile-automate-0.0.0-dev.drv-0/source/.cache/guile/ccache/3.0-LE-8-4.7/tmp/guix-build-guile-automate-0.0.0-dev.drv-0/source/tests/pipeline.scm.go error: boom 1 two irritants: "boom" 1 two backtrace: automate/pipeline/step.scm:675:62 (_) ice-9/boot-9.scm:2058:7 (error) error: boom 1 two irritants: "boom" 1 two backtrace: automate/pipeline/step.scm:675:62 (_) ice-9/boot-9.scm:2058:7 (error) error: boom 1 two irritants: "boom" 1 two backtrace: automate/pipeline/step.scm:675:62 (_) ice-9/boot-9.scm:2058:7 (error) error: body ended without providing outputs kind: missing-outputs irritants: (count) backtrace: automate/model.scm:119:2 (raise-automate-error) Goblins exception: In message to #<local-object ^file-output>: (commit publish-nothing) ice-9/boot-9.scm:1705:22: In procedure raise-exception: ERROR: 1. &automate-error: kind: nothing-to-commit irritants: (site "/tmp/guix-build-guile-automate-0.0.0-dev.drv-0/automate-tests-R3ldiD/automate-output-kfy6ZK/.automate-site/staging-R3O7tT/site") 2. &message: "a file output is committed with nothing staged: the body makes the content at the path attach answered" 3. &irritants: (site "/tmp/guix-build-guile-automate-0.0.0-dev.drv-0/automate-tests-R3ldiD/automate-output-kfy6ZK/.automate-site/staging-R3O7tT/site") In goblins/core.scm: 1074:7 3 (syscaller-$ _ #<local-object ^file-output> (commit publish-nothing)) In automate/resources/file-output.scm: 173:6 2 (commit publish-nothing) In automate/model.scm: 119:2 1 (raise-automate-error _ _ . _) In ice-9/boot-9.scm: 1705:22 0 (raise-exception _ #:continuable? _) error: a file output is committed with nothing staged: the body makes the content at the path attach answered kind: nothing-to-commit irritants: site "/tmp/guix-build-guile-automate-0.0.0-dev.drv-0/automate-tests-R3ldiD/automate-output-kfy6ZK/.automate-site/staging-R3O7tT/site" backtrace: automate/pipeline/step.scm:675:62 (_) automate/utils/goblins.scm:277:20 (await-in-vat) Goblins exception: In message to #<local-object ^file-output>: (commit publish-twice) ice-9/boot-9.scm:1705:22: In procedure raise-exception: ERROR: 1. &automate-error: kind: already-committed irritants: (site "/tmp/guix-build-guile-automate-0.0.0-dev.drv-0/automate-tests-R3ldiD/automate-output-Y33p6R/site") 2. &message: "this file output was committed already" 3. &irritants: (site "/tmp/guix-build-guile-automate-0.0.0-dev.drv-0/automate-tests-R3ldiD/automate-output-Y33p6R/site") In goblins/core.scm: 1074:7 3 (syscaller-$ _ #<local-object ^file-output> (commit publish-twice)) In automate/resources/file-output.scm: 169:6 2 (commit publish-twice) In automate/model.scm: 119:2 1 (raise-automate-error _ _ . _) In ice-9/boot-9.scm: 1705:22 0 (raise-exception _ #:continuable? _) error: this file output was committed already kind: already-committed irritants: site "/tmp/guix-build-guile-automate-0.0.0-dev.drv-0/automate-tests-R3ldiD/automate-output-Y33p6R/site" backtrace: automate/pipeline/step.scm:675:62 (_) automate/utils/goblins.scm:277:20 (await-in-vat) `/tmp/guix-build-guile-automate-0.0.0-dev.drv-0/automate-tests-R3ldiD/automate-output-OJpo7B/.automate-site/staging-sGVp5R/site/index' -> `/tmp/guix-build-guile-automate-0.0.0-dev.drv-0/automate-tests-R3ldiD/automate-output-OJpo7B/.automate-site/6acfbbea-11e-eeae4c25/index' error: value cannot be masked kind: unmaskable irritants: too-short backtrace: automate/pipeline/step.scm:675:62 (_) automate/pipeline/step.scm:225:6 (mask) Goblins exception: In message to #<local-object ^file-input>: (attach read-only) ice-9/boot-9.scm:1705:22: In procedure raise-exception: ERROR: 1. &automate-error: kind: missing-file-input irritants: (sources "/nowhere-at-all") 2. &message: "no file or directory for this file input" 3. &irritants: (sources "/nowhere-at-all") In goblins/core.scm: 1074:7 3 (syscaller-$ _ #<local-object ^file-input> (attach read-only)) In automate/resources/materialise.scm: 98:6 2 (attach _) In automate/model.scm: 119:2 1 (raise-automate-error _ _ . _) In ice-9/boot-9.scm: 1705:22 0 (raise-exception _ #:continuable? _) error: no file or directory for this file input kind: missing-file-input irritants: sources "/nowhere-at-all" backtrace: automate/pipeline/step.scm:675:62 (_) ice-9/eval.scm:293:34 (_) automate/utils/goblins.scm:277:20 (await-in-vat) Goblins exception: In message to #<local-object ^secret>: (attach missing) ice-9/boot-9.scm:1705:22: In procedure raise-exception: ERROR: 1. &automate-error: kind: missing-secret irritants: (token "/tmp/guix-build-guile-automate-0.0.0-dev.drv-0/automate-tests-R3ldiD/automate-secrets-vApY2l/token") 2. &message: "no file for this secret" 3. &irritants: (token "/tmp/guix-build-guile-automate-0.0.0-dev.drv-0/automate-tests-R3ldiD/automate-secrets-vApY2l/token") In goblins/core.scm: 1074:7 3 (syscaller-$ _ #<local-object ^secret> (attach missing)) In automate/resources/materialise.scm: 76:6 2 (attach _) In automate/model.scm: 119:2 1 (raise-automate-error _ _ . _) In ice-9/boot-9.scm: 1705:22 0 (raise-exception _ #:continuable? _) error: no file for this secret kind: missing-secret irritants: token "/tmp/guix-build-guile-automate-0.0.0-dev.drv-0/automate-tests-R3ldiD/automate-secrets-vApY2l/token" backtrace: automate/pipeline/step.scm:675:62 (_) automate/utils/goblins.scm:277:20 (await-in-vat) warning: mutating the process environment while multiple threads are running; further behavior unspecified. warning: mutating the process environment while multiple threads are running; further behavior unspecified. warning: mutating the process environment while multiple threads are running; further behavior unspecified. warning: mutating the process environment while multiple threads are running; further behavior unspecified. warning: mutating the process environment while multiple threads are running; further behavior unspecified. warning: mutating the process environment while multiple threads are running; further behavior unspecified. warning: mutating the process environment while multiple threads are running; further behavior unspecified. guile: warning: failed to install locale warning: mutating the process environment while multiple threads are running; further behavior unspecified. warning: mutating the process environment while multiple threads are running; further behavior unspecified. warning: mutating the process environment while multiple threads are running; further behavior unspecified. warning: mutating the process environment while multiple threads are running; further behavior unspecified. warning: mutating the process environment while multiple threads are running; further behavior unspecified. Goblins exception: In message to #<local-object ^guix-daemon>: (keep keep-elsewhere "/tmp/thing") ice-9/boot-9.scm:1705:22: In procedure raise-exception: ERROR: 1. &automate-error: kind: not-a-store-item irritants: (daemon "/tmp/thing") 2. &message: "only a store path can be kept" 3. &irritants: (daemon "/tmp/thing") In goblins/core.scm: 1074:7 3 (syscaller-$ _ #<local-object ^guix-daemon> (keep keep-elsewhere "/tmp/thing")) In automate/resources/guix-daemon.scm: 212:7 2 (keep keep-elsewhere "/tmp/thing") In automate/model.scm: 119:2 1 (raise-automate-error _ _ . _) In ice-9/boot-9.scm: 1705:22 0 (raise-exception _ #:continuable? _) error: only a store path can be kept kind: not-a-store-item irritants: daemon "/tmp/thing" backtrace: automate/pipeline/step.scm:675:62 (_) automate/utils/goblins.scm:277:20 (await-in-vat) 184 passed, 0 failed == processes.scm ;;; compiling /tmp/guix-build-guile-automate-0.0.0-dev.drv-0/source/tests/processes.scm ;;; compiled /tmp/guix-build-guile-automate-0.0.0-dev.drv-0/source/.cache/guile/ccache/3.0-LE-8-4.7/tmp/guix-build-guile-automate-0.0.0-dev.drv-0/source/tests/processes.scm.go 4 passed, 0 failed == pumphouse-draining.scm ;;; compiling /tmp/guix-build-guile-automate-0.0.0-dev.drv-0/source/tests/pumphouse-draining.scm ;;; compiling ./tests/pumphouse/support.scm ;;; compiled /tmp/guix-build-guile-automate-0.0.0-dev.drv-0/source/.cache/guile/ccache/3.0-LE-8-4.7/tmp/guix-build-guile-automate-0.0.0-dev.drv-0/source/tests/pumphouse/support.scm.go ;;; compiled /tmp/guix-build-guile-automate-0.0.0-dev.drv-0/source/.cache/guile/ccache/3.0-LE-8-4.7/tmp/guix-build-guile-automate-0.0.0-dev.drv-0/source/tests/pumphouse-draining.scm.go http on port 36697 pumphouse listening on /tmp/guix-build-guile-automate-0.0.0-dev.drv-0/automate-tests-R3ldiD/automate-pumphouse-8E62zK/socket admin: /tmp/guix-build-guile-automate-0.0.0-dev.drv-0/automate-tests-R3ldiD/automate-pumphouse-8E62zK/admin remote admin: /tmp/guix-build-guile-automate-0.0.0-dev.drv-0/automate-tests-R3ldiD/automate-pumphouse-8E62zK/remote-admin attached to the pumphouse of /tmp/guix-build-guile-automate-0.0.0-dev.drv-0/automate-tests-R3ldiD/automate-pumphouse-8E62zK/any run bf39a121d6096233 asked this process to drain and stop: upgraded stopping: taking no more runs; 1 in flight Goblins exception: In message to #<local-object ^pipeline-endpoint>: (run (run-request (id . "98ae143ef5b3e6f9") (parameters) (cause . #f) (ancestors))) ice-9/boot-9.scm:1705:22: In procedure raise-exception: ERROR: 1. &automate-error: kind: busy irritants: (tests/stopping/other) 2. &message: "this process is stopping" 3. &irritants: (tests/stopping/other) In goblins/core.scm: 1074:7 2 (syscaller-$ _ #<local-object ^pipeline-endpoint> (run (run-request (id . "98ae143ef5b3e6f9") (parameters) (cause . #f) (ancestors)))) In automate/model.scm: 119:2 1 (raise-automate-error _ _ . _) In ice-9/boot-9.scm: 1705:22 0 (raise-exception _ #:continuable? _) tests/stopping/other run: this process is stopping: tests/stopping/other Goblins exception: In message to #<local-object broken-handler>: ((automate-error busy "this process is stopping" ("tests/stopping/other") "#<&compound-exception components: (#<&automate-error kind: busy irritants: (tests/stopping/other)> #<&message message: \"this process is stopping\"> #<&irritants irritants: (tests/stopping/other)>)>" "")) ice-9/boot-9.scm:1705:22: In procedure raise-exception: ERROR: 1. &automate-error: kind: busy irritants: (tests/stopping/other) 2. &message: "every pipeline process serving the pipeline is busy" 3. &irritants: (tests/stopping/other) In goblins/core.scm: 1074:7 3 (syscaller-$ _ #<local-object broken-handler> ((automate-error busy "this process is stopping" ("tests/stopping/other") "#<&compound-exception components: (#<&automate-error kind: busy irritants: (tests/stopping/other)> #<&message message: \"this process is stopping\"> #<&irritants irritants: (tests/stopping/other)>)>" ""))) 2038:14 2 (_ . _) In automate/model.scm: 119:2 1 (raise-automate-error _ _ . _) In ice-9/boot-9.scm: 1705:22 0 (raise-exception _ #:continuable? _) admin run: every pipeline process serving the pipeline is busy: tests/stopping/other attached to the pumphouse of /tmp/guix-build-guile-automate-0.0.0-dev.drv-0/automate-tests-R3ldiD/automate-pumphouse-8E62zK/any attached to the pumphouse of /tmp/guix-build-guile-automate-0.0.0-dev.drv-0/automate-tests-R3ldiD/automate-pumphouse-8E62zK/any attached to the pumphouse of /tmp/guix-build-guile-automate-0.0.0-dev.drv-0/automate-tests-R3ldiD/automate-pumphouse-8E62zK/any the pumphouse asked this process to drain and stop: fleet upgrade stopping: taking no more runs; 0 in flight the pumphouse asked this process to drain and stop: operator stopping: taking no more runs; 0 in flight Goblins exception: In message to #<local-object ^admin>: (drain-and-stop tests/stopping/fleet #f "again") ice-9/boot-9.scm:1705:22: In procedure raise-exception: ERROR: 1. &automate-error: kind: not-attached irritants: (tests/stopping/fleet #f) 2. &message: "no pipeline process is attached under this name" 3. &irritants: (tests/stopping/fleet #f) In goblins/core.scm: 1074:7 3 (syscaller-$ _ #<local-object ^admin> (drain-and-stop tests/stopping/fleet #f "again")) In automate/pumphouse.scm: 110:6 2 (drain-processes! #<<pumphouse> records: #<local-object ^records> lives: #<hash-table 7ffff7813fa0 4/31> serving: #<hash-table 7ffff7813f80 4/31> owners: #<hash-table 7ffff7813f60 0/31> shared: #<hash-table 7ffff7813f40 0/31> gates: #<hash-table 7ffff7813f20 0/31> stopped: #<hash-table 7ffff7813f00 0/31> waiting: #<hash-table 7ffff7813ee0 0/31> timers: #<hash-table 7ffff7813ec0 0/31> tokens: #<hash-table 7ffff7813ea0 2/31> registrations: #<hash-table 7ffff7813e80 1/31> registra…> …) In automate/model.scm: 119:2 1 (raise-automate-error _ _ . _) In ice-9/boot-9.scm: 1705:22 0 (raise-exception _ #:continuable? _) admin drain-and-stop: no pipeline process is attached under this name: tests/stopping/fleet, #f Error in IO handling wrapped resource #<input-output: file 76>: #<&compound-exception components: (#<&external-error> #<&origin origin: "fport_read"> #<&message message: "~A"> #<&irritants irritants: ("Connection reset by peer")> #<&exception-with-kind-and-args kind: system-error args: ("fport_read" "~A" ("Connection reset by peer") (104))>)> stop 1399: kill #<unspecified>, waitpid (1399 . 9) In ice-9/boot-9.scm: 1778:15 19 (with-exception-handler #<procedure 7ffff5add360 at ice-9/boot-9.scm:1882:7 (exn)> _ #:unwind? _ #:unwind-for-type _) In fibers.scm: 164:13 18 (run-fibers _ #:hz _ #:scheduler _ #:parallelism _ #:cpus _ #:install-suspendable-ports? _ #:drain? _) 85:4 17 (%run-fibers _ _ _ _) In fibers/interrupts.scm: 98:4 16 (with-interrupts/thread-cputime _ _ _ _) In fibers/scheduler.scm: 380:26 15 (run-scheduler #<scheduler 7ffff42e1e00 (remote-peers: (7ffff42e1930))> _) In ice-9/boot-9.scm: 1778:15 14 (with-exception-handler #<procedure 7ffff4f2e300 at ice-9/boot-9.scm:1882:7 (exn)> _ #:unwind? _ #:unwind-for-type _) 1784:12 13 (with-exception-handler _ _ #:unwind? _ #:unwind-for-type _) In fibers/scheduler.scm: 344:10 12 (next-task) In fibers.scm: 179:8 11 (_) In goblins/actor-lib/io.scm: 60:10 10 (_) 85:15 9 (_ _) In ice-9/boot-9.scm: 1784:12 8 (with-exception-handler _ _ #:unwind? _ #:unwind-for-type _) In goblins/actor-lib/io.scm: 70:18 7 (run-and-send) In ice-9/control.scm: 91:24 6 (call-with-escape-continuation _) In goblins/contrib/syrup.scm: 306:7 5 (read-next) In ice-9/suspendable-ports.scm: 558:2 4 (peek-char _) 184:27 3 (fill-input #<input-output: file 76> _ _) 72:4 2 (read-bytes #<input-output: file 76> #vu8(39 100 101 115 99 58 105 109 112 111 114 116 45 111 98 106 101 99 116 50 49 43 62 62 120 112 111 114 116 50 43 62 91 57 39 104 101 97 114 116 98 101 97 116 93 49 57 43 60 49 56 39 100 101 115 99 58 105 109 112 111 114 116 45 111 98 106 101 99 116 50 48 43 62 62 105 110 45 111 116 104 101 114 48 43 93 93 49 53 43 60 49 56 39 100 101 115 99 58 105 109 112 111 114 116 45 111 98 106 101 99 116 49 55 43 62 62 60 49 48 39 111 112 58 100 101 …) …) In unknown file: 1 (port-read #<input-output: file 76> #vu8(39 100 101 115 99 58 105 109 112 111 114 116 45 111 98 106 101 99 116 50 49 43 62 62 120 112 111 114 116 50 43 62 91 57 39 104 101 97 114 116 98 101 97 116 93 49 57 43 60 49 56 39 100 101 115 99 58 105 109 112 111 114 116 45 111 98 106 101 99 116 50 48 43 62 62 105 110 45 111 116 104 101 114 48 43 93 93 49 53 43 60 49 56 39 100 101 115 99 58 105 109 112 111 114 116 45 111 98 106 101 99 116 49 55 43 62 62 60 49 48 39 111 112 58 100 101 # …) …) In ice-9/boot-9.scm: 1705:22 0 (raise-exception _ #:continuable? _) Uncaught exception in task: In fibers.scm: 179:8 12 (_) In goblins/actor-lib/io.scm: 60:10 11 (_) 85:15 10 (_ _) In ice-9/boot-9.scm: 1784:12 9 (with-exception-handler _ _ #:unwind? _ #:unwind-for-type _) In goblins/actor-lib/io.scm: 70:18 8 (run-and-send) In ice-9/control.scm: 91:24 7 (call-with-escape-continuation _) In goblins/contrib/syrup.scm: 306:7 6 (read-next) In ice-9/suspendable-ports.scm: 558:2 5 (peek-char _) 184:27 4 (fill-input #<input-output: file 76> _ _) 72:4 3 (read-bytes #<input-output: file 76> #vu8(39 100 101 115 99 58 105 109 112 111 114 116 45 111 98 106 101 99 116 50 49 43 62 62 120 112 111 114 116 50 43 62 91 57 39 104 101 97 114 116 98 101 97 116 93 49 57 43 60 49 56 39 100 101 115 99 58 105 109 112 111 114 116 45 111 98 106 101 99 116 50 48 43 62 62 105 110 45 111 116 104 101 114 48 43 93 93 49 53 43 60 49 56 39 100 101 115 99 58 105 109 112 111 114 116 45 111 98 106 101 99 116 49 55 43 62 62 60 49 48 39 111 112 58 100 101 …) …) In unknown file: 2 (port-read #<input-output: file 76> #vu8(39 100 101 115 99 58 105 109 112 111 114 116 45 111 98 106 101 99 116 50 49 43 62 62 120 112 111 114 116 50 43 62 91 57 39 104 101 97 114 116 98 101 97 116 93 49 57 43 60 49 56 39 100 101 115 99 58 105 109 112 111 114 116 45 111 98 106 101 99 116 50 48 43 62 62 105 110 45 111 116 104 101 114 48 43 93 93 49 53 43 60 49 56 39 100 101 115 99 58 105 109 112 111 114 116 45 111 98 106 101 99 116 49 55 43 62 62 60 49 48 39 111 112 58 100 101 # …) …) In ice-9/boot-9.scm: 1706:22 1 (raise-exception _ #:continuable? _) 1705:22 0 (raise-exception _ #:continuable? _) ice-9/boot-9.scm:1705:22: In procedure raise-exception: ERROR: 1. &non-continuable stop 1368: kill #<unspecified>, waitpid (1368 . 0) 19 passed, 0 failed == pumphouse-lost.scm ;;; compiling /tmp/guix-build-guile-automate-0.0.0-dev.drv-0/source/tests/pumphouse-lost.scm ;;; compiled /tmp/guix-build-guile-automate-0.0.0-dev.drv-0/source/.cache/guile/ccache/3.0-LE-8-4.7/tmp/guix-build-guile-automate-0.0.0-dev.drv-0/source/tests/pumphouse-lost.scm.go http on port 41761 pumphouse listening on /tmp/guix-build-guile-automate-0.0.0-dev.drv-0/automate-tests-R3ldiD/automate-pumphouse-qPDzqR/socket admin: /tmp/guix-build-guile-automate-0.0.0-dev.drv-0/automate-tests-R3ldiD/automate-pumphouse-qPDzqR/admin remote admin: /tmp/guix-build-guile-automate-0.0.0-dev.drv-0/automate-tests-R3ldiD/automate-pumphouse-qPDzqR/remote-admin attached to the pumphouse of /tmp/guix-build-guile-automate-0.0.0-dev.drv-0/automate-tests-R3ldiD/automate-pumphouse-qPDzqR/any lstop 1436: kill #<unspecified>, waitpid (1436 . 0) ost the pumphouse; reconnecting cannot reach the pumphouse of /tmp/guix-build-guile-automate-0.0.0-dev.drv-0/automate-tests-R3ldiD/automate-pumphouse-qPDzqR/any; retrying every 1 seconds http on port 45149 pumphouse listening on /tmp/guix-build-guile-automate-0.0.0-dev.drv-0/automate-tests-R3ldiD/automate-pumphouse-qPDzqR/socket admin: /tmp/guix-build-guile-automate-0.0.0-dev.drv-0/automate-tests-R3ldiD/automate-pumphouse-qPDzqR/admin remote admin: /tmp/guix-build-guile-automate-0.0.0-dev.drv-0/automate-tests-R3ldiD/automate-pumphouse-qPDzqR/remote-admin registration (/): /tmp/guix-build-guile-automate-0.0.0-dev.drv-0/automate-tests-R3ldiD/automate-pumphouse-qPDzqR/any registration (tests/declared/): /tmp/guix-build-guile-automate-0.0.0-dev.drv-0/automate-tests-R3ldiD/automate-pumphouse-qPDzqR/declared Goblins exception: In message to #<local-object ^admin>: (registration (tests/only) #f) ice-9/boot-9.scm:1705:22: In procedure raise-exception: ERROR: 1. &automate-error: kind: declared-registrations irritants: () 2. &message: "this pumphouse's registrations are declared by its script, which is where to change them" 3. &irritants: () In goblins/core.scm: 1074:7 3 (syscaller-$ _ #<local-object ^admin> (registration (tests/only) #f)) In automate/pumphouse.scm: 582:4 2 (registration (tests/only) #f) In automate/model.scm: 119:2 1 (raise-automate-error _ _ . _) In ice-9/boot-9.scm: 1705:22 0 (raise-exception _ #:continuable? _) admin registration: this pumphouse's registrations are declared by its script, which is where to change them Goblins exception: In message to #<local-object ^admin>: (revoke (/) #f) ice-9/boot-9.scm:1705:22: In procedure raise-exception: ERROR: 1. &automate-error: kind: declared-registrations irritants: () 2. &message: "this pumphouse's registrations are declared by its script, which is where to change them" 3. &irritants: () In goblins/core.scm: 1074:7 3 (syscaller-$ _ #<local-object ^admin> (revoke (/) #f)) In automate/pumphouse.scm: 582:4 2 (revoke (/) #f) In automate/model.scm: 119:2 1 (raise-automate-error _ _ . _) In ice-9/boot-9.scm: 1705:22 0 (raise-exception _ #:continuable? _) admin revoke: this pumphouse's registrations are declared by its script, which is where to change them attached to the pumphouse of /tmp/guix-build-guile-automate-0.0.0-dev.drv-0/automate-tests-R3ldiD/automate-pumphouse-qPDzqR/any Goblins exception: In message to #<local-object ^admin>: (forget-pipeline tests/linger) ice-9/boot-9.scm:1705:22: In procedure raise-exception: ERROR: 1. &automate-error: kind: attached irritants: (tests/linger) 2. &message: "a pipeline process is attached under this name" 3. &irritants: (tests/linger) In goblins/core.scm: 1074:7 3 (syscaller-$ _ #<local-object ^admin> (forget-pipeline tests/linger)) In automate/pumphouse.scm: 64:4 2 (forget-pipeline! #<<pumphouse> records: #<local-object ^records> lives: #<hash-table 7ffff7819180 1/31> serving: #<hash-table 7ffff7819160 1/31> owners: #<hash-table 7ffff7819140 0/31> shared: #<hash-table 7ffff7819120 0/31> gates: #<hash-table 7ffff7819100 0/31> stopped: #<hash-table 7ffff78190e0 0/31> waiting: #<hash-table 7ffff78190c0 0/31> timers: #<hash-table 7ffff78190a0 0/31> tokens: #<hash-table 7ffff7819080 0/31> registrations: #<hash-table 7ffff7819060 2/31> registra…> …) In automate/model.scm: 119:2 1 (raise-automate-error _ _ . _) In ice-9/boot-9.scm: 1705:22 0 (raise-exception _ #:continuable? _) admin forget-pipeline: a pipeline process is attached under this name: tests/linger stop 1446: kill #<unspecified>, waitpid (1446 . 9) Goblins exception: In message to #<local-object fulfilled-handler>: (#f) ice-9/boot-9.scm:1705:22: In procedure raise-exception: ERROR: 1. &automate-error: kind: no-such-pipeline irritants: (tests/linger) 2. &message: "no such pipeline" 3. &irritants: (tests/linger) In goblins/core.scm: 1074:7 4 (syscaller-$ _ #<local-object fulfilled-handler> (#f)) 2038:14 3 (_ . _) In automate/pumphouse.scm: 72:10 2 (_ #f) In automate/model.scm: 119:2 1 (raise-automate-error _ _ . _) In ice-9/boot-9.scm: 1705:22 0 (raise-exception _ #:continuable? _) admin forget-pipeline: no such pipeline: tests/linger attached to the pumphouse of /tmp/guix-build-guile-automate-0.0.0-dev.drv-0/automate-tests-R3ldiD/automate-pumphouse-qPDzqR/any attached to the pumphouse of /tmp/guix-build-guile-automate-0.0.0-dev.drv-0/automate-tests-R3ldiD/automate-pumphouse-qPDzqR/any Goblins exception: In message to #<local-object ^pipeline-endpoint>: (run (run-request (id . "67013db713b2f997") (parameters (marker . "/tmp/guix-build-guile-automate-0.0.0-dev.drv-0/automate-tests-R3ldiD/automate-pumphouse-qPDzqR/linger-5")) (cause . #f) (ancestors))) ice-9/boot-9.scm:1705:22: In procedure raise-exception: ERROR: 1. &automate-error: kind: busy irritants: (tests/pool 1) 2. &message: "as many runs are in flight as this process takes" 3. &irritants: (tests/pool 1) In goblins/core.scm: 1074:7 2 (syscaller-$ _ #<local-object ^pipeline-endpoint> (run (run-request (id . "67013db713b2f997") (parameters (marker . "/tmp/guix-build-guile-automate-0.0.0-dev.drv-0/automate-tests-R3ldiD/automate-pumphouse-qPDzqR/linger-5")) (cause . #f) (ancestors)))) In automate/model.scm: 119:2 1 (raise-automate-error _ _ . _) In ice-9/boot-9.scm: 1705:22 0 (raise-exception _ #:continuable? _) tests/pool run: as many runs are in flight as this process takes: tests/pool, 1 Goblins exception: In message to #<local-object ^pipeline-endpoint>: (run (run-request (id . "67013db713b2f997") (parameters (marker . "/tmp/guix-build-guile-automate-0.0.0-dev.drv-0/automate-tests-R3ldiD/automate-pumphouse-qPDzqR/linger-5")) (cause . #f) (ancestors))) ice-9/boot-9.scm:1705:22: In procedure raise-exception: ERROR: 1. &automate-error: kind: busy irritants: (tests/pool 1) 2. &message: "as many runs are in flight as this process takes" 3. &irritants: (tests/pool 1) In goblins/core.scm: 1074:7 2 (syscaller-$ _ #<local-object ^pipeline-endpoint> (run (run-request (id . "67013db713b2f997") (parameters (marker . "/tmp/guix-build-guile-automate-0.0.0-dev.drv-0/automate-tests-R3ldiD/automate-pumphouse-qPDzqR/linger-5")) (cause . #f) (ancestors)))) In automate/model.scm: 119:2 1 (raise-automate-error _ _ . _) In ice-9/boot-9.scm: 1705:22 0 (raise-exception _ #:continuable? _) tests/pool run: as many runs are in flight as this process takes: tests/pool, 1 Goblins exception: In message to #<local-object broken-handler>: ((automate-error busy "as many runs are in flight as this process takes" ("tests/pool" "1") "#<&compound-exception components: (#<&automate-error kind: busy irritants: (tests/pool 1)> #<&message message: \"as many runs are in flight as this process takes\"> #<&irritants irritants: (tests/pool 1)>)>" "")) ice-9/boot-9.scm:1705:22: In procedure raise-exception: ERROR: 1. &automate-error: kind: busy irritants: (tests/pool) 2. &message: "every pipeline process serving the pipeline is busy" 3. &irritants: (tests/pool) In goblins/core.scm: 1074:7 3 (syscaller-$ _ #<local-object broken-handler> ((automate-error busy "as many runs are in flight as this process takes" ("tests/pool" "1") "#<&compound-exception components: (#<&automate-error kind: busy irritants: (tests/pool 1)> #<&message message: \"as many runs are in flight as this process takes\"> #<&irritants irritants: (tests/pool 1)>)>" ""))) 2038:14 2 (_ . _) In automate/model.scm: 119:2 1 (raise-automate-error _ _ . _) In ice-9/boot-9.scm: 1705:22 0 (raise-exception _ #:continuable? _) admin run: every pipeline process serving the pipeline is busy: tests/pool stop 1475: kill #<unspecified>, waitpid (1475 . 9) attached to the pumphouse of /tmp/guix-build-guile-automate-0.0.0-dev.drv-0/automate-tests-R3ldiD/automate-pumphouse-qPDzqR/any Goblins exception: In message to #<local-object ^pipeline-endpoint>: (run (run-request (id . "2639c6224a00c9a5") (parameters (marker . "/tmp/guix-build-guile-automate-0.0.0-dev.drv-0/automate-tests-R3ldiD/automate-pumphouse-qPDzqR/linger-7")) (cause . #f) (ancestors))) ice-9/boot-9.scm:1705:22: In procedure raise-exception: ERROR: 1. &automate-error: kind: busy irritants: (tests/pool 1) 2. &message: "as many runs are in flight as this process takes" 3. &irritants: (tests/pool 1) In goblins/core.scm: 1074:7 2 (syscaller-$ _ #<local-object ^pipeline-endpoint> (run (run-request (id . "2639c6224a00c9a5") (parameters (marker . "/tmp/guix-build-guile-automate-0.0.0-dev.drv-0/automate-tests-R3ldiD/automate-pumphouse-qPDzqR/linger-7")) (cause . #f) (ancestors)))) In automate/model.scm: 119:2 1 (raise-automate-error _ _ . _) In ice-9/boot-9.scm: 1705:22 0 (raise-exception _ #:continuable? _) tests/pool run: as many runs are in flight as this process takes: tests/pool, 1 Goblins exception: In message to #<local-object broken-handler>: ((automate-error busy "as many runs are in flight as this process takes" ("tests/pool" "1") "#<&compound-exception components: (#<&automate-error kind: busy irritants: (tests/pool 1)> #<&message message: \"as many runs are in flight as this process takes\"> #<&irritants irritants: (tests/pool 1)>)>" "")) ice-9/boot-9.scm:1705:22: In procedure raise-exception: ERROR: 1. &automate-error: kind: busy irritants: (tests/pool) 2. &message: "every pipeline process serving the pipeline is busy" 3. &irritants: (tests/pool) In goblins/core.scm: 1074:7 3 (syscaller-$ _ #<local-object broken-handler> ((automate-error busy "as many runs are in flight as this process takes" ("tests/pool" "1") "#<&compound-exception components: (#<&automate-error kind: busy irritants: (tests/pool 1)> #<&message message: \"as many runs are in flight as this process takes\"> #<&irritants irritants: (tests/pool 1)>)>" ""))) 2038:14 2 (_ . _) In automate/model.scm: 119:2 1 (raise-automate-error _ _ . _) In ice-9/boot-9.scm: 1705:22 0 (raise-exception _ #:continuable? _) admin run: every pipeline process serving the pipeline is busy: tests/pool stop 1513: kill #<unspecified>, waitpid (1513 . 9) stop 1476: kill #<unspecified>, waitpid (1476 . 9) stop 1456: kill #<unspecified>, waitpid (1456 . 0) 37 passed, 0 failed == pumphouse-replay.scm ;;; compiling /tmp/guix-build-guile-automate-0.0.0-dev.drv-0/source/tests/pumphouse-replay.scm ;;; compiled /tmp/guix-build-guile-automate-0.0.0-dev.drv-0/source/.cache/guile/ccache/3.0-LE-8-4.7/tmp/guix-build-guile-automate-0.0.0-dev.drv-0/source/tests/pumphouse-replay.scm.go http on port 44943 pumphouse listening on /tmp/guix-build-guile-automate-0.0.0-dev.drv-0/automate-tests-R3ldiD/automate-pumphouse-IyBEjd/socket admin: /tmp/guix-build-guile-automate-0.0.0-dev.drv-0/automate-tests-R3ldiD/automate-pumphouse-IyBEjd/admin remote admin: /tmp/guix-build-guile-automate-0.0.0-dev.drv-0/automate-tests-R3ldiD/automate-pumphouse-IyBEjd/remote-admin attached to the pumphouse of /tmp/guix-build-guile-automate-0.0.0-dev.drv-0/automate-tests-R3ldiD/automate-pumphouse-IyBEjd/any lost the pumphouse; rstop 1532: kill #<unspecified>, waitpid (1532 . 0) econnecting cannot reach the pumphouse of /tmp/guix-build-guile-automate-0.0.0-dev.drv-0/automate-tests-R3ldiD/automate-pumphouse-IyBEjd/any; retrying every 1 seconds http on port 46879 pumphouse listening on /tmp/guix-build-guile-automate-0.0.0-dev.drv-0/automate-tests-R3ldiD/automate-pumphouse-IyBEjd/socket admin: /tmp/guix-build-guile-automate-0.0.0-dev.drv-0/automate-tests-R3ldiD/automate-pumphouse-IyBEjd/admin remote admin: /tmp/guix-build-guile-automate-0.0.0-dev.drv-0/automate-tests-R3ldiD/automate-pumphouse-IyBEjd/remote-admin attached to the pumphouse of /tmp/guix-build-guile-automate-0.0.0-dev.drv-0/automate-tests-R3ldiD/automate-pumphouse-IyBEjd/any stop 1542: kill #<unspecified>, waitpid (1542 . 9) attached to the pumphouse of /tmp/guix-build-guile-automate-0.0.0-dev.drv-0/automate-tests-R3ldiD/automate-pumphouse-IyBEjd/any stop 1580: kill #<unspecified>, waitpid (1580 . 9) stop 1557: kill #<unspecified>, waitpid (1557 . 0) 14 passed, 0 failed == pumphouse-restart.scm ;;; compiling /tmp/guix-build-guile-automate-0.0.0-dev.drv-0/source/tests/pumphouse-restart.scm ;;; compiled /tmp/guix-build-guile-automate-0.0.0-dev.drv-0/source/.cache/guile/ccache/3.0-LE-8-4.7/tmp/guix-build-guile-automate-0.0.0-dev.drv-0/source/tests/pumphouse-restart.scm.go http on port 38369 pumphouse listening on /tmp/guix-build-guile-automate-0.0.0-dev.drv-0/automate-tests-R3ldiD/automate-pumphouse-3DHjko/socket admin: /tmp/guix-build-guile-automate-0.0.0-dev.drv-0/automate-tests-R3ldiD/automate-pumphouse-3DHjko/admin remote admin: /tmp/guix-build-guile-automate-0.0.0-dev.drv-0/automate-tests-R3ldiD/automate-pumphouse-3DHjko/remote-admin attached to the pumphouse of /tmp/guix-build-guile-automate-0.0.0-dev.drv-0/automate-tests-R3ldiD/automate-pumphouse-3DHjko/any attached to the pumphouse lost the pumphouse; reconnecting lost the pumphouse; reconnecting cannot reach the pumphouse of /tmp/guix-build-guile-automate-0.0.0-dev.drv-0/automate-tests-R3ldiD/automate-pumphouse-3DHjko/any; retrying every 1 seconds http on port 40405 pumphouse listening on /tmp/guix-build-guile-automate-0.0.0-dev.drv-0/automate-tests-R3ldiD/automate-pumphouse-3DHjko/socket admin: /tmp/guix-build-guile-automate-0.0.0-dev.drv-0/automate-tests-R3ldiD/automate-pumphouse-3DHjko/admin remote admin: /tmp/guix-build-guile-automate-0.0.0-dev.drv-0/automate-tests-R3ldiD/automate-pumphouse-3DHjko/remote-admin attached to the pumphouse attached to the pumphouse of /tmp/guix-build-guile-automate-0.0.0-dev.drv-0/automate-tests-R3ldiD/automate-pumphouse-3DHjko/any stop 1609: kill #<unspecified>, waitpid (1609 . 9) stop 1610: kill #<unspecified>, waitpid (1610 . 9) stop 1656: kill #<unspecified>, waitpid (1656 . 0) 19 passed, 0 failed == pumphouse-shepherd.scm ;;; compiling /tmp/guix-build-guile-automate-0.0.0-dev.drv-0/source/tests/pumphouse-shepherd.scm ;;; compiled /tmp/guix-build-guile-automate-0.0.0-dev.drv-0/source/.cache/guile/ccache/3.0-LE-8-4.7/tmp/guix-build-guile-automate-0.0.0-dev.drv-0/source/tests/pumphouse-shepherd.scm.go http on port 45745 pumphouse listening on /tmp/guix-build-guile-automate-0.0.0-dev.drv-0/automate-tests-R3ldiD/automate-pumphouse-YKiZR3/socket admin: /tmp/guix-build-guile-automate-0.0.0-dev.drv-0/automate-tests-R3ldiD/automate-pumphouse-YKiZR3/admin remote admin: /tmp/guix-build-guile-automate-0.0.0-dev.drv-0/automate-tests-R3ldiD/automate-pumphouse-YKiZR3/remote-admin registration (/): /tmp/guix-build-guile-automate-0.0.0-dev.drv-0/automate-tests-R3ldiD/automate-pumphouse-YKiZR3/any registration (tests/registered): /tmp/guix-build-guile-automate-0.0.0-dev.drv-0/automate-tests-R3ldiD/ps-l706sp/secrets/registered/pumphouse GNU Shepherd 1.0.9 (Guile 3.0.9, Fibers 1.4.3, x86_64-unknown-linux-gnu) Starting service root... Service root started. Service root running with value #<<process> id: 1703 command: #f>. Service root has been started. Configuration successfully loaded from '/tmp/guix-build-guile-automate-0.0.0-dev.drv-0/automate-tests-R3ldiD/ps-l706sp/shepherd.scm'. Starting service shepherd-bridge... Service shepherd-bridge started. Service shepherd-bridge running with value #<<process> id: 1709 command: ("/gnu/store/k7vkw9x3wl3lni6a0i2w8xz2z8ylrqyz-guile-3.0.11/bin/guile" "-L" "/tmp/guix-build-guile-automate-0.0.0-dev.drv-0/source" "-L" "/gnu/store/r5gafvw9iapq6173liw37bzxj40bslhs-guile-documenta-0.4.0/share/guile/site/3.0" "-L" "/gnu/store/qzml053shmjml5vj6rbcfss5247h20f6-guile-syntax-highlight-0.3.1/share/guile/site/3.0" "-L" "/gnu/store/7a6l3fzjvr3nvbnw579wdkhhszzzh3ql-guix-1.5.0-6.64d4de2/share/guile/site/3.0" "-L" "/gnu/store/zplkplr3qmp5dpvhcxpgqr1lg44wmxyk-guile-goblins-0.18.0/share/guile/site/3.0" "-L" "/gnu/store/5la7a0imnji190xnfmxf0jrsp82dn9hq-guile-fibers-1.4.3/share/guile/site/3.0" "-L" "/gnu/store/z4fnbwa7d6dprqvd7f89wcifq6ggr2wm-guile-gcrypt-0.5.0/share/guile/site/3.0" "-L" "/gnu/store/b9928rpaj24whj9cz36yd1h28w7pwphq-guile-gnutls-5.0.2/share/guile/site/3.0" "-L" "/gnu/store/nw7d5iijwm9sa16k2swxjalgp0vlm01v-guile-json-4.7.3/share/guile/site/3.0" "-L" "/gnu/store/gyf1hm3gzbq00aw3m9x1xickf3zs3pq8-guile-knots-0.1-39.3417d25/share/guile/site/3.0" "-L" "/gnu/store/wsg7chjw2cg6xnp4il5caff5w0w69ikc-guile-sqlite3-0.1.3/share/guile/site/3.0" "-L" "/gnu/store/8n90dzhz177l1lz8bjrxsgbiyh1kmjap-guile-zlib-0.2.2/share/guile/site/3.0" "-L" "/gnu/store/2qm9a3n19pnznv791jvglb4sgh1jda3s-guile-safsaf-0.5-1.8b35410/share/guile/site/3.0" "-L" "/gnu/store/9ia4lplmfhpdxnnkvk0zyhyainyn0r0q-guile-prometheus-0-11.8f70b4b/share/guile/site/3.0" "-L" "/gnu/store/fp4rjwzvrm309wg11jahx8qcm7ypkai3-guile-ares-rs-0.9.8/share/guile/site/3.0" "-L" "/gnu/store/hfx188ymz9y9ialr175lqifn3b6xfdnz-shepherd-1.0.9/share/guile/site/3.0" "-L" "/gnu/store/x9ypa71lzv9jrd5n0qxq51hxnra83z2x-guile-lib-0.2.8.1/share/guile/site/3.0" "-L" "/gnu/store/9rd4c5w765bmsx0cimk0idpfasicvcdr-guile-config-0.5.1/share/guile/site/3.0" "-L" "/gnu/store/lsys62yw1wnmchmvv3q5x7bzkghyasil-guile-zstd-0.1.1/share/guile/site/3.0" "-L" "/gnu/store/gq36qbm22984252qxrzrgvrqzx807kd0-guile-lzlib-0.4.0/share/guile/site/3.0" "-L" "/gnu/store/axcsnac5kji5p4apyf67jqgpbvs47hcm-guile-git-0.12.1/share/guile/site/3.0" "-L" "/gnu/store/3xl1r2ppwspvhrlv4rzdcw3izhnvlkzm-guile-ssh-1.0.0/share/guile/site/3.0" "-L" "/gnu/store/dkzraln87ih1cbl36npg9fgyfqnmpqhh-guile-semver-0.2.0/share/guile/site/3.0" "-L" "/gnu/store/06k0pq8d20w6f3ymkgdwkm6k6rf2v7yj-guile-lib-0.2.8.1/share/guile/site/3.0" "-L" "/gnu/store/gl031z5csmpkyvicv8q4a3wjjgl5gqbi-guile-avahi-0.4.1/share/guile/site/3.0" "-L" "/gnu/store/k1yhnx32pjwr409ag3l25816ylasvzrf-guile-websocket-0.3.0/share/guile/site/3.0" "-L" "/gnu/store/c7k95lcd985bph7kycpjcwsbw0ky0yw1-guile-bstructs-0.2.0/share/guile/site/3.0" "-L" "/gnu/store/a7k8b77qmv34vjbw5gkgm160zph4lxlg-guile-webutils-0.1-1.d309d65/share/guile/site/3.0" "-L" "/gnu/store/cjnz2ikdas5ih7x2gs95fgi9q6f376gk-guile-bytestructures-2.0.2/share/guile/site/3.0" "-L" "/gnu/store/kwd8v8nwvw00d6akyr58d5bjqjcmfy5d-guile-irregex-0.9.12/share/guile/site/3.0" "-L" "/gnu/store/k7vkw9x3wl3lni6a0i2w8xz2z8ylrqyz-guile-3.0.11/share/guile/3.0" "-L" "/gnu/store/k7vkw9x3wl3lni6a0i2w8xz2z8ylrqyz-guile-3.0.11/share/guile/site/3.0" "-L" "/gnu/store/k7vkw9x3wl3lni6a0i2w8xz2z8ylrqyz-guile-3.0.11/share/guile/site" "-L" "/gnu/store/k7vkw9x3wl3lni6a0i2w8xz2z8ylrqyz-guile-3.0.11/share/guile" "-C" "/gnu/store/j9h7qdlzcvz7jfyb3ybmn8260n132xpj-guile-automate-0.0.0-dev/lib/guile/3.0/site-ccache" "-C" "/gnu/store/j9h7qdlzcvz7jfyb3ybmn8260n132xpj-guile-automate-0.0.0-dev/lib/guile/3.0/site-ccache/" "-C" "/gnu/store/r5gafvw9iapq6173liw37bzxj40bslhs-guile-documenta-0.4.0/lib/guile/3.0/site-ccache" "-C" "/gnu/store/r5gafvw9iapq6173liw37bzxj40bslhs-guile-documenta-0.4.0/share/guile/site/3.0" "-C" "/gnu/store/qzml053shmjml5vj6rbcfss5247h20f6-guile-syntax-highlight-0.3.1/lib/guile/3.0/site-ccache" "-C" "/gnu/store/qzml053shmjml5vj6rbcfss5247h20f6-guile-syntax-highlight-0.3.1/share/guile/site/3.0" "-C" "/gnu/store/7a6l3fzjvr3nvbnw579wdkhhszzzh3ql-guix-1.5.0-6.64d4de2/lib/guile/3.0/site-ccache" "-C" "/gnu/store/7a6l3fzjvr3nvbnw579wdkhhszzzh3ql-guix-1.5.0-6.64d4de2/share/guile/site/3.0" "-C" "/gnu/store/zplkplr3qmp5dpvhcxpgqr1lg44wmxyk-guile-goblins-0.18.0/lib/guile/3.0/site-ccache" "-C" "/gnu/store/zplkplr3qmp5dpvhcxpgqr1lg44wmxyk-guile-goblins-0.18.0/share/guile/site/3.0" "-C" "/gnu/store/5la7a0imnji190xnfmxf0jrsp82dn9hq-guile-fibers-1.4.3/lib/guile/3.0/site-ccache" "-C" "/gnu/store/5la7a0imnji190xnfmxf0jrsp82dn9hq-guile-fibers-1.4.3/share/guile/site/3.0" "-C" "/gnu/store/z4fnbwa7d6dprqvd7f89wcifq6ggr2wm-guile-gcrypt-0.5.0/lib/guile/3.0/site-ccache" "-C" "/gnu/store/z4fnbwa7d6dprqvd7f89wcifq6ggr2wm-guile-gcrypt-0.5.0/share/guile/site/3.0" "-C" "/gnu/store/b9928rpaj24whj9cz36yd1h28w7pwphq-guile-gnutls-5.0.2/lib/guile/3.0/site-ccache" "-C" "/gnu/store/b9928rpaj24whj9cz36yd1h28w7pwphq-guile-gnutls-5.0.2/share/guile/site/3.0" "-C" "/gnu/store/nw7d5iijwm9sa16k2swxjalgp0vlm01v-guile-json-4.7.3/lib/guile/3.0/site-ccache" "-C" "/gnu/store/nw7d5iijwm9sa16k2swxjalgp0vlm01v-guile-json-4.7.3/share/guile/site/3.0" "-C" "/gnu/store/gyf1hm3gzbq00aw3m9x1xickf3zs3pq8-guile-knots-0.1-39.3417d25/lib/guile/3.0/site-ccache" "-C" "/gnu/store/gyf1hm3gzbq00aw3m9x1xickf3zs3pq8-guile-knots-0.1-39.3417d25/share/guile/site/3.0" "-C" "/gnu/store/wsg7chjw2cg6xnp4il5caff5w0w69ikc-guile-sqlite3-0.1.3/lib/guile/3.0/site-ccache" "-C" "/gnu/store/wsg7chjw2cg6xnp4il5caff5w0w69ikc-guile-sqlite3-0.1.3/share/guile/site/3.0" "-C" "/gnu/store/8n90dzhz177l1lz8bjrxsgbiyh1kmjap-guile-zlib-0.2.2/lib/guile/3.0/site-ccache" "-C" "/gnu/store/8n90dzhz177l1lz8bjrxsgbiyh1kmjap-guile-zlib-0.2.2/share/guile/site/3.0" "-C" "/gnu/store/2qm9a3n19pnznv791jvglb4sgh1jda3s-guile-safsaf-0.5-1.8b35410/lib/guile/3.0/site-ccache" "-C" "/gnu/store/2qm9a3n19pnznv791jvglb4sgh1jda3s-guile-safsaf-0.5-1.8b35410/share/guile/site/3.0" "-C" "/gnu/store/9ia4lplmfhpdxnnkvk0zyhyainyn0r0q-guile-prometheus-0-11.8f70b4b/lib/guile/3.0/site-ccache" "-C" "/gnu/store/9ia4lplmfhpdxnnkvk0zyhyainyn0r0q-guile-prometheus-0-11.8f70b4b/share/guile/site/3.0" "-C" "/gnu/store/fp4rjwzvrm309wg11jahx8qcm7ypkai3-guile-ares-rs-0.9.8/lib/guile/3.0/site-ccache" "-C" "/gnu/store/fp4rjwzvrm309wg11jahx8qcm7ypkai3-guile-ares-rs-0.9.8/share/guile/site/3.0" "-C" "/gnu/store/hfx188ymz9y9ialr175lqifn3b6xfdnz-shepherd-1.0.9/lib/guile/3.0/site-ccache" "-C" "/gnu/store/hfx188ymz9y9ialr175lqifn3b6xfdnz-shepherd-1.0.9/share/guile/site/3.0" "-C" "/gnu/store/x9ypa71lzv9jrd5n0qxq51hxnra83z2x-guile-lib-0.2.8.1/lib/guile/3.0/site-ccache" "-C" "/gnu/store/x9ypa71lzv9jrd5n0qxq51hxnra83z2x-guile-lib-0.2.8.1/share/guile/site/3.0" "-C" "/gnu/store/9rd4c5w765bmsx0cimk0idpfasicvcdr-guile-config-0.5.1/lib/guile/3.0/site-ccache" "-C" "/gnu/store/9rd4c5w765bmsx0cimk0idpfasicvcdr-guile-config-0.5.1/share/guile/site/3.0" "-C" "/gnu/store/lsys62yw1wnmchmvv3q5x7bzkghyasil-guile-zstd-0.1.1/lib/guile/3.0/site-ccache" "-C" "/gnu/store/lsys62yw1wnmchmvv3q5x7bzkghyasil-guile-zstd-0.1.1/share/guile/site/3.0" "-C" "/gnu/store/gq36qbm22984252qxrzrgvrqzx807kd0-guile-lzlib-0.4.0/lib/guile/3.0/site-ccache" "-C" "/gnu/store/gq36qbm22984252qxrzrgvrqzx807kd0-guile-lzlib-0.4.0/share/guile/site/3.0" "-C" "/gnu/store/axcsnac5kji5p4apyf67jqgpbvs47hcm-guile-git-0.12.1/lib/guile/3.0/site-ccache" "-C" "/gnu/store/axcsnac5kji5p4apyf67jqgpbvs47hcm-guile-git-0.12.1/share/guile/site/3.0" "-C" "/gnu/store/3xl1r2ppwspvhrlv4rzdcw3izhnvlkzm-guile-ssh-1.0.0/lib/guile/3.0/site-ccache" "-C" "/gnu/store/3xl1r2ppwspvhrlv4rzdcw3izhnvlkzm-guile-ssh-1.0.0/share/guile/site/3.0" "-C" "/gnu/store/dkzraln87ih1cbl36npg9fgyfqnmpqhh-guile-semver-0.2.0/lib/guile/3.0/site-ccache" "-C" "/gnu/store/dkzraln87ih1cbl36npg9fgyfqnmpqhh-guile-semver-0.2.0/share/guile/site/3.0" "-C" "/gnu/store/06k0pq8d20w6f3ymkgdwkm6k6rf2v7yj-guile-lib-0.2.8.1/lib/guile/3.0/site-ccache" "-C" "/gnu/store/06k0pq8d20w6f3ymkgdwkm6k6rf2v7yj-guile-lib-0.2.8.1/share/guile/site/3.0" "-C" "/gnu/store/gl031z5csmpkyvicv8q4a3wjjgl5gqbi-guile-avahi-0.4.1/lib/guile/3.0/site-ccache" "-C" "/gnu/store/gl031z5csmpkyvicv8q4a3wjjgl5gqbi-guile-avahi-0.4.1/share/guile/site/3.0" "-C" "/gnu/store/k1yhnx32pjwr409ag3l25816ylasvzrf-guile-websocket-0.3.0/lib/guile/3.0/site-ccache" "-C" "/gnu/store/k1yhnx32pjwr409ag3l25816ylasvzrf-guile-websocket-0.3.0/share/guile/site/3.0" "-C" "/gnu/store/c7k95lcd985bph7kycpjcwsbw0ky0yw1-guile-bstructs-0.2.0/lib/guile/3.0/site-ccache" "-C" "/gnu/store/c7k95lcd985bph7kycpjcwsbw0ky0yw1-guile-bstructs-0.2.0/share/guile/site/3.0" "-C" "/gnu/store/a7k8b77qmv34vjbw5gkgm160zph4lxlg-guile-webutils-0.1-1.d309d65/share/guile/site/3.0" "-C" "/gnu/store/cjnz2ikdas5ih7x2gs95fgi9q6f376gk-guile-bytestructures-2.0.2/lib/guile/3.0/site-ccache" "-C" "/gnu/store/cjnz2ikdas5ih7x2gs95fgi9q6f376gk-guile-bytestructures-2.0.2/share/guile/site/3.0" "-C" "/gnu/store/kwd8v8nwvw00d6akyr58d5bjqjcmfy5d-guile-irregex-0.9.12/lib/guile/3.0/site-ccache" "-C" "/gnu/store/kwd8v8nwvw00d6akyr58d5bjqjcmfy5d-guile-irregex-0.9.12/share/guile/site/3.0" "-C" "/gnu/store/k7vkw9x3wl3lni6a0i2w8xz2z8ylrqyz-guile-3.0.11/lib/guile/3.0/ccache" "-C" "/gnu/store/k7vkw9x3wl3lni6a0i2w8xz2z8ylrqyz-guile-3.0.11/lib/guile/3.0/site-ccache" "/tmp/guix-build-guile-automate-0.0.0-dev.drv-0/automate-tests-R3ldiD/ps-l706sp/bridge.scm")>. Service shepherd-bridge has been started. Successfully started 1 service in the background. attached to the pumphouse of /tmp/guix-build-guile-automate-0.0.0-dev.drv-0/automate-tests-R3ldiD/automate-pumphouse-YKiZR3/any stop 1717: kill #<unspecified>, waitpid (1717 . 9) Stopping service root... Exiting shepherd... Stopping service shepherd-bridge... Service shepherd-bridge stopped. Service shepherd-bridge is now stopped. Exiting. (started quick) run 0ce73e5d4990453f reported to the pumphouse (launched quick 1794) (provided quick value) (output quick value done) (finished quick succeeded) (retired quick) (exited quick 0) run succeeded quick: succeeded run-pipeline-daemon: error: --once names no pipeline of this program's definitions: tests/absent stop 1693: kill #<unspecified>, waitpid (1693 . 0) 17 passed, 0 failed == pumphouse-stopping.scm ;;; compiling /tmp/guix-build-guile-automate-0.0.0-dev.drv-0/source/tests/pumphouse-stopping.scm ;;; compiled /tmp/guix-build-guile-automate-0.0.0-dev.drv-0/source/.cache/guile/ccache/3.0-LE-8-4.7/tmp/guix-build-guile-automate-0.0.0-dev.drv-0/source/tests/pumphouse-stopping.scm.go http on port 33977 pumphouse listening on /tmp/guix-build-guile-automate-0.0.0-dev.drv-0/automate-tests-R3ldiD/automate-pumphouse-YMdx6j/socket admin: /tmp/guix-build-guile-automate-0.0.0-dev.drv-0/automate-tests-R3ldiD/automate-pumphouse-YMdx6j/admin remote admin: /tmp/guix-build-guile-automate-0.0.0-dev.drv-0/automate-tests-R3ldiD/automate-pumphouse-YMdx6j/remote-admin attached to the pumphouse of /tmp/guix-build-guile-automate-0.0.0-dev.drv-0/automate-tests-R3ldiD/automate-pumphouse-YMdx6j/any stopping: taking no more runs; 1 in flight attached to the pumphouse of /tmp/guix-build-guile-automate-0.0.0-dev.drv-0/automate-tests-R3ldiD/automate-pumphouse-YMdx6j/any stopping: taking no more runs; 1 in flight Goblins exception: In message to #<local-object ^pipeline-endpoint>: (run (run-request (id . "1a2aae16ce87d8f4") (parameters) (cause . #f) (ancestors))) ice-9/boot-9.scm:1705:22: In procedure raise-exception: ERROR: 1. &automate-error: kind: busy irritants: (tests/stopping/nap) 2. &message: "this process is stopping" 3. &irritants: (tests/stopping/nap) In goblins/core.scm: 1074:7 2 (syscaller-$ _ #<local-object ^pipeline-endpoint> (run (run-request (id . "1a2aae16ce87d8f4") (parameters) (cause . #f) (ancestors)))) In automate/model.scm: 119:2 1 (raise-automate-error _ _ . _) In ice-9/boot-9.scm: 1705:22 0 (raise-exception _ #:continuable? _) tests/stopping/nap run: this process is stopping: tests/stopping/nap Goblins exception: In message to #<local-object broken-handler>: ((automate-error busy "this process is stopping" ("tests/stopping/nap") "#<&compound-exception components: (#<&automate-error kind: busy irritants: (tests/stopping/nap)> #<&message message: \"this process is stopping\"> #<&irritants irritants: (tests/stopping/nap)>)>" "")) ice-9/boot-9.scm:1705:22: In procedure raise-exception: ERROR: 1. &automate-error: kind: busy irritants: (tests/stopping/nap) 2. &message: "every pipeline process serving the pipeline is busy" 3. &irritants: (tests/stopping/nap) In goblins/core.scm: 1074:7 3 (syscaller-$ _ #<local-object broken-handler> ((automate-error busy "this process is stopping" ("tests/stopping/nap") "#<&compound-exception components: (#<&automate-error kind: busy irritants: (tests/stopping/nap)> #<&message message: \"this process is stopping\"> #<&irritants irritants: (tests/stopping/nap)>)>" ""))) 2038:14 2 (_ . _) In automate/model.scm: 119:2 1 (raise-automate-error _ _ . _) In ice-9/boot-9.scm: 1705:22 0 (raise-exception _ #:continuable? _) admin run: every pipeline process serving the pipeline is busy: tests/stopping/nap stopping: 1 still in flight at the deadline; aborting stop 1854: kill #<unspecified>, waitpid (1854 . 9) removed what an earlier process left in /tmp/guix-build-guile-automate-0.0.0-dev.drv-0/automate-tests-R3ldiD/automate-pumphouse-YMdx6j/working stop 1863: kill #<unspecified>, waitpid (1863 . 9) run 345b7942b0d91c57 reported to the pumphouse run errored linger: abandoned stop 1806: kill #<unspecified>, waitpid (1806 . 0) 20 passed, 0 failed == pumphouse-timers.scm ;;; compiling /tmp/guix-build-guile-automate-0.0.0-dev.drv-0/source/tests/pumphouse-timers.scm ;;; compiled /tmp/guix-build-guile-automate-0.0.0-dev.drv-0/source/.cache/guile/ccache/3.0-LE-8-4.7/tmp/guix-build-guile-automate-0.0.0-dev.drv-0/source/tests/pumphouse-timers.scm.go http on port 35209 pumphouse listening on /tmp/guix-build-guile-automate-0.0.0-dev.drv-0/automate-tests-R3ldiD/automate-pumphouse-QAKrLf/socket admin: /tmp/guix-build-guile-automate-0.0.0-dev.drv-0/automate-tests-R3ldiD/automate-pumphouse-QAKrLf/admin remote admin: /tmp/guix-build-guile-automate-0.0.0-dev.drv-0/automate-tests-R3ldiD/automate-pumphouse-QAKrLf/remote-admin attached to the pumphouse of /tmp/guix-build-guile-automate-0.0.0-dev.drv-0/automate-tests-R3ldiD/automate-pumphouse-QAKrLf/any 2026-10-14 17:30:18 (with-exception-handler) INFO: POST /output/d6d5ff8944409d45/tick 200 5ms 2026-10-14 17:30:19 (with-exception-handler) INFO: POST /output/598d4d86af0bd304/tick 200 5ms Goblins exception: In message to #<local-object ^admin>: (pause tests/no-such-timer) ice-9/boot-9.scm:1705:22: In procedure raise-exception: ERROR: 1. &automate-error: kind: no-timer irritants: (tests/no-such-timer) 2. &message: "no timer of this name" 3. &irritants: (tests/no-such-timer) In goblins/core.scm: 1074:7 3 (syscaller-$ _ #<local-object ^admin> (pause tests/no-such-timer)) In automate/pumphouse.scm: 674:6 2 (pause _) In automate/model.scm: 119:2 1 (raise-automate-error _ _ . _) In ice-9/boot-9.scm: 1705:22 0 (raise-exception _ #:continuable? _) admin pause: no timer of this name: tests/no-such-timer Goblins exception: In message to #<local-object ^admin>: (pause tests/no-such-timer) ice-9/boot-9.scm:1705:22: In procedure raise-exception: ERROR: 1. &automate-error: kind: no-timer irritants: (tests/no-such-timer) 2. &message: "no timer of this name" 3. &irritants: (tests/no-such-timer) In goblins/core.scm: 1074:7 3 (syscaller-$ _ #<local-object ^admin> (pause tests/no-such-timer)) In automate/pumphouse.scm: 674:6 2 (pause _) In automate/model.scm: 119:2 1 (raise-automate-error _ _ . _) In ice-9/boot-9.scm: 1705:22 0 (raise-exception _ #:continuable? _) admin pause: no timer of this name: tests/no-such-timer Goblins exception: In message to #<local-object ^pipeline-endpoint>: (run (run-request (id . "faa7a66d268ff76f") (parameters) (cause . #f) (ancestors))) ice-9/boot-9.scm:1705:22: In procedure raise-exception: ERROR: 1. &automate-error: kind: missing-parameter irritants: (n) 2. &message: "run request lacks a parameter" 3. &irritants: (n) In goblins/core.scm: 1074:7 4 (syscaller-$ _ #<local-object ^pipeline-endpoint> (run (run-request (id . "faa7a66d268ff76f") (parameters) (cause . #f) (ancestors)))) In automate/pipeline/daemon.scm: 491:7 3 (run (run-request (id . "faa7a66d268ff76f") (parameters) (cause . #f) (ancestors))) In srfi/srfi-1.scm: 750:9 2 (for-each #<procedure 7ffff59d4420 at automate/pipeline.scm:1103:12 (entry)> ((param (name n)))) In automate/model.scm: 119:2 1 (raise-automate-error _ _ . _) In ice-9/boot-9.scm: 1705:22 0 (raise-exception _ #:continuable? _) tests/tick run: run request lacks a parameter: n admin run: run request lacks a parameter: n admin run: no answer in time: tests/hook 2026-10-14 17:30:26 (with-exception-handler) INFO: POST /output/6c4b0a506ffe2a73/tick 200 3ms stop 1901: kill #<unspecified>, waitpid (1901 . 9) stop 1891: kill #<unspecified>, waitpid (1891 . 0) 15 passed, 0 failed == pumphouse.scm ;;; compiling /tmp/guix-build-guile-automate-0.0.0-dev.drv-0/source/tests/pumphouse.scm ;;; compiled /tmp/guix-build-guile-automate-0.0.0-dev.drv-0/source/.cache/guile/ccache/3.0-LE-8-4.7/tmp/guix-build-guile-automate-0.0.0-dev.drv-0/source/tests/pumphouse.scm.go http on port 41985 pumphouse listening on /tmp/guix-build-guile-automate-0.0.0-dev.drv-0/automate-tests-R3ldiD/automate-pumphouse-uY9cez/socket admin: /tmp/guix-build-guile-automate-0.0.0-dev.drv-0/automate-tests-R3ldiD/automate-pumphouse-uY9cez/admin remote admin: /tmp/guix-build-guile-automate-0.0.0-dev.drv-0/automate-tests-R3ldiD/automate-pumphouse-uY9cez/remote-admin attached to the pumphouse of /tmp/guix-build-guile-automate-0.0.0-dev.drv-0/automate-tests-R3ldiD/automate-pumphouse-uY9cez/any Goblins exception: In message to #<local-object fulfilled-handler>: (((pipeline . tests/sum) (outcome . succeeded) (instance . "localhost"))) ice-9/boot-9.scm:1705:22: In procedure raise-exception: ERROR: 1. &automate-error: kind: invalid-request irritants: ("b85c93b502a50bc1" tests/sum) 2. &message: "the run is of another pipeline" 3. &irritants: ("b85c93b502a50bc1" tests/sum) In goblins/core.scm: 1074:7 3 (syscaller-$ _ #<local-object fulfilled-handler> (((pipeline . tests/sum) (outcome . succeeded) (instance . "localhost")))) 2038:14 2 (_ . _) In automate/model.scm: 119:2 1 (raise-automate-error _ _ . _) In ice-9/boot-9.scm: 1705:22 0 (raise-exception _ #:continuable? _) admin run: the run is of another pipeline: "b85c93b502a50bc1", tests/sum Goblins exception: In message to #<local-object ^pipeline-endpoint>: (run (run-request (id . "8fe5a159fc0ea287") (parameters) (cause . #f) (ancestors))) ice-9/boot-9.scm:1705:22: In procedure raise-exception: ERROR: 1. &automate-error: kind: missing-parameter irritants: (n) 2. &message: "run request lacks a parameter" 3. &irritants: (n) In goblins/core.scm: 1074:7 4 (syscaller-$ _ #<local-object ^pipeline-endpoint> (run (run-request (id . "8fe5a159fc0ea287") (parameters) (cause . #f) (ancestors)))) In automate/pipeline/daemon.scm: 491:7 3 (run (run-request (id . "8fe5a159fc0ea287") (parameters) (cause . #f) (ancestors))) In srfi/srfi-1.scm: 750:9 2 (for-each #<procedure 7ffff76b9260 at automate/pipeline.scm:1103:12 (entry)> ((param (name n)))) In automate/model.scm: 119:2 1 (raise-automate-error _ _ . _) In ice-9/boot-9.scm: 1705:22 0 (raise-exception _ #:continuable? _) tests/sum run: run request lacks a parameter: n admin run: run request lacks a parameter: n Goblins exception: In message to #<local-object ^call-with-vat>: ice-9/boot-9.scm:1705:22: In procedure raise-exception: ERROR: 1. &automate-error: kind: no-unix-socket irritants: ("/tmp/guix-build-guile-automate-0.0.0-dev.drv-0/automate-tests-R3ldiD/automate-pumphouse-uY9cez/no-socket") 2. &message: "no pumphouse socket here; --unix-socket names another" 3. &irritants: ("/tmp/guix-build-guile-automate-0.0.0-dev.drv-0/automate-tests-R3ldiD/automate-pumphouse-uY9cez/no-socket") In goblins/core.scm: 1074:7 4 (syscaller-$ _ #<local-object ^call-with-vat> ()) In unknown file: 3 (_ #<procedure list _>) In automate/pumphouse/client.scm: 168:7 2 (spawn-pumphouse-netlayer _ "/tmp/guix-build-guile-automate-0.0.0-dev.drv-0/automate-tests-R3ldiD/automate-pumphouse-uY9cez/no-socket") In automate/model.scm: 119:2 1 (raise-automate-error _ _ . _) In ice-9/boot-9.scm: 1705:22 0 (raise-exception _ #:continuable? _) 2026-10-14 17:30:33 INFO: dropping a connection that failed to hand shake: #<&compound-exception components: (#<&error> #<&irritants irritants: (#<gnutls-error-enum Error in the pull function.> handshake)> #<&exception-with-kind-and-args kind: gnutls-error args: (#<gnutls-error-enum Error in the pull function.> handshake)>)> 2026-10-14 17:30:33 INFO: dropping a connection that failed to hand shake: #<&compound-exception components: (#<&external-error> #<&origin origin: "fport_write"> #<&message message: "~A"> #<&irritants irritants: ("Broken pipe")> #<&exception-with-kind-and-args kind: system-error args: ("fport_write" "~A" ("Broken pipe") (32))>)> 2026-10-14 17:30:34 INFO: dropping a connection that failed to hand shake: #<&compound-exception components: (#<&error> #<&irritants irritants: (#<gnutls-error-enum Error in the pull function.> handshake)> #<&exception-with-kind-and-args kind: gnutls-error args: (#<gnutls-error-enum Error in the pull function.> handshake)>)> Goblins exception: In message to #<local-object ^scoped-registrar>: (register tests/nap "localhost" "/tmp/guix-build-guile-automate-0.0.0-dev.drv-0/automate-tests-R3ldiD/automate-def-6seXcA" (structure (version 3) (name tests/nap) (steps ((step (name nap) (label #f) (group #f) (timeout #f) (error-permitted #f) (outputs (value)) (inputs ())))) (resources ()) (params ()) (outputs ()) (web-ui-options ())) #<remote-object> "ocapn://pcq2zimsghwec576qt5ryzov2sjotfhk4ud2jd3cwx4q6x7igmdq.tcp-tls/s/3xcB6pK3-f9ZxqP1YuMGYSkW1feWyYTuXIo_Mu5XF_Q?" ()) ice-9/boot-9.scm:1705:22: In procedure raise-exception: ERROR: 1. &automate-error: kind: not-permitted irritants: (tests/nap (tests/only tests/scoped/)) 2. &message: "this registration does not cover the pipeline" 3. &irritants: (tests/nap (tests/only tests/scoped/)) In goblins/core.scm: 1074:7 3 (syscaller-$ _ #<local-object ^scoped-registrar> (register tests/nap "localhost" "/tmp/guix-build-guile-automate-0.0.0-dev.drv-0/automate-tests-R3ldiD/automate-def-6seXcA" (structure (version 3) (name tests/nap) (steps ((step (name nap) (label #f) (group #f) (timeout #f) (error-permitted #f) (outputs (value)) (inputs ())))) (resources ()) (params ()) (outputs ()) (web-ui-options ())) #<remote-object> "ocapn://pcq2zimsghwec576qt5ryzov2sjotfhk4ud2jd3cwx4q6x7igmdq.tcp-tls/s/3xcB…" …)) In automate/pumphouse.scm: 531:6 2 (register tests/nap "localhost" "/tmp/guix-build-guile-automate-0.0.0-dev.drv-0/automate-tests-R3ldiD/automate-def-6seXcA" (structure (version 3) (name tests/nap) (steps ((step (name nap) (label #f) (group #f) (timeout #f) (error-permitted #f) (outputs (value)) (inputs ())))) (resources ()) (params ()) (outputs ()) (web-ui-options ())) #<remote-object> "ocapn://pcq2zimsghwec576qt5ryzov2sjotfhk4ud2jd3cwx4q6x7igmdq.tcp-tls/s/3xcB6pK3-f9ZxqP1YuMGYSkW1feWyYTuXIo_Mu5XF_Q?" ()) In automate/model.scm: 119:2 1 (raise-automate-error _ _ . _) In ice-9/boot-9.scm: 1705:22 0 (raise-exception _ #:continuable? _) pumphouse refused tests/nap: Unknown error occurred with remote object attached to the pumphouse Goblins exception: In message to #<local-object ^admin>: (revoke (tests/nowhere) #f) ice-9/boot-9.scm:1705:22: In procedure raise-exception: ERROR: 1. &automate-error: kind: no-registration irritants: ((tests/nowhere) #f) 2. &message: "no registration of this scope" 3. &irritants: ((tests/nowhere) #f) In goblins/core.scm: 1074:7 2 (syscaller-$ _ #<local-object ^admin> (revoke (tests/nowhere) #f)) In automate/model.scm: 119:2 1 (raise-automate-error _ _ . _) In ice-9/boot-9.scm: 1705:22 0 (raise-exception _ #:continuable? _) admin revoke: no registration of this scope: (tests/nowhere), #f Goblins exception: In message to #<local-object fulfilled-handler>: (#f) ice-9/boot-9.scm:1705:22: In procedure raise-exception: ERROR: 1. &automate-error: kind: not-attached irritants: (tests/nowhere #f) 2. &message: "no pipeline process serving the pipeline's definition is attached" 3. &irritants: (tests/nowhere #f) In goblins/core.scm: 1074:7 3 (syscaller-$ _ #<local-object fulfilled-handler> (#f)) 2038:14 2 (_ . _) In automate/model.scm: 119:2 1 (raise-automate-error _ _ . _) In ice-9/boot-9.scm: 1705:22 0 (raise-exception _ #:continuable? _) admin run: no pipeline process serving the pipeline's definition is attached: tests/nowhere, #f 2026-10-14 17:30:37 (with-exception-handler) INFO: POST /output/940c3eff4b6b398e/chatty 200 12ms 2026-10-14 17:30:39 (with-exception-handler) INFO: POST /output/de7e68a0cd3c172b/chatty 200 4ms run de7e68a0cd3c172b reported to the pumphouse run succeeded chatty: succeeded 2026-10-14 17:30:39 (with-exception-handler) INFO: GET /events/runs/bfc149a260fa1ddf 200 21ms 2026-10-14 17:30:39 (with-exception-handler) INFO: GET /events/runs/nothing 404 1ms 2026-10-14 17:30:39 (with-exception-handler) INFO: GET /health 200 32ms 2026-10-14 17:30:40 (with-exception-handler) INFO: GET / 200 74ms 2026-10-14 17:30:40 (with-exception-handler) INFO: GET /runs/940c3eff4b6b398e 200 15ms 2026-10-14 17:30:40 (with-exception-handler) INFO: GET /runs/940c3eff4b6b398e/steps/chatty 200 12ms GET /events/pumphouse: error replying to client 2026-10-14 17:30:40 (with-exception-handler) INFO: GET /events/pumphouse 200 incomplete 2026-10-14 17:30:41 (with-exception-handler) INFO: POST /output/4b83c9f04e078138/after 200 9ms 2026-10-14 17:30:45 (with-exception-handler) INFO: POST /webhook 202 41ms 2026-10-14 17:30:45 (with-exception-handler) INFO: POST /webhook 202 2ms 2026-10-14 17:30:45 (with-exception-handler) INFO: POST /hooks/other 202 1ms 2026-10-14 17:30:45 (with-exception-handler) INFO: POST /hooks/other 403 0ms 2026-10-14 17:30:45 (with-exception-handler) INFO: POST /webhook 403 0ms Goblins exception: In message to #<local-object ^session>: (abort "44437dda1d2894eb" "44437dda1d2894eb" "aborted") ice-9/boot-9.scm:1705:22: In procedure raise-exception: ERROR: 1. &automate-error: kind: not-permitted irritants: ("44437dda1d2894eb") 2. &message: "a run may not abort itself" 3. &irritants: ("44437dda1d2894eb") In goblins/core.scm: 1074:7 3 (syscaller-$ _ #<local-object ^session> (abort "44437dda1d2894eb" "44437dda1d2894eb" "aborted")) In automate/pumphouse.scm: 391:6 2 (abort "44437dda1d2894eb" "44437dda1d2894eb" "aborted") In automate/model.scm: 119:2 1 (raise-automate-error _ _ . _) In ice-9/boot-9.scm: 1705:22 0 (raise-exception _ #:continuable? _) session tests/stopper on localhost abort: a run may not abort itself: "44437dda1d2894eb" Goblins exception: In message to #<local-object ^session>: (abort "10a9627a035f2fb5" "10a9627a035f2fb5" "aborted") ice-9/boot-9.scm:1705:22: In procedure raise-exception: ERROR: 1. &automate-error: kind: not-permitted irritants: ("10a9627a035f2fb5") 2. &message: "a run may not abort itself" 3. &irritants: ("10a9627a035f2fb5") In goblins/core.scm: 1074:7 3 (syscaller-$ _ #<local-object ^session> (abort "10a9627a035f2fb5" "10a9627a035f2fb5" "aborted")) In automate/pumphouse.scm: 391:6 2 (abort "10a9627a035f2fb5" "10a9627a035f2fb5" "aborted") In automate/model.scm: 119:2 1 (raise-automate-error _ _ . _) In ice-9/boot-9.scm: 1705:22 0 (raise-exception _ #:continuable? _) session tests/stopper on localhost abort: a run may not abort itself: "10a9627a035f2fb5" Error in IO handling wrapped resource stop 1994: kill #<unspecified>, waitpid (1994 . 9) #<input-output: string 7fffea96bb60>: #<&compound-exception components: (#<&error> #<&irritants irritants: (#<gnutls-error-enum Error in the push function.> write_to_session_record_port)> #<&exception-with-kind-and-args kind: gnutls-error args: (#<gnutls-error-enum Error in the push function.> write_to_session_record_port)>)> In ice-9/boot-9.scm: 1778:15 21 (with-exception-handler #<procedure 7ffff4efcf30 at ice-9/boot-9.scm:1882:7 (exn)> _ #:unwind? _ #:unwind-for-type _) In fibers.scm: 164:13 20 (run-fibers _ #:hz _ #:scheduler _ #:parallelism _ #:cpus _ #:install-suspendable-ports? _ #:drain? _) 85:4 19 (%run-fibers _ _ _ _) In fibers/interrupts.scm: 98:4 18 (with-interrupts/thread-cputime _ _ _ _) In fibers/scheduler.scm: 380:26 17 (run-scheduler #<scheduler 7ffff42e3620 (remote-peers: (7ffff42e3310))> _) In ice-9/boot-9.scm: 1778:15 16 stop 1957: kill #<unspecified>, waitpid (1957 . 9) (with-exception-handler #<procedure 7ffff43767e0 at ice-9/boot-9.scm:1882:7 (exn)> _ #:unwind? _ #:unwind-for-type _) 1784:12 15 (with-exception-handler _ _ #:unwind? _ #:unwind-for-type _) In fibers/scheduler.scm: 344:10 14 (next-task) In fibers.scm: 179:8 13 (_) In goblins/actor-lib/io.scm: 60:10 12 (_) 85:15 11 (_ _) In ice-9/boot-9.scm: 1784:12 10 (with-exception-handler _ _ #:unwind? _ #:unwind-for-type _) In goblins/actor-lib/io.scm: 70:18 9 (run-and-send) In goblins/ocapn/netlayer/utils.scm: 55:13 8 (_ #<input-output: custom-port 7fffea96bb60>) In goblins/contrib/syrup.scm: 266:10 7 (encode #<<op:deliver> to-desc: #<<desc:export> pos: 116> args: (fulfill ok) answer-pos: #f resolve-me-desc: #f> #:port _) In srfi/srfi-1.scm: 750:9 6 (for-each #<procedure 7fffea04bf30 at goblins/contrib/syrup.scm:266:20 (expr)> ((#<procedure %op:deliver?-procedure (obj)> . #<procedure 7ffff4eac540 at goblins/contrib/syrup.scm:463:26 (obj)>) (#<procedure %op:abort?-procedure (obj)> . #<procedure 7ffff4eac460 at goblins/contrib/syrup.scm:463:26 (obj)>) (#<procedure %op:listen?-procedure (obj)> . #<procedure 7ffff4eac340 at goblins/contrib/syrup.scm:463:26 (obj)>) (#<procedure %op:gc-exports?-procedure (obj)> . #<procedure …>) …)) In goblins/contrib/syrup.scm: 271:39 5 (_ _) 187:4 4 (encode #<<tagged> label: op:deliver data: (#<<desc:export> pos: 116> (fulfill ok) #f #f)> #:port _) 105:4 3 (write-as-netstring! #<input-output: custom-port 7fffea96bb60> #vu8(111 112 58 100 101 108 105 118 101 114) #:joiner _) In ice-9/suspendable-ports.scm: 83:4 2 (write-bytes #<input-output: custom-port 7fffea96bb60> #vu8(49 48) 0 2) In unknown file: 1 (port-write #<input-output: custom-port 7fffea96bb60> #vu8(49 48) 0 2) In ice-9/boot-9.scm: 1705:22 0 (raise-exception _ #:continuable? _) Uncaught exception in task: In fibers.scm: 179:8 14 (_) In goblins/actor-lib/io.scm: 60:10 13 (_) 85:15 12 (_ _) In ice-9/boot-9.scm: 1784:12 11 (with-exception-handler _ _ #:unwind? _ #:unwind-for-type _) In goblins/actor-lib/io.scm: 70:18 10 (run-and-send) In goblins/ocapn/netlayer/utils.scm: 55:13 9 (_ #<input-output: custom-port 7fffea96bb60>) In goblins/contrib/syrup.scm: 266:10 8 (encode #<<op:deliver> to-desc: #<<desc:export> pos: 116> args: (fulfill ok) answer-pos: #f resolve-me-desc: #f> #:port _) In srfi/srfi-1.scm: 750:9 7 (for-each #<procedure 7fffea04bf30 at goblins/contrib/syrup.scm:266:20 (expr)> ((#<procedure %op:deliver?-procedure (obj)> . #<procedure 7ffff4eac540 at goblins/contrib/syrup.scm:463:26 (obj)>) (#<procedure %op:abort?-procedure (obj)> . #<procedure 7ffff4eac460 at goblins/contrib/syrup.scm:463:26 (obj)>) (#<procedure %op:listen?-procedure (obj)> . #<procedure 7ffff4eac340 at goblins/contrib/syrup.scm:463:26 (obj)>) (#<procedure %op:gc-exports?-procedure (obj)> . #<procedure …>) …)) In goblins/contrib/syrup.scm: 271:39 6 (_ _) 187:4 5 (encode #<<tagged> label: op:deliver data: (#<<desc:export> pos: 116> (fulfill ok) #f #f)> #:port _) 105:4 4 (write-as-netstring! #<input-output: custom-port 7fffea96bb60> #vu8(111 112 58 100 101 108 105 118 101 114) #:joiner _) In ice-9/suspendable-ports.scm: 83:4 3 (write-bytes #<input-output: custom-port 7fffea96bb60> #vu8(49 48) 0 2) In unknown file: 2 (port-write #<input-output: custom-port 7fffea96bb60> #vu8(49 48) 0 2) In ice-9/boot-9.scm: 1706:22 1 (raise-exception _ #:continuable? _) 1705:22 0 (raise-exception _ #:continuable? _) ice-9/boot-9.scm:1705:22: In procedure raise-exception: ERROR: 1. &non-continuable stop 1947: kill #<unspecified>, waitpid (1947 . 0) 135 passed, 0 failed == reconnect.scm ;;; compiling /tmp/guix-build-guile-automate-0.0.0-dev.drv-0/source/tests/reconnect.scm ;;; compiled /tmp/guix-build-guile-automate-0.0.0-dev.drv-0/source/.cache/guile/ccache/3.0-LE-8-4.7/tmp/guix-build-guile-automate-0.0.0-dev.drv-0/source/tests/reconnect.scm.go pumphouse refused tests/one: not-permitted attached to the pumphouse lost the pumphouse; reconnecting attached to the pumphouse attached to the pumphouse lost the pumphouse; reconnecting attached to the pumphouse cannot reach the pumphouse; retrying every 0.1 seconds cannot reach the pumphouse; retrying every 0.1 seconds attached to the pumphouse cannot reach the pumphouse; retrying every 1 seconds not attached to the pumphouse for 1.5 seconds; giving up warning: mutating the process environment while multiple threads are running; further behavior unspecified. warning: mutating the process environment while multiple threads are running; further behavior unspecified. 29 passed, 0 failed Error in IO handling wra== records.scm pped resource #<input-output: socket 745>: #<&compound-exception components: (#<&external-error> #<&origin origin: "fport_read"> #<&message message: "~A"> #<&irritants irritants: ("Connection reset by peer")> #<&exception-with-kind-and-args kind: system-error args: ("fport_read" "~A" ("Connection reset by peer") (104))>)> ;;; compiling /tmp/guix-build-guile-automate-0.0.0-dev.drv-0/source/tests/records.scm In ice-9/boot-9.scm: 1778:15 22 (with-exception-handler #<procedure 7ffff5a60570 at ice-9/boot-9.scm:1882:7 (exn)> _ #:unwind? _ #:unwind-for-type _) In fibers.scm: 164:13 21 (run-fibers _ #:hz _ #:scheduler _ #:parallelism _ #:cpus _ #:install-suspendable-ports? _ #:drain? _) 85:4 20 (%run-fibers _ _ _ _) In fibers/interrupts.scm: 98:4 19 (with-interrupts/thread-cputime _ _ _ _) In fibers/scheduler.scm: 380:26 18 (run-scheduler #<scheduler 7ffff1030e70 (remote-peers: (7ffff1030070))> _) In ice-9/boot-9.scm: 1778:15 17 (with-exception-handler #<procedure 7ffff1498840 at ice-9/boot-9.scm:1882:7 (exn)> _ #:unwind? _ #:unwind-for-type _) 1784:12 16 (with-exception-handler _ _ #:unwind? _ #:unwind-for-type _) In fibers/scheduler.scm: 344:10 15 (next-task) In fibers.scm: 179:8 14 (_) In goblins/actor-lib/io.scm: 60:10 13 (_) 85:15 12 (_ _) In ice-9/boot-9.scm: 1784:12 11 (with-exception-handler _ _ #:unwind? _ #:unwind-for-type _) In goblins/actor-lib/io.scm: 70:18 10 (run-and-send) In ice-9/control.scm: 91:24 9 (call-with-escape-continuation _) In goblins/contrib/syrup.scm: 306:7 8 (read-next) In ice-9/suspendable-ports.scm: 558:2 7 (peek-char _) 159:2 6 (fill-input #<input-output: socket 745> _ _) 124:14 5 (maybe-consume-bom #vu8(239 187 191)) 221:2 4 (peek-byte _) 184:27 3 (fill-input #<input-output: socket 745> _ _) 72:4 2 (read-bytes #<input-output: socket 745> #vu8(116) 0 1) In unknown file: 1 (port-read #<input-output: socket 745> #vu8(116) 0 1) In ice-9/boot-9.scm: 1705:22 0 (raise-exception _ #:continuable? _) Uncaught exception in task: In fibers.scm: 179:8 15 (_) In goblins/actor-lib/io.scm: 60:10 14 (_) 85:15 13 (_ _) In ice-9/boot-9.scm: 1784:12 12 (with-exception-handler _ _ #:unwind? _ #:unwind-for-type _) In goblins/actor-lib/io.scm: 70:18 11 (run-and-send) In ice-9/control.scm: 91:24 10 (call-with-escape-continuation _) In goblins/contrib/syrup.scm: 306:7 9 (read-next) In ice-9/suspendable-ports.scm: 558:2 8 (peek-char _) 159:2 7 (fill-input #<input-output: socket 745> _ _) 124:14 6 (maybe-consume-bom #vu8(239 187 191)) 221:2 5 (peek-byte _) 184:27 4 (fill-input #<input-output: socket 745> _ _) 72:4 3 (read-bytes #<input-output: socket 745> #vu8(116) 0 1) In unknown file: 2 (port-read #<input-output: socket 745> #vu8(116) 0 1) In ice-9/boot-9.scm: 1706:22 1 (raise-exception _ #:continuable? _) 1705:22 0 (raise-exception _ #:continuable? _) ice-9/boot-9.scm:1705:22: In procedure raise-exception: ERROR: 1. &non-continuable ;;; compiled /tmp/guix-build-guile-automate-0.0.0-dev.drv-0/source/.cache/guile/ccache/3.0-LE-8-4.7/tmp/guix-build-guile-automate-0.0.0-dev.drv-0/source/tests/records.scm.go Goblins exception: In message to #<local-object ^records>: (pipelines) ice-9/boot-9.scm:1705:22: In procedure raise-exception: ERROR: 1. &automate-error: kind: records-closed irritants: (pipelines) 2. &message: "the pumphouse's records are closed" 3. &irritants: (pipelines) In goblins/core.scm: 1074:7 2 (syscaller-$ _ #<local-object ^records> (pipelines)) In automate/model.scm: 119:2 1 (raise-automate-error _ _ . _) In ice-9/boot-9.scm: 1705:22 0 (raise-exception _ #:continuable? _) 201 passed, 0 failed == relay.scm ;;; compiling /tmp/guix-build-guile-automate-0.0.0-dev.drv-0/source/tests/relay.scm ;;; compiled /tmp/guix-build-guile-automate-0.0.0-dev.drv-0/source/.cache/guile/ccache/3.0-LE-8-4.7/tmp/guix-build-guile-automate-0.0.0-dev.drv-0/source/tests/relay.scm.go Goblins exception: In message to #<local-object ^admin>: (repl relayed rollback start "other") ice-9/boot-9.scm:1705:22: In procedure raise-exception: ERROR: 1. &automate-error: kind: already-armed irritants: (relayed rollback) 2. &message: "a request for this step is armed already" 3. &irritants: (relayed rollback) In goblins/core.scm: 1074:7 3 (syscaller-$ _ #<local-object ^admin> (repl relayed rollback start "other")) In automate/pumphouse.scm: 838:4 2 (arm-repl! #<<pumphouse> records: #<local-object ^records> lives: #<hash-table 7fffc1af1960 1/31> serving: #<hash-table 7fffc1af18e0 1/31> owners: #<hash-table 7fffc1af18c0 0/31> shared: #<hash-table 7fffc1af18a0 0/31> gates: #<hash-table 7fffc1af1880 0/31> stopped: #<hash-table 7fffc1af1860 0/31> waiting: #<hash-table 7fffc1af1840 1/31> timers: #<hash-table 7fffc1af1820 0/31> tokens: #<hash-table 7fffc1af1800 0/31> registrations: #<hash-table 7fffc1af17e0 0/31> registrations-d…> …) In automate/model.scm: 119:2 1 (raise-automate-error _ _ . _) In ice-9/boot-9.scm: 1705:22 0 (raise-exception _ #:continuable? _) stopped at the start of this step resumed 15 passed, 0 failed == repl.scm ;;; compiling /tmp/guix-build-guile-automate-0.0.0-dev.drv-0/source/tests/repl.scm pipeline process gone: #<&compound-exception components: (#<&external-error> #<&origin origin: "connect"> #<&message message: "~A"> #<&irritants irritants: ("No such file or directory")> #<&exception-with-kind-and-args kind: system-error args: ("connect" "~A" ("No such file or directory") (2))>)>; exiting In goblins/vat.scm: 955:4 1 (call-with-vat #<vat id: 187 name: pipeline> #<procedure 7fffc2a82f30 at automate/pipeline.scm:1057:10 ()>) In ice-9/boot-9.scm: 1705:22 0 (raise-exception _ #:continuable? _) ice-9/boot-9.scm:1705:22: In procedure raise-exception: vat is not running #<vat id: 187 name: pipeline> ;;; compiled /tmp/guix-build-guile-automate-0.0.0-dev.drv-0/source/.cache/guile/ccache/3.0-LE-8-4.7/tmp/guix-build-guile-automate-0.0.0-dev.drv-0/source/tests/repl.scm.go stopped at the start of this step resumed stopped at the start of this step resumed 17 passed, 0 failed == run-query.scm ;;; compiling /tmp/guix-build-guile-automate-0.0.0-dev.drv-0/source/tests/run-query.scm ;;; compiled /tmp/guix-build-guile-automate-0.0.0-dev.drv-0/source/.cache/guile/ccache/3.0-LE-8-4.7/tmp/guix-build-guile-automate-0.0.0-dev.drv-0/source/tests/run-query.scm.go 33 passed, 0 failed == scope.scm ;;; compiling /tmp/guix-build-guile-automate-0.0.0-dev.drv-0/source/tests/scope.scm ;;; compiled /tmp/guix-build-guile-automate-0.0.0-dev.drv-0/source/.cache/guile/ccache/3.0-LE-8-4.7/tmp/guix-build-guile-automate-0.0.0-dev.drv-0/source/tests/scope.scm.go 18 passed, 0 failed == shepherd-bridge.scm ;;; compiling /tmp/guix-build-guile-automate-0.0.0-dev.drv-0/source/tests/shepherd-bridge.scm ;;; compiled /tmp/guix-build-guile-automate-0.0.0-dev.drv-0/source/.cache/guile/ccache/3.0-LE-8-4.7/tmp/guix-build-guile-automate-0.0.0-dev.drv-0/source/tests/shepherd-bridge.scm.go shepherd client /tmp/guix-build-guile-automate-0.0.0-dev.drv-0/automate-tests-R3ldiD/automate-bridge-VmokF7/daemon: (status register unregister) on (web-daemon other-daemon) shepherd client /tmp/guix-build-guile-automate-0.0.0-dev.drv-0/automate-tests-R3ldiD/automate-bridge-VmokF7/secrets/web: (status restart) on (nginx) shepherd client /tmp/guix-build-guile-automate-0.0.0-dev.drv-0/automate-tests-R3ldiD/automate-bridge-VmokF7/all: (status start stop restart load) on (nginx postgres ghost) shepherd bridge: listening on /tmp/guix-build-guile-automate-0.0.0-dev.drv-0/automate-tests-R3ldiD/automate-bridge-VmokF7/bridge.sock for the Shepherd at /tmp/guix-build-guile-automate-0.0.0-dev.drv-0/automate-tests-R3ldiD/automate-bridge-VmokF7/shepherd.sock web: status nginx web: restart nginx web: shepherd: restart nginx Goblins exception: In message to #<local-object ^shepherd-client>: (stop nginx) ice-9/boot-9.scm:1705:22: In procedure raise-exception: ERROR: 1. &automate-error: kind: not-permitted irritants: ("web" stop) 2. &message: "this shepherd client does not offer that action" 3. &irritants: ("web" stop) In goblins/core.scm: 1074:7 3 (syscaller-$ _ #<local-object ^shepherd-client> (stop nginx)) In automate/shepherd/bridge.scm: 223:6 2 (stop nginx) In automate/model.scm: 119:2 1 (raise-automate-error _ _ . _) In ice-9/boot-9.scm: 1705:22 0 (raise-exception _ #:continuable? _) shepherd client web stop: this shepherd client does not offer that action: "web", stop Goblins exception: In message to #<local-object ^shepherd-client>: (status postgres) ice-9/boot-9.scm:1705:22: In procedure raise-exception: ERROR: 1. &automate-error: kind: not-permitted irritants: ("web" postgres) 2. &message: "this shepherd client does not reach that service" 3. &irritants: ("web" postgres) all: status ghost In goblins/core.scm: 1074:7 3 (syscaller-$ _ #<local-object ^shepherd-client> (status postgres)) In automate/shepherd/bridge.scm: 227:6 2 (status postgres) In automate/model.scm: 119:2 1 (raise-automate-error _ _ . _) In ice-9/boot-9.scm: 1705:22 0 (raise-exception _ #:continuable? _) shepherd client web status: this shepherd client does not reach that service: "web", postgres Goblins exception: In message to #<local-object ^herd>: (action ghost status ()) ice-9/boot-9.scm:1705:22: In procedure raise-exception: ERROR: 1. &automate-error: kind: shepherd-error irritants: (ghost status (error (version 0) service-not-found ghost)) 2. &message: "the Shepherd has no service ghost" 3. &irritants: (ghost status (error (version 0) service-not-found ghost)) In goblins/core.scm: 1074:7 4 (syscaller-$ _ #<local-object ^herd> (action ghost status ())) In automate/shepherd/bridge.scm: 188:28 3 (action _ _ _) In automate/shepherd/herd.scm: 124:11 2 (herd-action _ _ _ _) In automate/model.scm: 119:2 1 (raise-automate-error _ _ . _) In ice-9/boot-9.scm: 1705:22 0 (raise-exception _ #:continuable? _) shepherd client all status: the Shepherd has no service ghost: ghost, status, (error (version 0) service-not-found ghost) Goblins exception: In message to #<local-object ^shepherd-client>: (load "/tmp/guix-build-guile-automate-0.0.0-dev.drv-0/automate-tests-R3ldiD/automate-bridge-VmokF7/store/x.scm") ice-9/boot-9.scm:1705:22: In procedure raise-exception: ERROR: 1. &automate-error: kind: not-permitted irritants: ("web") 2. &message: "this shepherd client does not offer loading" 3. &irritants: ("web") In goblins/core.scm: 1074:7 3 (syscaller-$ _ #<local-object ^shepherd-client> (load "/tmp/guix-build-guile-automate-0.0.0-dev.drv-0/automate-tests-R3ldiD/automate-bridge-VmokF7/store/x.scm")) In automate/shepherd/bridge.scm: 253:6 2 (load "/tmp/guix-build-guile-automate-0.0.0-dev.drv-0/automate-tests-R3ldiD/automate-bridge-VmokF7/store/x.scm") In automate/model.scm: 119:2 1 (raise-automate-error _ _ . _) In ice-9/boot-9.scm: 1705:22 0 (raise-exception _ #:continuable? _) shepherd client web load: this shepherd client does not offer loading: "web" Goblins exception: In message to #<local-object ^shepherd-client>: (load "/etc/shepherd.scm") ice-9/boot-9.scm:1705:22: In procedure raise-exception: ERROR: 1. &automate-error: kind: not-permitted irritants: ("/etc/shepherd.scm" "/tmp/guix-build-guile-automate-0.0.0-dev.drv-0/automate-tests-R3ldiD/automate-bridge-VmokF7/store") 2. &message: "a shepherd client loads files in the store alone" 3. &irritants: ("/etc/shepherd.scm" "/tmp/guix-build-guile-automate-0.0.0-dev.drv-0/automate-tests-R3ldiD/automate-bridge-VmokF7/store") all: load root ("/tmp/guix-build-guile-automate-0.0.0-dev.drv-0/automate-tests-R3ldiD/automate-bridge-VmokF7/store/services.scm") all: shepherd: loaded daemon: load root ("/tmp/guix-build-guile-automate-0.0.0-dev.drv-0/automate-tests-R3ldiD/automate-bridge-VmokF7/services/web-daemon.scm") daemon: shepherd: loaded daemon: status web-daemon daemon: start web-daemon daemon: status web-daemon daemon: status web-daemon daemon: load root ("/tmp/guix-build-guile-automate-0.0.0-dev.drv-0/automate-tests-R3ldiD/automate-bridge-VmokF7/services/web-daemon.scm") daemon: shepherd: loaded daemon: status web-daemon daemon: load root ("/tmp/guix-build-guile-automate-0.0.0-dev.drv-0/automate-tests-R3ldiD/automate-bridge-VmokF7/services/web-daemon.scm") daemon: shepherd: loaded daemon: status web-daemon daemon: load root ("/tmp/guix-build-guile-automate-0.0.0-dev.drv-0/automate-tests-R3ldiD/automate-bridge-VmokF7/services/web-daemon.scm") daemon: shepherd: loaded daemon: status web-daemon In goblins/core.scm: 1074:7 3 (syscaller-$ _ #<local-object ^shepherd-client> (load "/etc/shepherd.scm")) In automate/shepherd/bridge.scm: 205:4 2 (load "/etc/shepherd.scm") In automate/model.scm: 119:2 1 (raise-automate-error _ _ . _) In ice-9/boot-9.scm: 1705:22 0 (raise-exception _ #:continuable? _) shepherd client all load: a shepherd client loads files in the store alone: "/etc/shepherd.scm", "/tmp/guix-build-guile-automate-0.0.0-dev.drv-0/automate-tests-R3ldiD/automate-bridge-VmokF7/store" Goblins exception: In message to #<local-object ^shepherd-client>: (register nginx "/gnu/store/x" #f) ice-9/boot-9.scm:1705:22: In procedure raise-exception: ERROR: 1. &automate-error: kind: not-permitted irritants: ("daemon" nginx) 2. &message: "this shepherd client does not reach that service" 3. &irritants: ("daemon" nginx) In goblins/core.scm: 1074:7 3 (syscaller-$ _ #<local-object ^shepherd-client> (register nginx "/gnu/store/x" #f)) In automate/shepherd/bridge.scm: 227:6 2 (register nginx "/gnu/store/x" #f) In automate/model.scm: 119:2 1 (raise-automate-error _ _ . _) In ice-9/boot-9.scm: 1705:22 0 (raise-exception _ #:continuable? _) shepherd client daemon register: this shepherd client does not reach that service: "daemon", nginx Goblins exception: In message to #<local-object ^shepherd-client>: (register web-daemon "/gnu/store/x" #f) ice-9/boot-9.scm:1705:22: In procedure raise-exception: ERROR: 1. &automate-error: kind: not-permitted irritants: ("all" register) 2. &message: "this shepherd client does not offer that action" 3. &irritants: ("all" register) daemon: unload root ("web-daemon") web: restart nginx web: shepherd: restart nginx In goblins/core.scm: 1074:7 3 (syscaller-$ _ #<local-object ^shepherd-client> (register web-daemon "/gnu/store/x" #f)) In automate/shepherd/bridge.scm: 223:6 2 (register web-daemon "/gnu/store/x" #f) In automate/model.scm: 119:2 1 (raise-automate-error _ _ . _) In ice-9/boot-9.scm: 1705:22 0 (raise-exception _ #:continuable? _) shepherd client all register: this shepherd client does not offer that action: "all", register Goblins exception: In message to #<local-object ^shepherd-client>: (stop nginx) ice-9/boot-9.scm:1705:22: In procedure raise-exception: ERROR: 1. &automate-error: kind: not-permitted irritants: ("web" stop) 2. &message: "this shepherd client does not offer that action" 3. &irritants: ("web" stop) web: status nginx stopping In goblins/core.scm: 1074:7 3 (syscaller-$ _ #<local-object ^shepherd-client> (stop nginx)) In automate/shepherd/bridge.scm: 223:6 2 (stop nginx) In automate/model.scm: 119:2 1 (raise-automate-error _ _ . _) In ice-9/boot-9.scm: 1705:22 0 (raise-exception _ #:continuable? _) shepherd client web stop: this shepherd client does not offer that action: "web", stop 44 passed, 0 failed == source.scm ;;; compiling /tmp/guix-build-guile-automate-0.0.0-dev.drv-0/source/tests/source.scm ;;; compiled /tmp/guix-build-guile-automate-0.0.0-dev.drv-0/source/.cache/guile/ccache/3.0-LE-8-4.7/tmp/guix-build-guile-automate-0.0.0-dev.drv-0/source/tests/source.scm.go In execvp of git: No such file or directory git is not installed, so the resolving tests are skipped 20 passed, 0 failed == step-scheduling.scm ;;; compiling /tmp/guix-build-guile-automate-0.0.0-dev.drv-0/source/tests/step-scheduling.scm ;;; compiled /tmp/guix-build-guile-automate-0.0.0-dev.drv-0/source/.cache/guile/ccache/3.0-LE-8-4.7/tmp/guix-build-guile-automate-0.0.0-dev.drv-0/source/tests/step-scheduling.scm.go 45 passed, 0 failed == uploader.scm ;;; compiling /tmp/guix-build-guile-automate-0.0.0-dev.drv-0/source/tests/uploader.scm ;;; compiled /tmp/guix-build-guile-automate-0.0.0-dev.drv-0/source/.cache/guile/ccache/3.0-LE-8-4.7/tmp/guix-build-guile-automate-0.0.0-dev.drv-0/source/tests/uploader.scm.go 2026-10-14 17:31:14 (with-exception-handler) INFO: POST /output/run-1/build 200 1ms 2026-10-14 17:31:14 (with-exception-handler) INFO: POST /output/run-1/build 200 1ms 2026-10-14 17:31:14 (with-exception-handler) INFO: POST /output/run-2/zz-tail 200 2ms 2026-10-14 17:31:14 (with-exception-handler) INFO: POST /output/run-2/a-last 200 1ms 2026-10-14 17:31:14 (with-exception-handler) INFO: POST /output/run-3/timed 200 1ms 2026-10-14 17:31:14 (with-exception-handler) INFO: POST /output/run-3/untimed 200 1ms 2026-10-14 17:31:14 (with-exception-handler) INFO: POST /output/run-3/timed 200 1ms 15 passed, 0 failed phase `check' succeeded after 188.0 seconds sh: warning: setlocale: LC_ALL: cannot change locale (C.UTF-8): No such file or directory starting phase `install-documentation' phase `install-documentation' succeeded after 0.0 seconds sh: warning: setlocale: LC_ALL: cannot change locale (C.UTF-8): No such file or directory starting phase `patch-shebangs' phase `patch-shebangs' succeeded after 0.0 seconds sh: warning: setlocale: LC_ALL: cannot change locale (C.UTF-8): No such file or directory starting phase `validate-documentation-location' phase `validate-documentation-location' succeeded after 0.0 seconds sh: warning: setlocale: LC_ALL: cannot change locale (C.UTF-8): No such file or directory starting phase `delete-info-dir-file' phase `delete-info-dir-file' succeeded after 0.0 seconds sh: warning: setlocale: LC_ALL: cannot change locale (C.UTF-8): No such file or directory starting phase `patch-dot-desktop-files' phase `patch-dot-desktop-files' succeeded after 0.0 seconds sh: warning: setlocale: LC_ALL: cannot change locale (C.UTF-8): No such file or directory starting phase `make-dynamic-linker-cache' phase `make-dynamic-linker-cache' succeeded after 0.0 seconds sh: warning: setlocale: LC_ALL: cannot change locale (C.UTF-8): No such file or directory starting phase `install-license-files' installing 1 license files from '.' phase `install-license-files' succeeded after 0.0 seconds sh: warning: setlocale: LC_ALL: cannot change locale (C.UTF-8): No such file or directory starting phase `reset-gzip-timestamps' phase `reset-gzip-timestamps' succeeded after 0.0 seconds sh: warning: setlocale: LC_ALL: cannot change locale (C.UTF-8): No such file or directory starting phase `compress-documentation' phase `compress-documentation' succeeded after 0.0 seconds sh: warning: setlocale: LC_ALL: cannot change locale (C.UTF-8): No such file or directory guix build: error: C: unrecognized option error: the definition did not lower; Guix's messages are in the step's log kind: lowering-failed irritants: "/var/tmp/automate-work-448ER5/workspace/source/.automate/pipelines.scm" 1 backtrace: automate/pipeline/step.scm:675:62 (_) automate/helpers/definitions.scm:153:6 (lower-definition)