5796c1909def3561 / check errored

Started
Duration
2m 25s

Defined at .automate/pipelines.scm:117

Making check in .
make[1]: Entering directory '/home/chris/pipeline-shepherd/state/work/automate-pipelines/automate-cQ11Ae/automate-work-iEwEsz/workspace/source'
make  tests/support.go tests/pumphouse/support.go tests/attach.scm.go tests/authority.scm.go tests/check.scm.go tests/contain.scm.go tests/dispatch.scm.go tests/errors.scm.go tests/events.scm.go tests/files.scm.go tests/forgejo.scm.go tests/http.scm.go tests/layout.scm.go tests/masking.scm.go tests/metrics.scm.go tests/pages.scm.go tests/model.scm.go tests/output-marks.scm.go tests/notify.scm.go tests/pipeline.scm.go tests/pipeline-shepherd.scm.go tests/processes.scm.go tests/pumphouse.scm.go tests/pumphouse-draining.scm.go tests/pumphouse-lost.scm.go tests/pumphouse-replay.scm.go tests/pumphouse-restart.scm.go tests/pumphouse-shepherd.scm.go tests/pumphouse-stopping.scm.go tests/pumphouse-timers.scm.go tests/reconnect.scm.go tests/records.scm.go tests/relay.scm.go tests/run-query.scm.go tests/shepherd-bridge.scm.go tests/repl.scm.go tests/scope.scm.go tests/source.scm.go tests/step-scheduling.scm.go tests/uploader.scm.go
make[2]: Entering directory '/home/chris/pipeline-shepherd/state/work/automate-pipelines/automate-cQ11Ae/automate-work-iEwEsz/workspace/source'
./pre-inst-env /gnu/store/wavrmrs065ikbava5mmvql3l8y4gp6ms-profile/bin/guild compile  -W1 -Wunbound-variable -Warity-mismatch -Wformat -Wunused-module -Wshadowed-toplevel -o "tests/support.go" "tests/support.scm"
./pre-inst-env /gnu/store/wavrmrs065ikbava5mmvql3l8y4gp6ms-profile/bin/guild compile  -W1 -Wunbound-variable -Warity-mismatch -Wformat -Wunused-module -Wshadowed-toplevel -o "tests/pumphouse/support.go" "tests/pumphouse/support.scm"
wrote `tests/support.go'
;;; note: auto-compilation is enabled, set GUILE_AUTO_COMPILE=0
;;;       or pass the --no-auto-compile argument to disable.
;;; compiling /gnu/store/wavrmrs065ikbava5mmvql3l8y4gp6ms-profile/bin/guild
;;; compiled /tmp/cache/guile/ccache/3.0-LE-8-4.7/gnu/store/k7vkw9x3wl3lni6a0i2w8xz2z8ylrqyz-guile-3.0.11/bin/guild.go
;;; note: auto-compilation is enabled, set GUILE_AUTO_COMPILE=0
;;;       or pass the --no-auto-compile argument to disable.
;;; compiling /gnu/store/wavrmrs065ikbava5mmvql3l8y4gp6ms-profile/bin/guild
;;; compiled /tmp/cache/guile/ccache/3.0-LE-8-4.7/gnu/store/k7vkw9x3wl3lni6a0i2w8xz2z8ylrqyz-guile-3.0.11/bin/guild.go
wrote `tests/pumphouse/support.go'
./pre-inst-env /gnu/store/wavrmrs065ikbava5mmvql3l8y4gp6ms-profile/bin/guild compile  -O1 -W1 -Wunbound-variable -Warity-mismatch -Wformat -Wshadowed-toplevel -o "tests/attach.scm.go" "tests/attach.scm"
./pre-inst-env /gnu/store/wavrmrs065ikbava5mmvql3l8y4gp6ms-profile/bin/guild compile  -O1 -W1 -Wunbound-variable -Warity-mismatch -Wformat -Wshadowed-toplevel -o "tests/authority.scm.go" "tests/authority.scm"
wrote `tests/authority.scm.go'
./pre-inst-env /gnu/store/wavrmrs065ikbava5mmvql3l8y4gp6ms-profile/bin/guild compile  -O1 -W1 -Wunbound-variable -Warity-mismatch -Wformat -Wshadowed-toplevel -o "tests/check.scm.go" "tests/check.scm"
wrote `tests/attach.scm.go'
./pre-inst-env /gnu/store/wavrmrs065ikbava5mmvql3l8y4gp6ms-profile/bin/guild compile  -O1 -W1 -Wunbound-variable -Warity-mismatch -Wformat -Wshadowed-toplevel -o "tests/contain.scm.go" "tests/contain.scm"
wrote `tests/contain.scm.go'
./pre-inst-env /gnu/store/wavrmrs065ikbava5mmvql3l8y4gp6ms-profile/bin/guild compile  -O1 -W1 -Wunbound-variable -Warity-mismatch -Wformat -Wshadowed-toplevel -o "tests/dispatch.scm.go" "tests/dispatch.scm"
wrote `tests/dispatch.scm.go'
./pre-inst-env /gnu/store/wavrmrs065ikbava5mmvql3l8y4gp6ms-profile/bin/guild compile  -O1 -W1 -Wunbound-variable -Warity-mismatch -Wformat -Wshadowed-toplevel -o "tests/errors.scm.go" "tests/errors.scm"
wrote `tests/errors.scm.go'
./pre-inst-env /gnu/store/wavrmrs065ikbava5mmvql3l8y4gp6ms-profile/bin/guild compile  -O1 -W1 -Wunbound-variable -Warity-mismatch -Wformat -Wshadowed-toplevel -o "tests/events.scm.go" "tests/events.scm"
wrote `tests/events.scm.go'
./pre-inst-env /gnu/store/wavrmrs065ikbava5mmvql3l8y4gp6ms-profile/bin/guild compile  -O1 -W1 -Wunbound-variable -Warity-mismatch -Wformat -Wshadowed-toplevel -o "tests/files.scm.go" "tests/files.scm"
wrote `tests/files.scm.go'
./pre-inst-env /gnu/store/wavrmrs065ikbava5mmvql3l8y4gp6ms-profile/bin/guild compile  -O1 -W1 -Wunbound-variable -Warity-mismatch -Wformat -Wshadowed-toplevel -o "tests/forgejo.scm.go" "tests/forgejo.scm"
wrote `tests/forgejo.scm.go'
./pre-inst-env /gnu/store/wavrmrs065ikbava5mmvql3l8y4gp6ms-profile/bin/guild compile  -O1 -W1 -Wunbound-variable -Warity-mismatch -Wformat -Wshadowed-toplevel -o "tests/http.scm.go" "tests/http.scm"
wrote `tests/check.scm.go'
./pre-inst-env /gnu/store/wavrmrs065ikbava5mmvql3l8y4gp6ms-profile/bin/guild compile  -O1 -W1 -Wunbound-variable -Warity-mismatch -Wformat -Wshadowed-toplevel -o "tests/layout.scm.go" "tests/layout.scm"
wrote `tests/http.scm.go'
./pre-inst-env /gnu/store/wavrmrs065ikbava5mmvql3l8y4gp6ms-profile/bin/guild compile  -O1 -W1 -Wunbound-variable -Warity-mismatch -Wformat -Wshadowed-toplevel -o "tests/masking.scm.go" "tests/masking.scm"
wrote `tests/masking.scm.go'
./pre-inst-env /gnu/store/wavrmrs065ikbava5mmvql3l8y4gp6ms-profile/bin/guild compile  -O1 -W1 -Wunbound-variable -Warity-mismatch -Wformat -Wshadowed-toplevel -o "tests/metrics.scm.go" "tests/metrics.scm"
wrote `tests/layout.scm.go'
./pre-inst-env /gnu/store/wavrmrs065ikbava5mmvql3l8y4gp6ms-profile/bin/guild compile  -O1 -W1 -Wunbound-variable -Warity-mismatch -Wformat -Wshadowed-toplevel -o "tests/pages.scm.go" "tests/pages.scm"
wrote `tests/metrics.scm.go'
./pre-inst-env /gnu/store/wavrmrs065ikbava5mmvql3l8y4gp6ms-profile/bin/guild compile  -O1 -W1 -Wunbound-variable -Warity-mismatch -Wformat -Wshadowed-toplevel -o "tests/model.scm.go" "tests/model.scm"
wrote `tests/pages.scm.go'
./pre-inst-env /gnu/store/wavrmrs065ikbava5mmvql3l8y4gp6ms-profile/bin/guild compile  -O1 -W1 -Wunbound-variable -Warity-mismatch -Wformat -Wshadowed-toplevel -o "tests/output-marks.scm.go" "tests/output-marks.scm"
wrote `tests/output-marks.scm.go'
./pre-inst-env /gnu/store/wavrmrs065ikbava5mmvql3l8y4gp6ms-profile/bin/guild compile  -O1 -W1 -Wunbound-variable -Warity-mismatch -Wformat -Wshadowed-toplevel -o "tests/notify.scm.go" "tests/notify.scm"
wrote `tests/model.scm.go'
./pre-inst-env /gnu/store/wavrmrs065ikbava5mmvql3l8y4gp6ms-profile/bin/guild compile  -O1 -W1 -Wunbound-variable -Warity-mismatch -Wformat -Wshadowed-toplevel -o "tests/pipeline.scm.go" "tests/pipeline.scm"
wrote `tests/notify.scm.go'
./pre-inst-env /gnu/store/wavrmrs065ikbava5mmvql3l8y4gp6ms-profile/bin/guild compile  -O1 -W1 -Wunbound-variable -Warity-mismatch -Wformat -Wshadowed-toplevel -o "tests/pipeline-shepherd.scm.go" "tests/pipeline-shepherd.scm"
wrote `tests/pipeline-shepherd.scm.go'
./pre-inst-env /gnu/store/wavrmrs065ikbava5mmvql3l8y4gp6ms-profile/bin/guild compile  -O1 -W1 -Wunbound-variable -Warity-mismatch -Wformat -Wshadowed-toplevel -o "tests/processes.scm.go" "tests/processes.scm"
wrote `tests/processes.scm.go'
./pre-inst-env /gnu/store/wavrmrs065ikbava5mmvql3l8y4gp6ms-profile/bin/guild compile  -O1 -W1 -Wunbound-variable -Warity-mismatch -Wformat -Wshadowed-toplevel -o "tests/pumphouse.scm.go" "tests/pumphouse.scm"
wrote `tests/pipeline.scm.go'
./pre-inst-env /gnu/store/wavrmrs065ikbava5mmvql3l8y4gp6ms-profile/bin/guild compile  -O1 -W1 -Wunbound-variable -Warity-mismatch -Wformat -Wshadowed-toplevel -o "tests/pumphouse-draining.scm.go" "tests/pumphouse-draining.scm"
wrote `tests/pumphouse.scm.go'
./pre-inst-env /gnu/store/wavrmrs065ikbava5mmvql3l8y4gp6ms-profile/bin/guild compile  -O1 -W1 -Wunbound-variable -Warity-mismatch -Wformat -Wshadowed-toplevel -o "tests/pumphouse-lost.scm.go" "tests/pumphouse-lost.scm"
wrote `tests/pumphouse-draining.scm.go'
./pre-inst-env /gnu/store/wavrmrs065ikbava5mmvql3l8y4gp6ms-profile/bin/guild compile  -O1 -W1 -Wunbound-variable -Warity-mismatch -Wformat -Wshadowed-toplevel -o "tests/pumphouse-replay.scm.go" "tests/pumphouse-replay.scm"
wrote `tests/pumphouse-lost.scm.go'
./pre-inst-env /gnu/store/wavrmrs065ikbava5mmvql3l8y4gp6ms-profile/bin/guild compile  -O1 -W1 -Wunbound-variable -Warity-mismatch -Wformat -Wshadowed-toplevel -o "tests/pumphouse-restart.scm.go" "tests/pumphouse-restart.scm"
wrote `tests/pumphouse-replay.scm.go'
./pre-inst-env /gnu/store/wavrmrs065ikbava5mmvql3l8y4gp6ms-profile/bin/guild compile  -O1 -W1 -Wunbound-variable -Warity-mismatch -Wformat -Wshadowed-toplevel -o "tests/pumphouse-shepherd.scm.go" "tests/pumphouse-shepherd.scm"
wrote `tests/pumphouse-restart.scm.go'
./pre-inst-env /gnu/store/wavrmrs065ikbava5mmvql3l8y4gp6ms-profile/bin/guild compile  -O1 -W1 -Wunbound-variable -Warity-mismatch -Wformat -Wshadowed-toplevel -o "tests/pumphouse-stopping.scm.go" "tests/pumphouse-stopping.scm"
wrote `tests/pumphouse-shepherd.scm.go'
./pre-inst-env /gnu/store/wavrmrs065ikbava5mmvql3l8y4gp6ms-profile/bin/guild compile  -O1 -W1 -Wunbound-variable -Warity-mismatch -Wformat -Wshadowed-toplevel -o "tests/pumphouse-timers.scm.go" "tests/pumphouse-timers.scm"
wrote `tests/pumphouse-stopping.scm.go'
./pre-inst-env /gnu/store/wavrmrs065ikbava5mmvql3l8y4gp6ms-profile/bin/guild compile  -O1 -W1 -Wunbound-variable -Warity-mismatch -Wformat -Wshadowed-toplevel -o "tests/reconnect.scm.go" "tests/reconnect.scm"
wrote `tests/pumphouse-timers.scm.go'
./pre-inst-env /gnu/store/wavrmrs065ikbava5mmvql3l8y4gp6ms-profile/bin/guild compile  -O1 -W1 -Wunbound-variable -Warity-mismatch -Wformat -Wshadowed-toplevel -o "tests/records.scm.go" "tests/records.scm"
wrote `tests/reconnect.scm.go'
./pre-inst-env /gnu/store/wavrmrs065ikbava5mmvql3l8y4gp6ms-profile/bin/guild compile  -O1 -W1 -Wunbound-variable -Warity-mismatch -Wformat -Wshadowed-toplevel -o "tests/relay.scm.go" "tests/relay.scm"
wrote `tests/records.scm.go'
wrote `tests/relay.scm.go'
./pre-inst-env /gnu/store/wavrmrs065ikbava5mmvql3l8y4gp6ms-profile/bin/guild compile  -O1 -W1 -Wunbound-variable -Warity-mismatch -Wformat -Wshadowed-toplevel -o "tests/run-query.scm.go" "tests/run-query.scm"
./pre-inst-env /gnu/store/wavrmrs065ikbava5mmvql3l8y4gp6ms-profile/bin/guild compile  -O1 -W1 -Wunbound-variable -Warity-mismatch -Wformat -Wshadowed-toplevel -o "tests/shepherd-bridge.scm.go" "tests/shepherd-bridge.scm"
wrote `tests/run-query.scm.go'
./pre-inst-env /gnu/store/wavrmrs065ikbava5mmvql3l8y4gp6ms-profile/bin/guild compile  -O1 -W1 -Wunbound-variable -Warity-mismatch -Wformat -Wshadowed-toplevel -o "tests/repl.scm.go" "tests/repl.scm"
wrote `tests/shepherd-bridge.scm.go'
./pre-inst-env /gnu/store/wavrmrs065ikbava5mmvql3l8y4gp6ms-profile/bin/guild compile  -O1 -W1 -Wunbound-variable -Warity-mismatch -Wformat -Wshadowed-toplevel -o "tests/scope.scm.go" "tests/scope.scm"
wrote `tests/repl.scm.go'
./pre-inst-env /gnu/store/wavrmrs065ikbava5mmvql3l8y4gp6ms-profile/bin/guild compile  -O1 -W1 -Wunbound-variable -Warity-mismatch -Wformat -Wshadowed-toplevel -o "tests/source.scm.go" "tests/source.scm"
wrote `tests/scope.scm.go'
./pre-inst-env /gnu/store/wavrmrs065ikbava5mmvql3l8y4gp6ms-profile/bin/guild compile  -O1 -W1 -Wunbound-variable -Warity-mismatch -Wformat -Wshadowed-toplevel -o "tests/step-scheduling.scm.go" "tests/step-scheduling.scm"
wrote `tests/source.scm.go'
./pre-inst-env /gnu/store/wavrmrs065ikbava5mmvql3l8y4gp6ms-profile/bin/guild compile  -O1 -W1 -Wunbound-variable -Warity-mismatch -Wformat -Wshadowed-toplevel -o "tests/uploader.scm.go" "tests/uploader.scm"
wrote `tests/step-scheduling.scm.go'
wrote `tests/uploader.scm.go'
make[2]: Leaving directory '/home/chris/pipeline-shepherd/state/work/automate-pipelines/automate-cQ11Ae/automate-work-iEwEsz/workspace/source'
make  check-TESTS
make[2]: Entering directory '/home/chris/pipeline-shepherd/state/work/automate-pipelines/automate-cQ11Ae/automate-work-iEwEsz/workspace/source'
make[3]: Entering directory '/home/chris/pipeline-shepherd/state/work/automate-pipelines/automate-cQ11Ae/automate-work-iEwEsz/workspace/source'
PASS: tests/attach.scm
PASS: tests/check.scm
PASS: tests/authority.scm
PASS: tests/contain.scm
PASS: tests/errors.scm
PASS: tests/dispatch.scm
PASS: tests/files.scm
PASS: tests/forgejo.scm
PASS: tests/events.scm
PASS: tests/layout.scm
PASS: tests/masking.scm
PASS: tests/http.scm
PASS: tests/metrics.scm
PASS: tests/pages.scm
PASS: tests/output-marks.scm
PASS: tests/notify.scm
PASS: tests/model.scm
PASS: tests/pipeline-shepherd.scm
PASS: tests/processes.scm
PASS: tests/pumphouse.scm
PASS: tests/pipeline.scm
PASS: tests/pumphouse-draining.scm
PASS: tests/pumphouse-replay.scm
PASS: tests/pumphouse-lost.scm
PASS: tests/pumphouse-shepherd.scm
PASS: tests/pumphouse-stopping.scm
FAIL: tests/pumphouse-restart.scm
PASS: tests/pumphouse-timers.scm
PASS: tests/records.scm
PASS: tests/reconnect.scm
PASS: tests/run-query.scm
PASS: tests/relay.scm
PASS: tests/repl.scm
PASS: tests/scope.scm
PASS: tests/source.scm
PASS: tests/shepherd-bridge.scm
PASS: tests/step-scheduling.scm
PASS: tests/uploader.scm
================================================
   guile-automate 0.0.0-dev: ./test-suite.log
================================================

# TOTAL: 38
# PASS:  37
# SKIP:  0
# XFAIL: 0
# FAIL:  1
# XPASS: 0
# ERROR: 0

System information (uname -a): Linux 6.18.13-gnu #1 SMP PREEMPT_DYNAMIC 1 x86_64

.. contents:: :depth: 2

FAIL: tests/pumphouse-restart
=============================

http on port 43913
pumphouse listening on /tmp/automate-tests-DgbHlZ/automate-pumphouse-saBqeV/socket
admin: /tmp/automate-tests-DgbHlZ/automate-pumphouse-saBqeV/admin
remote admin: /tmp/automate-tests-DgbHlZ/automate-pumphouse-saBqeV/remote-admin
attached to the pumphouse of /tmp/automate-tests-DgbHlZ/automate-pumphouse-saBqeV/any
attached to the pumphouse
Error in IO handling wrapped resource #<input-output: string 7f6d323ae700>:
#<&compound-exception components: (#<&error> #<&irritants irritants: (#<gnutls-error-enum Error in the pull function.> read_from_session_record_port)> #<&exception-with-kind-and-args kind: gnutls-error args: (#<gnutls-error-enum Error in the pull function.> read_from_session_record_port)>)>
warning: mutating the process environment while multiple threads are running;
         further behavior unspecified.
In ice-9/boot-9.scm:
lost the pumphouse; reconnecting
  1778:15 19 cannot reach the pumphouse of /tmp/automate-tests-DgbHlZ/automate-pumphouse-saBqeV/any; retrying every 1 seconds
(with-exception-handler #<procedure 7f6d35736e10 at ice-9/boot-9.scm:1882:7 (exn)> _ #:unwind? _ #:unwind-for-type _)
In fibers.scm:
   164:13 18 (run-fibers _ #:hz _ #:scheduler _ #:parallelism _ #:cpus _ #:install-suspendable-ports? _ #:drain? _)
     85:4 17 (%run-fibers _ 100 #<procedure finished? ()> _)
In fibers/interrupts.scm:
     98:4 16 (with-interrupts/thread-cputime _ _ #<procedure yield-current-task ()> #<procedure 7f6d358214e0 at fibers.scm:94:4 ()>)
In fibers/scheduler.scm:
   380:26 15 (run-scheduler #<scheduler 7f6d357daa80 (remote-peers: (7f6d357daa10))> _)
In ice-9/boot-9.scm:
  1778:15 14 (with-exception-handler #<procedure 7f6d323f8ed0 at ice-9/boot-9.scm:1882:7 (exn)> _ #:unwind? _ #:unwind-for-type _)
  1784:12 13 (with-exception-handler _ _ #:unwind? _ #:unwind-for-type _)
In fibers/scheduler.scm:
   344:10 12 (next-task)
In fibers.scm:
    179:8 11 (_)
In goblins/actor-lib/io.scm:
    60:10 10 (_)
    85:15  9 (_ _)
In ice-9/boot-9.scm:
  1784:12  8 (with-exception-handler _ _ #:unwind? _ #:unwind-for-type _)
In goblins/actor-lib/io.scm:
    70:18  7 (run-and-send)
In ice-9/control.scm:
    91:24  6 (call-with-escape-continuation _)
In goblins/contrib/syrup.scm:
    306:7  5 (read-next)
In ice-9/suspendable-ports.scm:
    558:2  4 (peek-char _)
   184:27  3 (fill-input #<input-output: custom-port 7f6d323ae700> _ _)
     72:4  2 (read-bytes #<input-output: custom-port 7f6d323ae700> #vu8(62) 0 1)
In unknown file:
           1 (port-read #<input-output: custom-port 7f6d323ae700> #vu8(62) 0 1)
In ice-9/boot-9.scm:
  1705:22  0 (raise-exception _ #:continuable? _)

Uncaught exception in task:
In fibers.scm:
    179:8 12 (_)
In goblins/actor-lib/io.scm:
    60:10 11 (_)
    85:15 10 (_ _)
In ice-9/boot-9.scm:
  1784:12  9 (with-exception-handler _ _ #:unwind? _ #:unwind-for-type _)
In goblins/actor-lib/io.scm:
    70:18  8 (run-and-send)
In ice-9/control.scm:
    91:24  7 (call-with-escape-continuation _)
In goblins/contrib/syrup.scm:
    306:7  6 (read-next)
In ice-9/suspendable-ports.scm:
    558:2  5 (peek-char _)
   184:27  4 (fill-input #<input-output: custom-port 7f6d323ae700> _ _)
     72:4  3 (read-bytes #<input-output: custom-port 7f6d323ae700> #vu8(62) 0 1)
In unknown file:
           2 (port-read #<input-output: custom-port 7f6d323ae700> #vu8(62) 0 1)
In ice-9/boot-9.scm:
  1706:22  1 (raise-exception _ #:continuable? _)
  1705:22  0 (raise-exception _ #:continuable? _)
ice-9/boot-9.scm:1705:22: In procedure raise-exception:
ERROR:
  1. &non-continuable
Error in IO handling wrapped resource #<input-output: string 7f6d323ae700>:
#<&compound-exception components: (#<&error> #<&irritants irritants: (#<gnutls-error-enum The specified session has been invalidated for some reason.> write_to_session_record_port)> #<&exception-with-kind-and-args kind: gnutls-error args: (#<gnutls-error-enum The specified session has been invalidated for some reason.> write_to_session_record_port)>)>
In ice-9/boot-9.scm:
  1778:15 20 (with-exception-handler #<procedure 7f6d35736e10 at ice-9/boot-9.scm:1882:7 (exn)> _ #:unwind? _ #:unwind-for-type _)
In fibers.scm:
   164:13 19 (run-fibers _ #:hz _ #:scheduler _ #:parallelism _ #:cpus _ #:install-suspendable-ports? _ #:drain? _)
     85:4 18 (%run-fibers _ _ _ _)
In fibers/interrupts.scm:
     98:4 17 (with-interrupts/thread-cputime _ _ _ _)
In fibers/scheduler.scm:
   380:26 16 (run-scheduler #<scheduler 7f6d357daa80 (remote-peers: (7f6d357daa10))> _)
In ice-9/boot-9.scm:
  1778:15 15 (with-exception-handler #<procedure 7f6d28e808d0 at ice-9/boot-9.scm:1882:7 (exn)> _ #:unwind? _ #:unwind-for-type _)
  1784:12 14 (with-exception-handler _ _ #:unwind? _ #:unwind-for-type _)
In fibers/scheduler.scm:
   344:10 13 (next-task)
In fibers.scm:
    179:8 12 (_)
In goblins/actor-lib/io.scm:
    60:10 11 (_)
    85:15 10 (_ _)
In ice-9/boot-9.scm:
  1784:12  9 (with-exception-handler _ _ #:unwind? _ #:unwind-for-type _)
In goblins/actor-lib/io.scm:
    70:18  8 (run-and-send)
In goblins/ocapn/netlayer/utils.scm:
    55:13  7 (_ #<input-output: custom-port 7f6d323ae700>)
In goblins/contrib/syrup.scm:
   266:10  6 (encode #<<op:deliver> to-desc: #<<desc:export> pos: 2> args: (heartbeat) answer-pos: 8 resolve-me-desc: #<<desc:import-object> pos: 10>> #:port _)
In srfi/srfi-1.scm:
    750:9  5 (for-each #<procedure 7f6d3127adb0 at goblins/contrib/syrup.scm:266:20 (expr)> ((#<procedure %op:deliver?-procedure (obj)> . #<procedure 7f6d32fd1580 at goblins/contrib/syrup.scm:463:26 (obj)>) (#<procedure %op:abort?-procedure (obj)> . #<procedure 7f6d32fd14a0 at goblins/contrib/syrup.scm:463:26 (obj)>) (#<procedure %op:listen?-procedure (obj)> . #<procedure 7f6d32fd1380 at goblins/contrib/syrup.scm:463:26 (obj)>) (#<procedure %op:gc-exports?-procedure (obj)> . #<procedure …>) …))
In goblins/contrib/syrup.scm:
   271:39  4 (_ _)
    186:4  3 (encode #<<tagged> label: op:deliver data: (#<<desc:export> pos: 2> (heartbeat) 8 #<<desc:import-object> pos: 10>)> #:port _)
In ice-9/suspendable-ports.scm:
     83:4  2 (write-bytes #<input-output: custom-port 7f6d323ae700> #vu8(60) 0 1)
In unknown file:
           1 (port-write #<input-output: custom-port 7f6d323ae700> #vu8(60) 0 1)
In ice-9/boot-9.scm:
  1705:22  0 (raise-exception _ #:continuable? _)

Uncaught exception in task:
In fibers.scm:
    179:8 13 (_)
In goblins/actor-lib/io.scm:
    60:10 12 (_)
    85:15 11 (_ _)
In ice-9/boot-9.scm:
  1784:12 10 (with-exception-handler _ _ #:unwind? _ #:unwind-for-type _)
In goblins/actor-lib/io.scm:
    70:18  9 (run-and-send)
In goblins/ocapn/netlayer/utils.scm:
    55:13  8 (_ #<input-output: custom-port 7f6d323ae700>)
In goblins/contrib/syrup.scm:
   266:10  7 (encode #<<op:deliver> to-desc: #<<desc:export> pos: 2> args: (heartbeat) answer-pos: 8 resolve-me-desc: #<<desc:import-object> pos: 10>> #:port _)
In srfi/srfi-1.scm:
    750:9  6 (for-each #<procedure 7f6d3127adb0 at goblins/contrib/syrup.scm:266:20 (expr)> ((#<procedure %op:deliver?-procedure (obj)> . #<procedure 7f6d32fd1580 at goblins/contrib/syrup.scm:463:26 (obj)>) (#<procedure %op:abort?-procedure (obj)> . #<procedure 7f6d32fd14a0 at goblins/contrib/syrup.scm:463:26 (obj)>) (#<procedure %op:listen?-procedure (obj)> . #<procedure 7f6d32fd1380 at goblins/contrib/syrup.scm:463:26 (obj)>) (#<procedure %op:gc-exports?-procedure (obj)> . #<procedure …>) …))
In goblins/contrib/syrup.scm:
   271:39  5 (_ _)
    186:4  4 (encode #<<tagged> label: op:deliver data: (#<<desc:export> pos: 2> (heartbeat) 8 #<<desc:import-object> pos: 10>)> #:port _)
In ice-9/suspendable-ports.scm:
     83:4  3 (write-bytes #<input-output: custom-port 7f6d323ae700> #vu8(60) 0 1)
In unknown file:
           2 (port-write #<input-output: custom-port 7f6d323ae700> #vu8(60) 0 1)
In ice-9/boot-9.scm:
  1706:22  1 (raise-exception _ #:continuable? _)
  1705:22  0 (raise-exception _ #:continuable? _)
ice-9/boot-9.scm:1705:22: In procedure raise-exception:
ERROR:
  1. &non-continuable
http on port 32977
pumphouse listening on /tmp/automate-tests-DgbHlZ/automate-pumphouse-saBqeV/socket
admin: /tmp/automate-tests-DgbHlZ/automate-pumphouse-saBqeV/admin
remote admin: /tmp/automate-tests-DgbHlZ/automate-pumphouse-saBqeV/remote-admin
attached to the pumphouse of /tmp/automate-tests-DgbHlZ/automate-pumphouse-saBqeV/any
lost the pumphouse; reconnecting
attached to the pumphouse
lost the pumphouse; reconnecting
attached to the pumphouse
lost the pumphouse; reconnecting
attached to the pumphouse
lost the pumphouse; reconnecting
attached to the pumphouse
lost the pumphouse; reconnecting
attached to the pumphouse
lost the pumphouse; reconnecting
== pumphouse-restart.scm
  fail: the daemon holding a registration registers again over TCP
stop 2398: kill #<unspecified>, waitpid (2398 . 9)
stop 2399: kill #<unspecified>, waitpid (2399 . 9)
stop 2445: kill #<unspecified>, waitpid (2445 . 0)
18 passed, 1 failed
FAIL tests/pumphouse-restart.scm (exit status: 1)

============================================================================
Testsuite summary for guile-automate 0.0.0-dev
============================================================================
# TOTAL: 38
# PASS:  37
# SKIP:  0
# XFAIL: 0
# FAIL:  1
# XPASS: 0
# ERROR: 0
============================================================================
See ./test-suite.log for debugging.
============================================================================
make[3]: *** [Makefile:988: test-suite.log] Error 1
make[3]: Leaving directory '/home/chris/pipeline-shepherd/state/work/automate-pipelines/automate-cQ11Ae/automate-work-iEwEsz/workspace/source'
make[2]: *** [Makefile:1123: check-TESTS] Error 2
make[2]: Leaving directory '/home/chris/pipeline-shepherd/state/work/automate-pipelines/automate-cQ11Ae/automate-work-iEwEsz/workspace/source'
make[1]: *** [Makefile:1345: check-am] Error 2
make[1]: Leaving directory '/home/chris/pipeline-shepherd/state/work/automate-pipelines/automate-cQ11Ae/automate-work-iEwEsz/workspace/source'
make: *** [Makefile:874: check-recursive] Error 1
error: #<&invoke-error program: "/gnu/store/wavrmrs065ikbava5mmvql3l8y4gp6ms-profile/bin/bash" arguments: ("-c" "set -eo pipefail\nexport GUIX_PROFILE=/gnu/store/wavrmrs065ikbava5mmvql3l8y4gp6ms-profile\nsource \"$GUIX_PROFILE/etc/profile\"\ncd /home/chris/pipeline-shepherd/state/work/automate-pipelines/automate-cQ11Ae/automate-work-iEwEsz/workspace/source\nexport XDG_CACHE_HOME=\"$TMPDIR/cache\"\nmake check -j$(nproc) VERBOSE=1") exit-status: 2 term-signal: #f stop-signal: #f>
backtrace:
  automate/pipeline/step.scm:676:62 (_)
  automate/step-body/check.scm:23:4 (body-thunk)
  guix/build/utils.scm:822:6 (invoke)