65edbabcaeebbce7 / check errored
- Started
- Duration
- 2m 5s
Defined at .automate/pipelines.scm:117
Making check in . make[1]: Entering directory '/home/chris/pipeline-shepherd/state/work/automate-pipelines/automate-7Ldcck/automate-work-s15JIE/workspace/source' make tests/support.go tests/pumphouse/support.go tests/attach.scm.go tests/authority.scm.go tests/check.scm.go tests/contain.scm.go tests/dispatch.scm.go tests/errors.scm.go tests/events.scm.go tests/files.scm.go tests/forgejo.scm.go tests/http.scm.go tests/layout.scm.go tests/masking.scm.go tests/metrics.scm.go tests/pages.scm.go tests/model.scm.go tests/output-marks.scm.go tests/notify.scm.go tests/pipeline.scm.go tests/pipeline-shepherd.scm.go tests/processes.scm.go tests/pumphouse.scm.go tests/pumphouse-draining.scm.go tests/pumphouse-lost.scm.go tests/pumphouse-replay.scm.go tests/pumphouse-restart.scm.go tests/pumphouse-shepherd.scm.go tests/pumphouse-stopping.scm.go tests/pumphouse-timers.scm.go tests/reconnect.scm.go tests/records.scm.go tests/relay.scm.go tests/run-query.scm.go tests/shepherd-bridge.scm.go tests/repl.scm.go tests/scope.scm.go tests/source.scm.go tests/step-scheduling.scm.go tests/uploader.scm.go make[2]: Entering directory '/home/chris/pipeline-shepherd/state/work/automate-pipelines/automate-7Ldcck/automate-work-s15JIE/workspace/source' ./pre-inst-env /gnu/store/wavrmrs065ikbava5mmvql3l8y4gp6ms-profile/bin/guild compile -W1 -Wunbound-variable -Warity-mismatch -Wformat -Wunused-module -Wshadowed-toplevel -o "tests/support.go" "tests/support.scm" ./pre-inst-env /gnu/store/wavrmrs065ikbava5mmvql3l8y4gp6ms-profile/bin/guild compile -W1 -Wunbound-variable -Warity-mismatch -Wformat -Wunused-module -Wshadowed-toplevel -o "tests/pumphouse/support.go" "tests/pumphouse/support.scm" ;;; note: auto-compilation is enabled, set GUILE_AUTO_COMPILE=0 ;;; or pass the --no-auto-compile argument to disable. ;;; compiling /gnu/store/wavrmrs065ikbava5mmvql3l8y4gp6ms-profile/bin/guild ;;; compiled /tmp/cache/guile/ccache/3.0-LE-8-4.7/gnu/store/k7vkw9x3wl3lni6a0i2w8xz2z8ylrqyz-guile-3.0.11/bin/guild.go wrote `tests/support.go' wrote `tests/pumphouse/support.go' ;;; note: auto-compilation is enabled, set GUILE_AUTO_COMPILE=0 ;;; or pass the --no-auto-compile argument to disable. ;;; compiling /gnu/store/wavrmrs065ikbava5mmvql3l8y4gp6ms-profile/bin/guild ;;; compiled /tmp/cache/guile/ccache/3.0-LE-8-4.7/gnu/store/k7vkw9x3wl3lni6a0i2w8xz2z8ylrqyz-guile-3.0.11/bin/guild.go ./pre-inst-env /gnu/store/wavrmrs065ikbava5mmvql3l8y4gp6ms-profile/bin/guild compile -O1 -W1 -Wunbound-variable -Warity-mismatch -Wformat -Wshadowed-toplevel -o "tests/attach.scm.go" "tests/attach.scm" ./pre-inst-env /gnu/store/wavrmrs065ikbava5mmvql3l8y4gp6ms-profile/bin/guild compile -O1 -W1 -Wunbound-variable -Warity-mismatch -Wformat -Wshadowed-toplevel -o "tests/authority.scm.go" "tests/authority.scm" wrote `tests/attach.scm.go' ./pre-inst-env /gnu/store/wavrmrs065ikbava5mmvql3l8y4gp6ms-profile/bin/guild compile -O1 -W1 -Wunbound-variable -Warity-mismatch -Wformat -Wshadowed-toplevel -o "tests/check.scm.go" "tests/check.scm" wrote `tests/authority.scm.go' ./pre-inst-env /gnu/store/wavrmrs065ikbava5mmvql3l8y4gp6ms-profile/bin/guild compile -O1 -W1 -Wunbound-variable -Warity-mismatch -Wformat -Wshadowed-toplevel -o "tests/contain.scm.go" "tests/contain.scm" wrote `tests/contain.scm.go' ./pre-inst-env /gnu/store/wavrmrs065ikbava5mmvql3l8y4gp6ms-profile/bin/guild compile -O1 -W1 -Wunbound-variable -Warity-mismatch -Wformat -Wshadowed-toplevel -o "tests/dispatch.scm.go" "tests/dispatch.scm" wrote `tests/dispatch.scm.go' ./pre-inst-env /gnu/store/wavrmrs065ikbava5mmvql3l8y4gp6ms-profile/bin/guild compile -O1 -W1 -Wunbound-variable -Warity-mismatch -Wformat -Wshadowed-toplevel -o "tests/errors.scm.go" "tests/errors.scm" wrote `tests/errors.scm.go' ./pre-inst-env /gnu/store/wavrmrs065ikbava5mmvql3l8y4gp6ms-profile/bin/guild compile -O1 -W1 -Wunbound-variable -Warity-mismatch -Wformat -Wshadowed-toplevel -o "tests/events.scm.go" "tests/events.scm" wrote `tests/events.scm.go' ./pre-inst-env /gnu/store/wavrmrs065ikbava5mmvql3l8y4gp6ms-profile/bin/guild compile -O1 -W1 -Wunbound-variable -Warity-mismatch -Wformat -Wshadowed-toplevel -o "tests/files.scm.go" "tests/files.scm" wrote `tests/files.scm.go' ./pre-inst-env /gnu/store/wavrmrs065ikbava5mmvql3l8y4gp6ms-profile/bin/guild compile -O1 -W1 -Wunbound-variable -Warity-mismatch -Wformat -Wshadowed-toplevel -o "tests/forgejo.scm.go" "tests/forgejo.scm" wrote `tests/check.scm.go' ./pre-inst-env /gnu/store/wavrmrs065ikbava5mmvql3l8y4gp6ms-profile/bin/guild compile -O1 -W1 -Wunbound-variable -Warity-mismatch -Wformat -Wshadowed-toplevel -o "tests/http.scm.go" "tests/http.scm" wrote `tests/forgejo.scm.go' ./pre-inst-env /gnu/store/wavrmrs065ikbava5mmvql3l8y4gp6ms-profile/bin/guild compile -O1 -W1 -Wunbound-variable -Warity-mismatch -Wformat -Wshadowed-toplevel -o "tests/layout.scm.go" "tests/layout.scm" wrote `tests/http.scm.go' ./pre-inst-env /gnu/store/wavrmrs065ikbava5mmvql3l8y4gp6ms-profile/bin/guild compile -O1 -W1 -Wunbound-variable -Warity-mismatch -Wformat -Wshadowed-toplevel -o "tests/masking.scm.go" "tests/masking.scm" wrote `tests/layout.scm.go' ./pre-inst-env /gnu/store/wavrmrs065ikbava5mmvql3l8y4gp6ms-profile/bin/guild compile -O1 -W1 -Wunbound-variable -Warity-mismatch -Wformat -Wshadowed-toplevel -o "tests/metrics.scm.go" "tests/metrics.scm" wrote `tests/masking.scm.go' ./pre-inst-env /gnu/store/wavrmrs065ikbava5mmvql3l8y4gp6ms-profile/bin/guild compile -O1 -W1 -Wunbound-variable -Warity-mismatch -Wformat -Wshadowed-toplevel -o "tests/pages.scm.go" "tests/pages.scm" wrote `tests/metrics.scm.go' ./pre-inst-env /gnu/store/wavrmrs065ikbava5mmvql3l8y4gp6ms-profile/bin/guild compile -O1 -W1 -Wunbound-variable -Warity-mismatch -Wformat -Wshadowed-toplevel -o "tests/model.scm.go" "tests/model.scm" wrote `tests/pages.scm.go' ./pre-inst-env /gnu/store/wavrmrs065ikbava5mmvql3l8y4gp6ms-profile/bin/guild compile -O1 -W1 -Wunbound-variable -Warity-mismatch -Wformat -Wshadowed-toplevel -o "tests/output-marks.scm.go" "tests/output-marks.scm" wrote `tests/output-marks.scm.go' ./pre-inst-env /gnu/store/wavrmrs065ikbava5mmvql3l8y4gp6ms-profile/bin/guild compile -O1 -W1 -Wunbound-variable -Warity-mismatch -Wformat -Wshadowed-toplevel -o "tests/notify.scm.go" "tests/notify.scm" wrote `tests/model.scm.go' ./pre-inst-env /gnu/store/wavrmrs065ikbava5mmvql3l8y4gp6ms-profile/bin/guild compile -O1 -W1 -Wunbound-variable -Warity-mismatch -Wformat -Wshadowed-toplevel -o "tests/pipeline.scm.go" "tests/pipeline.scm" wrote `tests/notify.scm.go' ./pre-inst-env /gnu/store/wavrmrs065ikbava5mmvql3l8y4gp6ms-profile/bin/guild compile -O1 -W1 -Wunbound-variable -Warity-mismatch -Wformat -Wshadowed-toplevel -o "tests/pipeline-shepherd.scm.go" "tests/pipeline-shepherd.scm" wrote `tests/pipeline-shepherd.scm.go' ./pre-inst-env /gnu/store/wavrmrs065ikbava5mmvql3l8y4gp6ms-profile/bin/guild compile -O1 -W1 -Wunbound-variable -Warity-mismatch -Wformat -Wshadowed-toplevel -o "tests/processes.scm.go" "tests/processes.scm" wrote `tests/processes.scm.go' ./pre-inst-env /gnu/store/wavrmrs065ikbava5mmvql3l8y4gp6ms-profile/bin/guild compile -O1 -W1 -Wunbound-variable -Warity-mismatch -Wformat -Wshadowed-toplevel -o "tests/pumphouse.scm.go" "tests/pumphouse.scm" wrote `tests/pipeline.scm.go' ./pre-inst-env /gnu/store/wavrmrs065ikbava5mmvql3l8y4gp6ms-profile/bin/guild compile -O1 -W1 -Wunbound-variable -Warity-mismatch -Wformat -Wshadowed-toplevel -o "tests/pumphouse-draining.scm.go" "tests/pumphouse-draining.scm" wrote `tests/pumphouse.scm.go' ./pre-inst-env /gnu/store/wavrmrs065ikbava5mmvql3l8y4gp6ms-profile/bin/guild compile -O1 -W1 -Wunbound-variable -Warity-mismatch -Wformat -Wshadowed-toplevel -o "tests/pumphouse-lost.scm.go" "tests/pumphouse-lost.scm" wrote `tests/pumphouse-draining.scm.go' ./pre-inst-env /gnu/store/wavrmrs065ikbava5mmvql3l8y4gp6ms-profile/bin/guild compile -O1 -W1 -Wunbound-variable -Warity-mismatch -Wformat -Wshadowed-toplevel -o "tests/pumphouse-replay.scm.go" "tests/pumphouse-replay.scm" wrote `tests/pumphouse-replay.scm.go' ./pre-inst-env /gnu/store/wavrmrs065ikbava5mmvql3l8y4gp6ms-profile/bin/guild compile -O1 -W1 -Wunbound-variable -Warity-mismatch -Wformat -Wshadowed-toplevel -o "tests/pumphouse-restart.scm.go" "tests/pumphouse-restart.scm" wrote `tests/pumphouse-lost.scm.go' ./pre-inst-env /gnu/store/wavrmrs065ikbava5mmvql3l8y4gp6ms-profile/bin/guild compile -O1 -W1 -Wunbound-variable -Warity-mismatch -Wformat -Wshadowed-toplevel -o "tests/pumphouse-shepherd.scm.go" "tests/pumphouse-shepherd.scm" wrote `tests/pumphouse-restart.scm.go' ./pre-inst-env /gnu/store/wavrmrs065ikbava5mmvql3l8y4gp6ms-profile/bin/guild compile -O1 -W1 -Wunbound-variable -Warity-mismatch -Wformat -Wshadowed-toplevel -o "tests/pumphouse-stopping.scm.go" "tests/pumphouse-stopping.scm" wrote `tests/pumphouse-shepherd.scm.go' ./pre-inst-env /gnu/store/wavrmrs065ikbava5mmvql3l8y4gp6ms-profile/bin/guild compile -O1 -W1 -Wunbound-variable -Warity-mismatch -Wformat -Wshadowed-toplevel -o "tests/pumphouse-timers.scm.go" "tests/pumphouse-timers.scm" wrote `tests/pumphouse-stopping.scm.go' ./pre-inst-env /gnu/store/wavrmrs065ikbava5mmvql3l8y4gp6ms-profile/bin/guild compile -O1 -W1 -Wunbound-variable -Warity-mismatch -Wformat -Wshadowed-toplevel -o "tests/reconnect.scm.go" "tests/reconnect.scm" wrote `tests/pumphouse-timers.scm.go' ./pre-inst-env /gnu/store/wavrmrs065ikbava5mmvql3l8y4gp6ms-profile/bin/guild compile -O1 -W1 -Wunbound-variable -Warity-mismatch -Wformat -Wshadowed-toplevel -o "tests/records.scm.go" "tests/records.scm" wrote `tests/reconnect.scm.go' ./pre-inst-env /gnu/store/wavrmrs065ikbava5mmvql3l8y4gp6ms-profile/bin/guild compile -O1 -W1 -Wunbound-variable -Warity-mismatch -Wformat -Wshadowed-toplevel -o "tests/relay.scm.go" "tests/relay.scm" wrote `tests/relay.scm.go' ./pre-inst-env /gnu/store/wavrmrs065ikbava5mmvql3l8y4gp6ms-profile/bin/guild compile -O1 -W1 -Wunbound-variable -Warity-mismatch -Wformat -Wshadowed-toplevel -o "tests/run-query.scm.go" "tests/run-query.scm" wrote `tests/records.scm.go' ./pre-inst-env /gnu/store/wavrmrs065ikbava5mmvql3l8y4gp6ms-profile/bin/guild compile -O1 -W1 -Wunbound-variable -Warity-mismatch -Wformat -Wshadowed-toplevel -o "tests/shepherd-bridge.scm.go" "tests/shepherd-bridge.scm" wrote `tests/run-query.scm.go' ./pre-inst-env /gnu/store/wavrmrs065ikbava5mmvql3l8y4gp6ms-profile/bin/guild compile -O1 -W1 -Wunbound-variable -Warity-mismatch -Wformat -Wshadowed-toplevel -o "tests/repl.scm.go" "tests/repl.scm" wrote `tests/shepherd-bridge.scm.go' ./pre-inst-env /gnu/store/wavrmrs065ikbava5mmvql3l8y4gp6ms-profile/bin/guild compile -O1 -W1 -Wunbound-variable -Warity-mismatch -Wformat -Wshadowed-toplevel -o "tests/scope.scm.go" "tests/scope.scm" wrote `tests/repl.scm.go' ./pre-inst-env /gnu/store/wavrmrs065ikbava5mmvql3l8y4gp6ms-profile/bin/guild compile -O1 -W1 -Wunbound-variable -Warity-mismatch -Wformat -Wshadowed-toplevel -o "tests/source.scm.go" "tests/source.scm" wrote `tests/scope.scm.go' ./pre-inst-env /gnu/store/wavrmrs065ikbava5mmvql3l8y4gp6ms-profile/bin/guild compile -O1 -W1 -Wunbound-variable -Warity-mismatch -Wformat -Wshadowed-toplevel -o "tests/step-scheduling.scm.go" "tests/step-scheduling.scm" wrote `tests/source.scm.go' ./pre-inst-env /gnu/store/wavrmrs065ikbava5mmvql3l8y4gp6ms-profile/bin/guild compile -O1 -W1 -Wunbound-variable -Warity-mismatch -Wformat -Wshadowed-toplevel -o "tests/uploader.scm.go" "tests/uploader.scm" wrote `tests/step-scheduling.scm.go' wrote `tests/uploader.scm.go' make[2]: Leaving directory '/home/chris/pipeline-shepherd/state/work/automate-pipelines/automate-7Ldcck/automate-work-s15JIE/workspace/source' make check-TESTS make[2]: Entering directory '/home/chris/pipeline-shepherd/state/work/automate-pipelines/automate-7Ldcck/automate-work-s15JIE/workspace/source' make[3]: Entering directory '/home/chris/pipeline-shepherd/state/work/automate-pipelines/automate-7Ldcck/automate-work-s15JIE/workspace/source' PASS: tests/attach.scm PASS: tests/check.scm PASS: tests/authority.scm PASS: tests/contain.scm PASS: tests/errors.scm PASS: tests/dispatch.scm PASS: tests/files.scm PASS: tests/forgejo.scm PASS: tests/events.scm PASS: tests/layout.scm PASS: tests/masking.scm PASS: tests/http.scm PASS: tests/metrics.scm PASS: tests/pages.scm PASS: tests/output-marks.scm PASS: tests/notify.scm PASS: tests/model.scm PASS: tests/pipeline-shepherd.scm PASS: tests/processes.scm PASS: tests/pumphouse.scm PASS: tests/pipeline.scm FAIL: tests/pumphouse-draining.scm PASS: tests/pumphouse-replay.scm PASS: tests/pumphouse-restart.scm PASS: tests/pumphouse-shepherd.scm PASS: tests/pumphouse-lost.scm FAIL: tests/pumphouse-stopping.scm FAIL: tests/pumphouse-timers.scm PASS: tests/records.scm PASS: tests/reconnect.scm PASS: tests/run-query.scm PASS: tests/relay.scm PASS: tests/repl.scm PASS: tests/scope.scm PASS: tests/source.scm PASS: tests/step-scheduling.scm PASS: tests/shepherd-bridge.scm PASS: tests/uploader.scm ================================================ guile-automate 0.0.0-dev: ./test-suite.log ================================================ # TOTAL: 38 # PASS: 35 # SKIP: 0 # XFAIL: 0 # FAIL: 3 # XPASS: 0 # ERROR: 0 System information (uname -a): Linux 6.18.13-gnu #1 SMP PREEMPT_DYNAMIC 1 x86_64 .. contents:: :depth: 2 FAIL: tests/pumphouse-draining ============================== http on port 34985 pumphouse listening on /tmp/automate-tests-oiDAwg/automate-pumphouse-nIgRdT/socket admin: /tmp/automate-tests-oiDAwg/automate-pumphouse-nIgRdT/admin remote admin: /tmp/automate-tests-oiDAwg/automate-pumphouse-nIgRdT/remote-admin attached to the pumphouse of /tmp/automate-tests-oiDAwg/automate-pumphouse-nIgRdT/any run 005807dc75cf9b1a asked this process to drain and stop: upgraded stopping: taking no more runs; 1 in flight Goblins exception: In message to #<local-object ^pipeline-endpoint>: (run (run-request (id . "04e8e84f27a7a34d") (parameters) (cause . #f) (ancestors))) ice-9/boot-9.scm:1705:22: In procedure raise-exception: ERROR: 1. &automate-error: kind: busy irritants: (tests/stopping/other) 2. &message: "this process is stopping" 3. &irritants: (tests/stopping/other) warning: mutating the process environment while multiple threads are running; further behavior unspecified. In goblins/core.scm: 1074:7 2 (syscaller-$ _ #<local-object ^pipeline-endpoint> (run (run-request (id . "04e8e84f27a7a34d") (parameters) (cause . #f) (ancestors)))) In automate/model.scm: 119:2 1 (raise-automate-error _ _ . _) In ice-9/boot-9.scm: 1705:22 0 (raise-exception _ #:continuable? _) tests/stopping/other run: this process is stopping: tests/stopping/other Goblins exception: In message to #<local-object broken-handler>: (#<&compound-exception components: (#<&automate-error kind: busy irritants: (tests/stopping/other)> #<&message message: "this process is stopping"> #<&irritants irritants: (tests/stopping/other)>)>) ice-9/boot-9.scm:1705:22: In procedure raise-exception: In procedure string-append: Wrong type (expecting string): tests/stopping/other In goblins/core.scm: 1074:7 4 (syscaller-$ _ #<local-object broken-handler> (#<&compound-exception components: (#<&automate-error kind: busy irritants: (tests/stopping/other)> #<&message message: "this process is stopping"> #<&irritants irritants: (tests/stopping/other)>)>)) 2038:14 3 (_ . _) In automate/pipeline/errors.scm: 234:41 2 (_ _) In unknown file: 1 (string-append tests/stopping/other " answered it") In ice-9/boot-9.scm: 1705:22 0 (raise-exception _ #:continuable? _) admin run: #<&compound-exception components: (#<&mystery-exception> #<&message message: "Unknown error occurred with remote object"> #<&irritants irritants: ()>)> attached to the pumphouse of /tmp/automate-tests-oiDAwg/automate-pumphouse-nIgRdT/any attached to the pumphouse of /tmp/automate-tests-oiDAwg/automate-pumphouse-nIgRdT/any attached to the pumphouse of /tmp/automate-tests-oiDAwg/automate-pumphouse-nIgRdT/any the pumphouse asked this process to drain and stop: fleet upgrade stopping: taking no more runs; 0 in flight the pumphouse asked this process to drain and stop: operator stopping: taking no more runs; 0 in flight Goblins exception: In message to #<local-object ^admin>: (drain-and-stop tests/stopping/fleet #f "again") ice-9/boot-9.scm:1705:22: In procedure raise-exception: ERROR: 1. &automate-error: kind: not-attached irritants: (tests/stopping/fleet #f) 2. &message: "no pipeline process is attached under this name" 3. &irritants: (tests/stopping/fleet #f) warning: mutating the process environment while multiple threads are running; further behavior unspecified. In goblins/core.scm: 1074:7 3 (syscaller-$ _ #<local-object ^admin> (drain-and-stop tests/stopping/fleet #f "again")) In automate/pumphouse.scm: 110:6 2 (drain-processes! #<<pumphouse> records: #<local-object ^records> lives: #<hash-table 7fe96118fd40 4/31> serving: #<hash-table 7fe96118fd20 4/31> owners: #<hash-table 7fe96118fd00 0/31> reporters: #<hash-table 7fe96118fce0 0/31> shared: #<hash-table 7fe96118fcc0 0/31> gates: #<hash-table 7fe96118fca0 0/31> stopped: #<hash-table 7fe96118fc80 0/31> waiting: #<hash-table 7fe9611a2fe0 0/31> timers: #<hash-table 7fe9611a2fc0 0/31> tokens: #<hash-table 7fe9611a2fa0 2/31> registration…> …) In automate/model.scm: 119:2 1 (raise-automate-error _ _ . _) In ice-9/boot-9.scm: 1705:22 0 (raise-exception _ #:continuable? _) admin drain-and-stop: no pipeline process is attached under this name: tests/stopping/fleet, #f == pumphouse-draining.scm fail: after which it takes no new run of any pipeline it serves error: #<&compound-exception components: (#<&mystery-exception> #<&message message: "Unknown error occurred with remote object"> #<&irritants irritants: ()>)> stop 2203: kill #<unspecified>, waitpid (2203 . 9) stop 1988: kill #<unspecified>, waitpid (1988 . 0) 18 passed, 1 failed FAIL tests/pumphouse-draining.scm (exit status: 1) FAIL: tests/pumphouse-stopping ============================== http on port 46473 pumphouse listening on /tmp/automate-tests-4MQ6im/automate-pumphouse-vmE0zI/socket admin: /tmp/automate-tests-4MQ6im/automate-pumphouse-vmE0zI/admin remote admin: /tmp/automate-tests-4MQ6im/automate-pumphouse-vmE0zI/remote-admin attached to the pumphouse of /tmp/automate-tests-4MQ6im/automate-pumphouse-vmE0zI/any stopping: taking no more runs; 1 in flight attached to the pumphouse of /tmp/automate-tests-4MQ6im/automate-pumphouse-vmE0zI/any stopping: taking no more runs; 1 in flight Goblins exception: In message to #<local-object ^pipeline-endpoint>: (run (run-request (id . "ccdb82e19f88abb3") (parameters) (cause . #f) (ancestors))) ice-9/boot-9.scm:1705:22: In procedure raise-exception: ERROR: 1. &automate-error: kind: busy irritants: (tests/stopping/nap) 2. &message: "this process is stopping" 3. &irritants: (tests/stopping/nap) warning: mutating the process environment while multiple threads are running; further behavior unspecified. In goblins/core.scm: 1074:7 2 (syscaller-$ _ #<local-object ^pipeline-endpoint> (run (run-request (id . "ccdb82e19f88abb3") (parameters) (cause . #f) (ancestors)))) In automate/model.scm: 119:2 1 (raise-automate-error _ _ . _) In ice-9/boot-9.scm: 1705:22 0 (raise-exception _ #:continuable? _) tests/stopping/nap run: this process is stopping: tests/stopping/nap Goblins exception: In message to #<local-object broken-handler>: (#<&compound-exception components: (#<&automate-error kind: busy irritants: (tests/stopping/nap)> #<&message message: "this process is stopping"> #<&irritants irritants: (tests/stopping/nap)>)>) ice-9/boot-9.scm:1705:22: In procedure raise-exception: In procedure string-append: Wrong type (expecting string): tests/stopping/nap In goblins/core.scm: 1074:7 4 (syscaller-$ _ #<local-object broken-handler> (#<&compound-exception components: (#<&automate-error kind: busy irritants: (tests/stopping/nap)> #<&message message: "this process is stopping"> #<&irritants irritants: (tests/stopping/nap)>)>)) 2038:14 3 (_ . _) In automate/pipeline/errors.scm: 234:41 2 (_ _) In unknown file: 1 (string-append tests/stopping/nap " answered it") In ice-9/boot-9.scm: 1705:22 0 (raise-exception _ #:continuable? _) admin run: #<&compound-exception components: (#<&mystery-exception> #<&message message: "Unknown error occurred with remote object"> #<&irritants irritants: ()>)> stopping: 1 still in flight at the deadline; aborting removed what an earlier process left in /tmp/automate-tests-4MQ6im/automate-pumphouse-vmE0zI/working run de4e466a8931f218 reported to the pumphouse run errored linger: abandoned == pumphouse-stopping.scm fail: a pipeline daemon stopping takes no new run error: #<&compound-exception components: (#<&mystery-exception> #<&message message: "Unknown error occurred with remote object"> #<&irritants irritants: ()>)> stop 2757: kill #<unspecified>, waitpid (2757 . 9) stop 2770: kill #<unspecified>, waitpid (2770 . 9) stop 2650: kill #<unspecified>, waitpid (2650 . 0) 19 passed, 1 failed FAIL tests/pumphouse-stopping.scm (exit status: 1) FAIL: tests/pumphouse-timers ============================ http on port 38655 pumphouse listening on /tmp/automate-tests-CACZGP/automate-pumphouse-XTqIZr/socket admin: /tmp/automate-tests-CACZGP/automate-pumphouse-XTqIZr/admin remote admin: /tmp/automate-tests-CACZGP/automate-pumphouse-XTqIZr/remote-admin attached to the pumphouse of /tmp/automate-tests-CACZGP/automate-pumphouse-XTqIZr/any 2026-10-15 13:22:48 (with-exception-handler) INFO: POST /output/694161e3118ead4b/tick 200 6ms 2026-10-15 13:22:49 (with-exception-handler) INFO: POST /output/bab3a575b2594cba/tick 200 3ms Goblins exception: In message to #<local-object ^admin>: (pause tests/no-such-timer) ice-9/boot-9.scm:1705:22: In procedure raise-exception: ERROR: 1. &automate-error: kind: no-timer irritants: (tests/no-such-timer) 2. &message: "no timer of this name" 3. &irritants: (tests/no-such-timer) warning: mutating the process environment while multiple threads are running; further behavior unspecified. In goblins/core.scm: 1074:7 3 (syscaller-$ _ #<local-object ^admin> (pause tests/no-such-timer)) In automate/pumphouse.scm: 750:6 2 (pause _) In automate/model.scm: 119:2 1 (raise-automate-error _ _ . _) In ice-9/boot-9.scm: 1705:22 0 (raise-exception _ #:continuable? _) admin pause: no timer of this name: tests/no-such-timer Goblins exception: In message to #<local-object ^admin>: (pause tests/no-such-timer) ice-9/boot-9.scm:1705:22: In procedure raise-exception: ERROR: 1. &automate-error: kind: no-timer irritants: (tests/no-such-timer) 2. &message: "no timer of this name" 3. &irritants: (tests/no-such-timer) In goblins/core.scm: 1074:7 3 (syscaller-$ _ #<local-object ^admin> (pause tests/no-such-timer)) In automate/pumphouse.scm: 750:6 2 (pause _) In automate/model.scm: 119:2 1 (raise-automate-error _ _ . _) In ice-9/boot-9.scm: 1705:22 0 (raise-exception _ #:continuable? _) admin pause: no timer of this name: tests/no-such-timer Goblins exception: In message to #<local-object ^pipeline-endpoint>: (run (run-request (id . "2c233ac409833585") (parameters) (cause . #f) (ancestors))) ice-9/boot-9.scm:1705:22: In procedure raise-exception: ERROR: 1. &automate-error: kind: missing-parameter irritants: (n) 2. &message: "run request lacks a parameter" 3. &irritants: (n) warning: mutating the process environment while multiple threads are running; further behavior unspecified. In goblins/core.scm: 1074:7 4 (syscaller-$ _ #<local-object ^pipeline-endpoint> (run (run-request (id . "2c233ac409833585") (parameters) (cause . #f) (ancestors)))) In automate/pipeline/daemon.scm: 507:7 3 (run (run-request (id . "2c233ac409833585") (parameters) (cause . #f) (ancestors))) In srfi/srfi-1.scm: 750:9 2 (for-each #<procedure 7f0c5e4fbc80 at automate/pipeline.scm:1181:12 (entry)> ((param (name n)))) In automate/model.scm: 119:2 1 (raise-automate-error _ _ . _) In ice-9/boot-9.scm: 1705:22 0 (raise-exception _ #:continuable? _) tests/tick run: run request lacks a parameter: n Goblins exception: In message to #<local-object broken-handler>: (#<&compound-exception components: (#<&automate-error kind: missing-parameter irritants: (n)> #<&message message: "run request lacks a parameter"> #<&irritants irritants: (n)>)>) ice-9/boot-9.scm:1705:22: In procedure raise-exception: In procedure string-append: Wrong type (expecting string): tests/tick In goblins/core.scm: 1074:7 4 (syscaller-$ _ #<local-object broken-handler> (#<&compound-exception components: (#<&automate-error kind: missing-parameter irritants: (n)> #<&message message: "run request lacks a parameter"> #<&irritants irritants: (n)>)>)) 2038:14 3 (_ . _) In automate/pipeline/errors.scm: 234:41 2 (_ _) In unknown file: 1 (string-append tests/tick " answered it") In ice-9/boot-9.scm: 1705:22 0 (raise-exception _ #:continuable? _) admin run: #<&compound-exception components: (#<&mystery-exception> #<&message message: "Unknown error occurred with remote object"> #<&irritants irritants: ()>)> admin run: no answer in time: tests/hook == pumphouse-timers.scm fail: and passes on why the pipeline process refused error: #<&compound-exception components: (#<&mystery-exception> #<&message message: "Unknown error occurred with remote object"> #<&irritants irritants: ()>)> stop 2747: kill #<unspecified>, waitpid (2747 . 9) stop 2714: kill #<unspecified>, waitpid (2714 . 0) 14 passed, 1 failed FAIL tests/pumphouse-timers.scm (exit status: 1) ============================================================================ Testsuite summary for guile-automate 0.0.0-dev ============================================================================ # TOTAL: 38 # PASS: 35 # SKIP: 0 # XFAIL: 0 # FAIL: 3 # XPASS: 0 # ERROR: 0 ============================================================================ See ./test-suite.log for debugging. ============================================================================ make[3]: *** [Makefile:988: test-suite.log] Error 1 make[3]: Leaving directory '/home/chris/pipeline-shepherd/state/work/automate-pipelines/automate-7Ldcck/automate-work-s15JIE/workspace/source' make[2]: *** [Makefile:1123: check-TESTS] Error 2 make[2]: Leaving directory '/home/chris/pipeline-shepherd/state/work/automate-pipelines/automate-7Ldcck/automate-work-s15JIE/workspace/source' make[1]: *** [Makefile:1345: check-am] Error 2 make[1]: Leaving directory '/home/chris/pipeline-shepherd/state/work/automate-pipelines/automate-7Ldcck/automate-work-s15JIE/workspace/source' make: *** [Makefile:874: check-recursive] Error 1 error: #<&invoke-error program: "/gnu/store/wavrmrs065ikbava5mmvql3l8y4gp6ms-profile/bin/bash" arguments: ("-c" "set -eo pipefail\nexport GUIX_PROFILE=/gnu/store/wavrmrs065ikbava5mmvql3l8y4gp6ms-profile\nsource \"$GUIX_PROFILE/etc/profile\"\ncd /home/chris/pipeline-shepherd/state/work/automate-pipelines/automate-7Ldcck/automate-work-s15JIE/workspace/source\nexport XDG_CACHE_HOME=\"$TMPDIR/cache\"\nmake check -j$(nproc) VERBOSE=1") exit-status: 2 term-signal: #f stop-signal: #f> backtrace: automate/pipeline/step.scm:676:62 (_) automate/step-body/check.scm:23:4 (body-thunk) guix/build/utils.scm:822:6 (invoke)