65edbabcaeebbce7 / package errored

Started
Duration
6m 22s

Defined at .automate/pipelines.scm:132

Building guile-automate from the channel at /home/chris/pipeline-shepherd/state/work/automate-pipelines/automate-7Ldcck/automate-work-s15JIE/workspace/channel
substitute: 
substitute: looking for substitutes on 'https://bordeaux.guix.gnu.org'...   0.0%
substitute: looking for substitutes on 'https://bordeaux.guix.gnu.org'... 100.0%
substitute: 
substitute: looking for substitutes on 'https://ci.guix.gnu.org'...   0.0%
substitute: looking for substitutes on 'https://ci.guix.gnu.org'... 100.0%
The following derivation will be built:
  /gnu/store/26blv1dslzrfzk6k1mm3qfxm8zwbg6cx-guile-automate-0.0.0-dev.drv
building /gnu/store/26blv1dslzrfzk6k1mm3qfxm8zwbg6cx-guile-automate-0.0.0-dev.drv...
starting phase `separate-from-pid1'
phase `separate-from-pid1' succeeded after 0.0 seconds
build process now running as PID 4
starting phase `set-SOURCE-DATE-EPOCH'
phase `set-SOURCE-DATE-EPOCH' succeeded after 0.0 seconds
starting phase `set-paths'
environment variable `PATH' set to `/gnu/store/k7vkw9x3wl3lni6a0i2w8xz2z8ylrqyz-guile-3.0.11/bin:/gnu/store/8lbxqsdjb6h32npjf1xg0vfs4a14j3c3-autoconf-2.69/bin:/gnu/store/pq8iw7w4ii30cy8kd5zwmxib36ziwccn-automake-1.17/bin:/gnu/store/vrwsp65rnf487x907m16033yx9x585dc-make-4.4.1/bin:/gnu/store/2862nsy960k83ci9k4jdmvwp100q07gs-pkg-config-0.29.2/bin:/gnu/store/wp75a72a13s2x1dk4d2vc4m4ma9gaxyx-texinfo-7.3/bin:/gnu/store/r5gafvw9iapq6173liw37bzxj40bslhs-guile-documenta-0.4.0/bin:/gnu/store/hia0r9nnmqaxjwlgwjay50a3x43scrci-bash-minimal-5.2.37/bin:/gnu/store/k83f6pby77lzbilg4gdv99s63ib5jr44-coreutils-9.1/bin:/gnu/store/p2h7xqh23qsjlbapadpmfzxibxqfahpc-tar-1.35/bin:/gnu/store/gsr333qygwvf1zjdsc413hs07pd3ygwc-gzip-1.14/bin:/gnu/store/jwp4z6flb9hqfjwvvbkzij7b893j382y-bzip2-1.0.8/bin:/gnu/store/gziyc8kh2wd5gq3ah8vjvpr73my4cgam-xz-5.4.5/bin:/gnu/store/7a6l3fzjvr3nvbnw579wdkhhszzzh3ql-guix-1.5.0-6.64d4de2/bin:/gnu/store/fp4rjwzvrm309wg11jahx8qcm7ypkai3-guile-ares-rs-0.9.8/bin:/gnu/store/hfx188ymz9y9ialr175lqifn3b6xfdnz-shepherd-1.0.9/bin:/gnu/store/hfx188ymz9y9ialr175lqifn3b6xfdnz-shepherd-1.0.9/sbin'
environment variable `GUILE_LOAD_PATH' set to `/gnu/store/r5gafvw9iapq6173liw37bzxj40bslhs-guile-documenta-0.4.0/share/guile/site/3.0:/gnu/store/qzml053shmjml5vj6rbcfss5247h20f6-guile-syntax-highlight-0.3.1/share/guile/site/3.0:/gnu/store/7a6l3fzjvr3nvbnw579wdkhhszzzh3ql-guix-1.5.0-6.64d4de2/share/guile/site/3.0:/gnu/store/zplkplr3qmp5dpvhcxpgqr1lg44wmxyk-guile-goblins-0.18.0/share/guile/site/3.0:/gnu/store/5la7a0imnji190xnfmxf0jrsp82dn9hq-guile-fibers-1.4.3/share/guile/site/3.0:/gnu/store/z4fnbwa7d6dprqvd7f89wcifq6ggr2wm-guile-gcrypt-0.5.0/share/guile/site/3.0:/gnu/store/b9928rpaj24whj9cz36yd1h28w7pwphq-guile-gnutls-5.0.2/share/guile/site/3.0:/gnu/store/nw7d5iijwm9sa16k2swxjalgp0vlm01v-guile-json-4.7.3/share/guile/site/3.0:/gnu/store/gyf1hm3gzbq00aw3m9x1xickf3zs3pq8-guile-knots-0.1-39.3417d25/share/guile/site/3.0:/gnu/store/wsg7chjw2cg6xnp4il5caff5w0w69ikc-guile-sqlite3-0.1.3/share/guile/site/3.0:/gnu/store/8n90dzhz177l1lz8bjrxsgbiyh1kmjap-guile-zlib-0.2.2/share/guile/site/3.0:/gnu/store/2qm9a3n19pnznv791jvglb4sgh1jda3s-guile-safsaf-0.5-1.8b35410/share/guile/site/3.0:/gnu/store/9ia4lplmfhpdxnnkvk0zyhyainyn0r0q-guile-prometheus-0-11.8f70b4b/share/guile/site/3.0:/gnu/store/fp4rjwzvrm309wg11jahx8qcm7ypkai3-guile-ares-rs-0.9.8/share/guile/site/3.0:/gnu/store/hfx188ymz9y9ialr175lqifn3b6xfdnz-shepherd-1.0.9/share/guile/site/3.0:/gnu/store/x9ypa71lzv9jrd5n0qxq51hxnra83z2x-guile-lib-0.2.8.1/share/guile/site/3.0:/gnu/store/9rd4c5w765bmsx0cimk0idpfasicvcdr-guile-config-0.5.1/share/guile/site/3.0:/gnu/store/lsys62yw1wnmchmvv3q5x7bzkghyasil-guile-zstd-0.1.1/share/guile/site/3.0:/gnu/store/gq36qbm22984252qxrzrgvrqzx807kd0-guile-lzlib-0.4.0/share/guile/site/3.0:/gnu/store/axcsnac5kji5p4apyf67jqgpbvs47hcm-guile-git-0.12.1/share/guile/site/3.0:/gnu/store/3xl1r2ppwspvhrlv4rzdcw3izhnvlkzm-guile-ssh-1.0.0/share/guile/site/3.0:/gnu/store/dkzraln87ih1cbl36npg9fgyfqnmpqhh-guile-semver-0.2.0/share/guile/site/3.0:/gnu/store/06k0pq8d20w6f3ymkgdwkm6k6rf2v7yj-guile-lib-0.2.8.1/share/guile/site/3.0:/gnu/store/gl031z5csmpkyvicv8q4a3wjjgl5gqbi-guile-avahi-0.4.1/share/guile/site/3.0:/gnu/store/k1yhnx32pjwr409ag3l25816ylasvzrf-guile-websocket-0.3.0/share/guile/site/3.0:/gnu/store/c7k95lcd985bph7kycpjcwsbw0ky0yw1-guile-bstructs-0.2.0/share/guile/site/3.0:/gnu/store/a7k8b77qmv34vjbw5gkgm160zph4lxlg-guile-webutils-0.1-1.d309d65/share/guile/site/3.0:/gnu/store/cjnz2ikdas5ih7x2gs95fgi9q6f376gk-guile-bytestructures-2.0.2/share/guile/site/3.0:/gnu/store/kwd8v8nwvw00d6akyr58d5bjqjcmfy5d-guile-irregex-0.9.12/share/guile/site/3.0'
environment variable `GUILE_LOAD_COMPILED_PATH' set to `/gnu/store/r5gafvw9iapq6173liw37bzxj40bslhs-guile-documenta-0.4.0/lib/guile/3.0/site-ccache:/gnu/store/r5gafvw9iapq6173liw37bzxj40bslhs-guile-documenta-0.4.0/share/guile/site/3.0:/gnu/store/qzml053shmjml5vj6rbcfss5247h20f6-guile-syntax-highlight-0.3.1/lib/guile/3.0/site-ccache:/gnu/store/qzml053shmjml5vj6rbcfss5247h20f6-guile-syntax-highlight-0.3.1/share/guile/site/3.0:/gnu/store/7a6l3fzjvr3nvbnw579wdkhhszzzh3ql-guix-1.5.0-6.64d4de2/lib/guile/3.0/site-ccache:/gnu/store/7a6l3fzjvr3nvbnw579wdkhhszzzh3ql-guix-1.5.0-6.64d4de2/share/guile/site/3.0:/gnu/store/zplkplr3qmp5dpvhcxpgqr1lg44wmxyk-guile-goblins-0.18.0/lib/guile/3.0/site-ccache:/gnu/store/zplkplr3qmp5dpvhcxpgqr1lg44wmxyk-guile-goblins-0.18.0/share/guile/site/3.0:/gnu/store/5la7a0imnji190xnfmxf0jrsp82dn9hq-guile-fibers-1.4.3/lib/guile/3.0/site-ccache:/gnu/store/5la7a0imnji190xnfmxf0jrsp82dn9hq-guile-fibers-1.4.3/share/guile/site/3.0:/gnu/store/z4fnbwa7d6dprqvd7f89wcifq6ggr2wm-guile-gcrypt-0.5.0/lib/guile/3.0/site-ccache:/gnu/store/z4fnbwa7d6dprqvd7f89wcifq6ggr2wm-guile-gcrypt-0.5.0/share/guile/site/3.0:/gnu/store/b9928rpaj24whj9cz36yd1h28w7pwphq-guile-gnutls-5.0.2/lib/guile/3.0/site-ccache:/gnu/store/b9928rpaj24whj9cz36yd1h28w7pwphq-guile-gnutls-5.0.2/share/guile/site/3.0:/gnu/store/nw7d5iijwm9sa16k2swxjalgp0vlm01v-guile-json-4.7.3/lib/guile/3.0/site-ccache:/gnu/store/nw7d5iijwm9sa16k2swxjalgp0vlm01v-guile-json-4.7.3/share/guile/site/3.0:/gnu/store/gyf1hm3gzbq00aw3m9x1xickf3zs3pq8-guile-knots-0.1-39.3417d25/lib/guile/3.0/site-ccache:/gnu/store/gyf1hm3gzbq00aw3m9x1xickf3zs3pq8-guile-knots-0.1-39.3417d25/share/guile/site/3.0:/gnu/store/wsg7chjw2cg6xnp4il5caff5w0w69ikc-guile-sqlite3-0.1.3/lib/guile/3.0/site-ccache:/gnu/store/wsg7chjw2cg6xnp4il5caff5w0w69ikc-guile-sqlite3-0.1.3/share/guile/site/3.0:/gnu/store/8n90dzhz177l1lz8bjrxsgbiyh1kmjap-guile-zlib-0.2.2/lib/guile/3.0/site-ccache:/gnu/store/8n90dzhz177l1lz8bjrxsgbiyh1kmjap-guile-zlib-0.2.2/share/guile/site/3.0:/gnu/store/2qm9a3n19pnznv791jvglb4sgh1jda3s-guile-safsaf-0.5-1.8b35410/lib/guile/3.0/site-ccache:/gnu/store/2qm9a3n19pnznv791jvglb4sgh1jda3s-guile-safsaf-0.5-1.8b35410/share/guile/site/3.0:/gnu/store/9ia4lplmfhpdxnnkvk0zyhyainyn0r0q-guile-prometheus-0-11.8f70b4b/lib/guile/3.0/site-ccache:/gnu/store/9ia4lplmfhpdxnnkvk0zyhyainyn0r0q-guile-prometheus-0-11.8f70b4b/share/guile/site/3.0:/gnu/store/fp4rjwzvrm309wg11jahx8qcm7ypkai3-guile-ares-rs-0.9.8/lib/guile/3.0/site-ccache:/gnu/store/fp4rjwzvrm309wg11jahx8qcm7ypkai3-guile-ares-rs-0.9.8/share/guile/site/3.0:/gnu/store/hfx188ymz9y9ialr175lqifn3b6xfdnz-shepherd-1.0.9/lib/guile/3.0/site-ccache:/gnu/store/hfx188ymz9y9ialr175lqifn3b6xfdnz-shepherd-1.0.9/share/guile/site/3.0:/gnu/store/x9ypa71lzv9jrd5n0qxq51hxnra83z2x-guile-lib-0.2.8.1/lib/guile/3.0/site-ccache:/gnu/store/x9ypa71lzv9jrd5n0qxq51hxnra83z2x-guile-lib-0.2.8.1/share/guile/site/3.0:/gnu/store/9rd4c5w765bmsx0cimk0idpfasicvcdr-guile-config-0.5.1/lib/guile/3.0/site-ccache:/gnu/store/9rd4c5w765bmsx0cimk0idpfasicvcdr-guile-config-0.5.1/share/guile/site/3.0:/gnu/store/lsys62yw1wnmchmvv3q5x7bzkghyasil-guile-zstd-0.1.1/lib/guile/3.0/site-ccache:/gnu/store/lsys62yw1wnmchmvv3q5x7bzkghyasil-guile-zstd-0.1.1/share/guile/site/3.0:/gnu/store/gq36qbm22984252qxrzrgvrqzx807kd0-guile-lzlib-0.4.0/lib/guile/3.0/site-ccache:/gnu/store/gq36qbm22984252qxrzrgvrqzx807kd0-guile-lzlib-0.4.0/share/guile/site/3.0:/gnu/store/axcsnac5kji5p4apyf67jqgpbvs47hcm-guile-git-0.12.1/lib/guile/3.0/site-ccache:/gnu/store/axcsnac5kji5p4apyf67jqgpbvs47hcm-guile-git-0.12.1/share/guile/site/3.0:/gnu/store/3xl1r2ppwspvhrlv4rzdcw3izhnvlkzm-guile-ssh-1.0.0/lib/guile/3.0/site-ccache:/gnu/store/3xl1r2ppwspvhrlv4rzdcw3izhnvlkzm-guile-ssh-1.0.0/share/guile/site/3.0:/gnu/store/dkzraln87ih1cbl36npg9fgyfqnmpqhh-guile-semver-0.2.0/lib/guile/3.0/site-ccache:/gnu/store/dkzraln87ih1cbl36npg9fgyfqnmpqhh-guile-semver-0.2.0/share/guile/site/3.0:/gnu/store/06k0pq8d20w6f3ymkgdwkm6k6rf2v7yj-guile-lib-0.2.8.1/lib/guile/3.0/site-ccache:/gnu/store/06k0pq8d20w6f3ymkgdwkm6k6rf2v7yj-guile-lib-0.2.8.1/share/guile/site/3.0:/gnu/store/gl031z5csmpkyvicv8q4a3wjjgl5gqbi-guile-avahi-0.4.1/lib/guile/3.0/site-ccache:/gnu/store/gl031z5csmpkyvicv8q4a3wjjgl5gqbi-guile-avahi-0.4.1/share/guile/site/3.0:/gnu/store/k1yhnx32pjwr409ag3l25816ylasvzrf-guile-websocket-0.3.0/lib/guile/3.0/site-ccache:/gnu/store/k1yhnx32pjwr409ag3l25816ylasvzrf-guile-websocket-0.3.0/share/guile/site/3.0:/gnu/store/c7k95lcd985bph7kycpjcwsbw0ky0yw1-guile-bstructs-0.2.0/lib/guile/3.0/site-ccache:/gnu/store/c7k95lcd985bph7kycpjcwsbw0ky0yw1-guile-bstructs-0.2.0/share/guile/site/3.0:/gnu/store/a7k8b77qmv34vjbw5gkgm160zph4lxlg-guile-webutils-0.1-1.d309d65/share/guile/site/3.0:/gnu/store/cjnz2ikdas5ih7x2gs95fgi9q6f376gk-guile-bytestructures-2.0.2/lib/guile/3.0/site-ccache:/gnu/store/cjnz2ikdas5ih7x2gs95fgi9q6f376gk-guile-bytestructures-2.0.2/share/guile/site/3.0:/gnu/store/kwd8v8nwvw00d6akyr58d5bjqjcmfy5d-guile-irregex-0.9.12/lib/guile/3.0/site-ccache:/gnu/store/kwd8v8nwvw00d6akyr58d5bjqjcmfy5d-guile-irregex-0.9.12/share/guile/site/3.0'
environment variable `GUILE_EXTENSIONS_PATH' set to `/gnu/store/5la7a0imnji190xnfmxf0jrsp82dn9hq-guile-fibers-1.4.3/lib/guile/3.0/extensions:/gnu/store/b9928rpaj24whj9cz36yd1h28w7pwphq-guile-gnutls-5.0.2/lib/guile/3.0/extensions:/gnu/store/gl031z5csmpkyvicv8q4a3wjjgl5gqbi-guile-avahi-0.4.1/lib/guile/3.0/extensions'
environment variable `ACLOCAL_PATH' set to `/gnu/store/k7vkw9x3wl3lni6a0i2w8xz2z8ylrqyz-guile-3.0.11/share/aclocal:/gnu/store/pq8iw7w4ii30cy8kd5zwmxib36ziwccn-automake-1.17/share/aclocal:/gnu/store/2862nsy960k83ci9k4jdmvwp100q07gs-pkg-config-0.29.2/share/aclocal'
environment variable `PKG_CONFIG_PATH' set to `/gnu/store/k7vkw9x3wl3lni6a0i2w8xz2z8ylrqyz-guile-3.0.11/lib/pkgconfig:/gnu/store/gziyc8kh2wd5gq3ah8vjvpr73my4cgam-xz-5.4.5/lib/pkgconfig:/gnu/store/ykhx0hclxjg59l43dlhq0iivc785g1cf-libgc-8.2.8/lib/pkgconfig:/gnu/store/x9ypa71lzv9jrd5n0qxq51hxnra83z2x-guile-lib-0.2.8.1/lib/pkgconfig:/gnu/store/06k0pq8d20w6f3ymkgdwkm6k6rf2v7yj-guile-lib-0.2.8.1/lib/pkgconfig'
environment variable `INFOPATH' set to `/gnu/store/k7vkw9x3wl3lni6a0i2w8xz2z8ylrqyz-guile-3.0.11/share/info:/gnu/store/8lbxqsdjb6h32npjf1xg0vfs4a14j3c3-autoconf-2.69/share/info:/gnu/store/pq8iw7w4ii30cy8kd5zwmxib36ziwccn-automake-1.17/share/info:/gnu/store/vrwsp65rnf487x907m16033yx9x585dc-make-4.4.1/share/info:/gnu/store/wp75a72a13s2x1dk4d2vc4m4ma9gaxyx-texinfo-7.3/share/info:/gnu/store/hia0r9nnmqaxjwlgwjay50a3x43scrci-bash-minimal-5.2.37/share/info:/gnu/store/k83f6pby77lzbilg4gdv99s63ib5jr44-coreutils-9.1/share/info:/gnu/store/p2h7xqh23qsjlbapadpmfzxibxqfahpc-tar-1.35/share/info:/gnu/store/gsr333qygwvf1zjdsc413hs07pd3ygwc-gzip-1.14/share/info:/gnu/store/7a6l3fzjvr3nvbnw579wdkhhszzzh3ql-guix-1.5.0-6.64d4de2/share/info:/gnu/store/zplkplr3qmp5dpvhcxpgqr1lg44wmxyk-guile-goblins-0.18.0/share/info:/gnu/store/5la7a0imnji190xnfmxf0jrsp82dn9hq-guile-fibers-1.4.3/share/info:/gnu/store/z4fnbwa7d6dprqvd7f89wcifq6ggr2wm-guile-gcrypt-0.5.0/share/info:/gnu/store/b9928rpaj24whj9cz36yd1h28w7pwphq-guile-gnutls-5.0.2/share/info:/gnu/store/2qm9a3n19pnznv791jvglb4sgh1jda3s-guile-safsaf-0.5-1.8b35410/share/info:/gnu/store/hfx188ymz9y9ialr175lqifn3b6xfdnz-shepherd-1.0.9/share/info:/gnu/store/81gcnknln3563vx75kw8fx27lgcd57xr-libunistring-1.3/share/info:/gnu/store/x9ypa71lzv9jrd5n0qxq51hxnra83z2x-guile-lib-0.2.8.1/share/info:/gnu/store/9rd4c5w765bmsx0cimk0idpfasicvcdr-guile-config-0.5.1/share/info:/gnu/store/axcsnac5kji5p4apyf67jqgpbvs47hcm-guile-git-0.12.1/share/info:/gnu/store/3xl1r2ppwspvhrlv4rzdcw3izhnvlkzm-guile-ssh-1.0.0/share/info:/gnu/store/06k0pq8d20w6f3ymkgdwkm6k6rf2v7yj-guile-lib-0.2.8.1/share/info:/gnu/store/gl031z5csmpkyvicv8q4a3wjjgl5gqbi-guile-avahi-0.4.1/share/info:/gnu/store/c7k95lcd985bph7kycpjcwsbw0ky0yw1-guile-bstructs-0.2.0/share/info'
environment variable `BASH_LOADABLES_PATH' unset
environment variable `GUIX_EXTENSIONS_PATH' unset
environment variable `SSL_CERT_DIR' unset
phase `set-paths' succeeded after 0.0 seconds
starting phase `set-locale-path'
phase `set-locale-path' succeeded after 0.0 seconds
starting phase `install-locale'
using 'C.UTF-8' locale for category "LC_ALL"
phase `install-locale' succeeded after 0.0 seconds
sh: warning: setlocale: LC_ALL: cannot change locale (C.UTF-8): No such file or directory
starting phase `unpack'
`/gnu/store/4lqdcg2p32rl1g0mabzhfag7s3bbx5c9-guile-automate-checkout/COPYING' -> `./COPYING'
`/gnu/store/4lqdcg2p32rl1g0mabzhfag7s3bbx5c9-guile-automate-checkout/CLAUDE.md' -> `./CLAUDE.md'
`/gnu/store/4lqdcg2p32rl1g0mabzhfag7s3bbx5c9-guile-automate-checkout/.dir-locals.el' -> `./.dir-locals.el'
`/gnu/store/4lqdcg2p32rl1g0mabzhfag7s3bbx5c9-guile-automate-checkout/manifest.scm' -> `./manifest.scm'
`/gnu/store/4lqdcg2p32rl1g0mabzhfag7s3bbx5c9-guile-automate-checkout/automate.scm' -> `./automate.scm'
`/gnu/store/4lqdcg2p32rl1g0mabzhfag7s3bbx5c9-guile-automate-checkout/STYLE.md' -> `./STYLE.md'
`/gnu/store/4lqdcg2p32rl1g0mabzhfag7s3bbx5c9-guile-automate-checkout/DESIGN.md' -> `./DESIGN.md'
`/gnu/store/4lqdcg2p32rl1g0mabzhfag7s3bbx5c9-guile-automate-checkout/.envrc' -> `./.envrc'
`/gnu/store/4lqdcg2p32rl1g0mabzhfag7s3bbx5c9-guile-automate-checkout/guix.scm' -> `./guix.scm'
`/gnu/store/4lqdcg2p32rl1g0mabzhfag7s3bbx5c9-guile-automate-checkout/README.md' -> `./README.md'
`/gnu/store/4lqdcg2p32rl1g0mabzhfag7s3bbx5c9-guile-automate-checkout/.guix-channel' -> `./.guix-channel'
`/gnu/store/4lqdcg2p32rl1g0mabzhfag7s3bbx5c9-guile-automate-checkout/automate/pumphouse.scm' -> `./automate/pumphouse.scm'
`/gnu/store/4lqdcg2p32rl1g0mabzhfag7s3bbx5c9-guile-automate-checkout/automate/source.scm' -> `./automate/source.scm'
`/gnu/store/4lqdcg2p32rl1g0mabzhfag7s3bbx5c9-guile-automate-checkout/automate/config.scm' -> `./automate/config.scm'
`/gnu/store/4lqdcg2p32rl1g0mabzhfag7s3bbx5c9-guile-automate-checkout/automate/resources.scm' -> `./automate/resources.scm'
`/gnu/store/4lqdcg2p32rl1g0mabzhfag7s3bbx5c9-guile-automate-checkout/automate/model.scm' -> `./automate/model.scm'
`/gnu/store/4lqdcg2p32rl1g0mabzhfag7s3bbx5c9-guile-automate-checkout/automate/structure.scm' -> `./automate/structure.scm'
`/gnu/store/4lqdcg2p32rl1g0mabzhfag7s3bbx5c9-guile-automate-checkout/automate/pipeline.scm' -> `./automate/pipeline.scm'
`/gnu/store/4lqdcg2p32rl1g0mabzhfag7s3bbx5c9-guile-automate-checkout/automate/command-line.scm' -> `./automate/command-line.scm'
`/gnu/store/4lqdcg2p32rl1g0mabzhfag7s3bbx5c9-guile-automate-checkout/automate/shepherd/pipeline-shepherd.scm' -> `./automate/shepherd/pipeline-shepherd.scm'
`/gnu/store/4lqdcg2p32rl1g0mabzhfag7s3bbx5c9-guile-automate-checkout/automate/shepherd/bridge.scm' -> `./automate/shepherd/bridge.scm'
`/gnu/store/4lqdcg2p32rl1g0mabzhfag7s3bbx5c9-guile-automate-checkout/automate/shepherd/services.scm' -> `./automate/shepherd/services.scm'
`/gnu/store/4lqdcg2p32rl1g0mabzhfag7s3bbx5c9-guile-automate-checkout/automate/shepherd/herd.scm' -> `./automate/shepherd/herd.scm'
`/gnu/store/4lqdcg2p32rl1g0mabzhfag7s3bbx5c9-guile-automate-checkout/automate/resources/file-output.scm' -> `./automate/resources/file-output.scm'
`/gnu/store/4lqdcg2p32rl1g0mabzhfag7s3bbx5c9-guile-automate-checkout/automate/resources/limiter.scm' -> `./automate/resources/limiter.scm'
`/gnu/store/4lqdcg2p32rl1g0mabzhfag7s3bbx5c9-guile-automate-checkout/automate/resources/guix-daemon.scm' -> `./automate/resources/guix-daemon.scm'
`/gnu/store/4lqdcg2p32rl1g0mabzhfag7s3bbx5c9-guile-automate-checkout/automate/resources/materialise.scm' -> `./automate/resources/materialise.scm'
`/gnu/store/4lqdcg2p32rl1g0mabzhfag7s3bbx5c9-guile-automate-checkout/automate/resources/gate.scm' -> `./automate/resources/gate.scm'
`/gnu/store/4lqdcg2p32rl1g0mabzhfag7s3bbx5c9-guile-automate-checkout/automate/resources/cache.scm' -> `./automate/resources/cache.scm'
`/gnu/store/4lqdcg2p32rl1g0mabzhfag7s3bbx5c9-guile-automate-checkout/automate/resources/shepherd.scm' -> `./automate/resources/shepherd.scm'
`/gnu/store/4lqdcg2p32rl1g0mabzhfag7s3bbx5c9-guile-automate-checkout/automate/utils/files.scm' -> `./automate/utils/files.scm'
`/gnu/store/4lqdcg2p32rl1g0mabzhfag7s3bbx5c9-guile-automate-checkout/automate/utils/sqlite.scm' -> `./automate/utils/sqlite.scm'
`/gnu/store/4lqdcg2p32rl1g0mabzhfag7s3bbx5c9-guile-automate-checkout/automate/utils/sockets.scm' -> `./automate/utils/sockets.scm'
`/gnu/store/4lqdcg2p32rl1g0mabzhfag7s3bbx5c9-guile-automate-checkout/automate/utils/goblins.scm' -> `./automate/utils/goblins.scm'
`/gnu/store/4lqdcg2p32rl1g0mabzhfag7s3bbx5c9-guile-automate-checkout/automate/utils/processes.scm' -> `./automate/utils/processes.scm'
`/gnu/store/4lqdcg2p32rl1g0mabzhfag7s3bbx5c9-guile-automate-checkout/automate/utils/options.scm' -> `./automate/utils/options.scm'
`/gnu/store/4lqdcg2p32rl1g0mabzhfag7s3bbx5c9-guile-automate-checkout/automate/utils/tcp-tls-netlayer.scm' -> `./automate/utils/tcp-tls-netlayer.scm'
`/gnu/store/4lqdcg2p32rl1g0mabzhfag7s3bbx5c9-guile-automate-checkout/automate/pipeline/one-shot.scm' -> `./automate/pipeline/one-shot.scm'
`/gnu/store/4lqdcg2p32rl1g0mabzhfag7s3bbx5c9-guile-automate-checkout/automate/pipeline/repl-client.scm' -> `./automate/pipeline/repl-client.scm'
`/gnu/store/4lqdcg2p32rl1g0mabzhfag7s3bbx5c9-guile-automate-checkout/automate/pipeline/step-scheduling.scm' -> `./automate/pipeline/step-scheduling.scm'
`/gnu/store/4lqdcg2p32rl1g0mabzhfag7s3bbx5c9-guile-automate-checkout/automate/pipeline/uploader.scm' -> `./automate/pipeline/uploader.scm'
`/gnu/store/4lqdcg2p32rl1g0mabzhfag7s3bbx5c9-guile-automate-checkout/automate/pipeline/masking.scm' -> `./automate/pipeline/masking.scm'
`/gnu/store/4lqdcg2p32rl1g0mabzhfag7s3bbx5c9-guile-automate-checkout/automate/pipeline/repl.scm' -> `./automate/pipeline/repl.scm'
`/gnu/store/4lqdcg2p32rl1g0mabzhfag7s3bbx5c9-guile-automate-checkout/automate/pipeline/lower.scm' -> `./automate/pipeline/lower.scm'
`/gnu/store/4lqdcg2p32rl1g0mabzhfag7s3bbx5c9-guile-automate-checkout/automate/pipeline/output-marks.scm' -> `./automate/pipeline/output-marks.scm'
`/gnu/store/4lqdcg2p32rl1g0mabzhfag7s3bbx5c9-guile-automate-checkout/automate/pipeline/step.scm' -> `./automate/pipeline/step.scm'
`/gnu/store/4lqdcg2p32rl1g0mabzhfag7s3bbx5c9-guile-automate-checkout/automate/pipeline/run-request.scm' -> `./automate/pipeline/run-request.scm'
`/gnu/store/4lqdcg2p32rl1g0mabzhfag7s3bbx5c9-guile-automate-checkout/automate/pipeline/confinement.scm' -> `./automate/pipeline/confinement.scm'
`/gnu/store/4lqdcg2p32rl1g0mabzhfag7s3bbx5c9-guile-automate-checkout/automate/pipeline/daemon.scm' -> `./automate/pipeline/daemon.scm'
`/gnu/store/4lqdcg2p32rl1g0mabzhfag7s3bbx5c9-guile-automate-checkout/automate/pipeline/attach.scm' -> `./automate/pipeline/attach.scm'
`/gnu/store/4lqdcg2p32rl1g0mabzhfag7s3bbx5c9-guile-automate-checkout/automate/pipeline/nrepl.scm' -> `./automate/pipeline/nrepl.scm'
`/gnu/store/4lqdcg2p32rl1g0mabzhfag7s3bbx5c9-guile-automate-checkout/automate/pipeline/errors.scm' -> `./automate/pipeline/errors.scm'
`/gnu/store/4lqdcg2p32rl1g0mabzhfag7s3bbx5c9-guile-automate-checkout/automate/pipeline/contain.scm' -> `./automate/pipeline/contain.scm'
`/gnu/store/4lqdcg2p32rl1g0mabzhfag7s3bbx5c9-guile-automate-checkout/automate/helpers/git.scm' -> `./automate/helpers/git.scm'
`/gnu/store/4lqdcg2p32rl1g0mabzhfag7s3bbx5c9-guile-automate-checkout/automate/helpers/notify.scm' -> `./automate/helpers/notify.scm'
`/gnu/store/4lqdcg2p32rl1g0mabzhfag7s3bbx5c9-guile-automate-checkout/automate/helpers/secrets.scm' -> `./automate/helpers/secrets.scm'
`/gnu/store/4lqdcg2p32rl1g0mabzhfag7s3bbx5c9-guile-automate-checkout/automate/helpers/definitions.scm' -> `./automate/helpers/definitions.scm'
`/gnu/store/4lqdcg2p32rl1g0mabzhfag7s3bbx5c9-guile-automate-checkout/automate/helpers/profiles.scm' -> `./automate/helpers/profiles.scm'
`/gnu/store/4lqdcg2p32rl1g0mabzhfag7s3bbx5c9-guile-automate-checkout/automate/helpers/guix.scm' -> `./automate/helpers/guix.scm'
`/gnu/store/4lqdcg2p32rl1g0mabzhfag7s3bbx5c9-guile-automate-checkout/automate/pumphouse/live.scm' -> `./automate/pumphouse/live.scm'
`/gnu/store/4lqdcg2p32rl1g0mabzhfag7s3bbx5c9-guile-automate-checkout/automate/pumphouse/datastore.scm' -> `./automate/pumphouse/datastore.scm'
`/gnu/store/4lqdcg2p32rl1g0mabzhfag7s3bbx5c9-guile-automate-checkout/automate/pumphouse/hub.scm' -> `./automate/pumphouse/hub.scm'
`/gnu/store/4lqdcg2p32rl1g0mabzhfag7s3bbx5c9-guile-automate-checkout/automate/pumphouse/run-query.scm' -> `./automate/pumphouse/run-query.scm'
`/gnu/store/4lqdcg2p32rl1g0mabzhfag7s3bbx5c9-guile-automate-checkout/automate/pumphouse/client.scm' -> `./automate/pumphouse/client.scm'
`/gnu/store/4lqdcg2p32rl1g0mabzhfag7s3bbx5c9-guile-automate-checkout/automate/pumphouse/attachments.scm' -> `./automate/pumphouse/attachments.scm'
`/gnu/store/4lqdcg2p32rl1g0mabzhfag7s3bbx5c9-guile-automate-checkout/automate/pumphouse/schema.scm' -> `./automate/pumphouse/schema.scm'
`/gnu/store/4lqdcg2p32rl1g0mabzhfag7s3bbx5c9-guile-automate-checkout/automate/pumphouse/http.scm' -> `./automate/pumphouse/http.scm'
`/gnu/store/4lqdcg2p32rl1g0mabzhfag7s3bbx5c9-guile-automate-checkout/automate/pumphouse/records.scm' -> `./automate/pumphouse/records.scm'
`/gnu/store/4lqdcg2p32rl1g0mabzhfag7s3bbx5c9-guile-automate-checkout/automate/pumphouse/metrics.scm' -> `./automate/pumphouse/metrics.scm'
`/gnu/store/4lqdcg2p32rl1g0mabzhfag7s3bbx5c9-guile-automate-checkout/automate/pumphouse/process.scm' -> `./automate/pumphouse/process.scm'
`/gnu/store/4lqdcg2p32rl1g0mabzhfag7s3bbx5c9-guile-automate-checkout/automate/pumphouse/scope.scm' -> `./automate/pumphouse/scope.scm'
`/gnu/store/4lqdcg2p32rl1g0mabzhfag7s3bbx5c9-guile-automate-checkout/automate/pumphouse/web/pages.scm' -> `./automate/pumphouse/web/pages.scm'
`/gnu/store/4lqdcg2p32rl1g0mabzhfag7s3bbx5c9-guile-automate-checkout/automate/pumphouse/web/output.scm' -> `./automate/pumphouse/web/output.scm'
`/gnu/store/4lqdcg2p32rl1g0mabzhfag7s3bbx5c9-guile-automate-checkout/automate/pumphouse/web/layout.scm' -> `./automate/pumphouse/web/layout.scm'
`/gnu/store/4lqdcg2p32rl1g0mabzhfag7s3bbx5c9-guile-automate-checkout/automate/pumphouse/web/diagram.scm' -> `./automate/pumphouse/web/diagram.scm'
`/gnu/store/4lqdcg2p32rl1g0mabzhfag7s3bbx5c9-guile-automate-checkout/automate/pumphouse/web/events.scm' -> `./automate/pumphouse/web/events.scm'
`/gnu/store/4lqdcg2p32rl1g0mabzhfag7s3bbx5c9-guile-automate-checkout/automate/pumphouse/web/static/live.js' -> `./automate/pumphouse/web/static/live.js'
`/gnu/store/4lqdcg2p32rl1g0mabzhfag7s3bbx5c9-guile-automate-checkout/automate/pumphouse/web/static/theme.js' -> `./automate/pumphouse/web/static/theme.js'
`/gnu/store/4lqdcg2p32rl1g0mabzhfag7s3bbx5c9-guile-automate-checkout/automate/pumphouse/web/static/logo.svg' -> `./automate/pumphouse/web/static/logo.svg'
`/gnu/store/4lqdcg2p32rl1g0mabzhfag7s3bbx5c9-guile-automate-checkout/automate/pumphouse/web/static/style.css' -> `./automate/pumphouse/web/static/style.css'
`/gnu/store/4lqdcg2p32rl1g0mabzhfag7s3bbx5c9-guile-automate-checkout/automate/forge/forgejo.scm' -> `./automate/forge/forgejo.scm'
`/gnu/store/4lqdcg2p32rl1g0mabzhfag7s3bbx5c9-guile-automate-checkout/automate/forge/webhook.scm' -> `./automate/forge/webhook.scm'
`/gnu/store/4lqdcg2p32rl1g0mabzhfag7s3bbx5c9-guile-automate-checkout/examples/pipeline-shepherd.scm' -> `./examples/pipeline-shepherd.scm'
`/gnu/store/4lqdcg2p32rl1g0mabzhfag7s3bbx5c9-guile-automate-checkout/examples/pumphouse.scm' -> `./examples/pumphouse.scm'
`/gnu/store/4lqdcg2p32rl1g0mabzhfag7s3bbx5c9-guile-automate-checkout/examples/linked.scm' -> `./examples/linked.scm'
`/gnu/store/4lqdcg2p32rl1g0mabzhfag7s3bbx5c9-guile-automate-checkout/examples/pipeline-daemon.scm' -> `./examples/pipeline-daemon.scm'
`/gnu/store/4lqdcg2p32rl1g0mabzhfag7s3bbx5c9-guile-automate-checkout/examples/channels.scm' -> `./examples/channels.scm'
`/gnu/store/4lqdcg2p32rl1g0mabzhfag7s3bbx5c9-guile-automate-checkout/examples/slow.scm' -> `./examples/slow.scm'
`/gnu/store/4lqdcg2p32rl1g0mabzhfag7s3bbx5c9-guile-automate-checkout/examples/hello.scm' -> `./examples/hello.scm'
`/gnu/store/4lqdcg2p32rl1g0mabzhfag7s3bbx5c9-guile-automate-checkout/examples/shepherd-bridge.scm' -> `./examples/shepherd-bridge.scm'
`/gnu/store/4lqdcg2p32rl1g0mabzhfag7s3bbx5c9-guile-automate-checkout/channel/guile-automate/package.scm' -> `./channel/guile-automate/package.scm'
`/gnu/store/4lqdcg2p32rl1g0mabzhfag7s3bbx5c9-guile-automate-checkout/tests/run.scm' -> `./tests/run.scm'
`/gnu/store/4lqdcg2p32rl1g0mabzhfag7s3bbx5c9-guile-automate-checkout/tests/pipeline-shepherd.scm' -> `./tests/pipeline-shepherd.scm'
`/gnu/store/4lqdcg2p32rl1g0mabzhfag7s3bbx5c9-guile-automate-checkout/tests/step-scheduling.scm' -> `./tests/step-scheduling.scm'
`/gnu/store/4lqdcg2p32rl1g0mabzhfag7s3bbx5c9-guile-automate-checkout/tests/pages.scm' -> `./tests/pages.scm'
`/gnu/store/4lqdcg2p32rl1g0mabzhfag7s3bbx5c9-guile-automate-checkout/tests/files.scm' -> `./tests/files.scm'
`/gnu/store/4lqdcg2p32rl1g0mabzhfag7s3bbx5c9-guile-automate-checkout/tests/uploader.scm' -> `./tests/uploader.scm'
`/gnu/store/4lqdcg2p32rl1g0mabzhfag7s3bbx5c9-guile-automate-checkout/tests/masking.scm' -> `./tests/masking.scm'
`/gnu/store/4lqdcg2p32rl1g0mabzhfag7s3bbx5c9-guile-automate-checkout/tests/pumphouse-lost.scm' -> `./tests/pumphouse-lost.scm'
`/gnu/store/4lqdcg2p32rl1g0mabzhfag7s3bbx5c9-guile-automate-checkout/tests/pumphouse.scm' -> `./tests/pumphouse.scm'
`/gnu/store/4lqdcg2p32rl1g0mabzhfag7s3bbx5c9-guile-automate-checkout/tests/repl.scm' -> `./tests/repl.scm'
`/gnu/store/4lqdcg2p32rl1g0mabzhfag7s3bbx5c9-guile-automate-checkout/tests/support.scm' -> `./tests/support.scm'
`/gnu/store/4lqdcg2p32rl1g0mabzhfag7s3bbx5c9-guile-automate-checkout/tests/authority.scm' -> `./tests/authority.scm'
`/gnu/store/4lqdcg2p32rl1g0mabzhfag7s3bbx5c9-guile-automate-checkout/tests/source.scm' -> `./tests/source.scm'
`/gnu/store/4lqdcg2p32rl1g0mabzhfag7s3bbx5c9-guile-automate-checkout/tests/layout.scm' -> `./tests/layout.scm'
`/gnu/store/4lqdcg2p32rl1g0mabzhfag7s3bbx5c9-guile-automate-checkout/tests/pumphouse-timers.scm' -> `./tests/pumphouse-timers.scm'
`/gnu/store/4lqdcg2p32rl1g0mabzhfag7s3bbx5c9-guile-automate-checkout/tests/output-marks.scm' -> `./tests/output-marks.scm'
`/gnu/store/4lqdcg2p32rl1g0mabzhfag7s3bbx5c9-guile-automate-checkout/tests/pumphouse-replay.scm' -> `./tests/pumphouse-replay.scm'
`/gnu/store/4lqdcg2p32rl1g0mabzhfag7s3bbx5c9-guile-automate-checkout/tests/notify.scm' -> `./tests/notify.scm'
`/gnu/store/4lqdcg2p32rl1g0mabzhfag7s3bbx5c9-guile-automate-checkout/tests/pumphouse-shepherd.scm' -> `./tests/pumphouse-shepherd.scm'
`/gnu/store/4lqdcg2p32rl1g0mabzhfag7s3bbx5c9-guile-automate-checkout/tests/run-query.scm' -> `./tests/run-query.scm'
`/gnu/store/4lqdcg2p32rl1g0mabzhfag7s3bbx5c9-guile-automate-checkout/tests/processes.scm' -> `./tests/processes.scm'
`/gnu/store/4lqdcg2p32rl1g0mabzhfag7s3bbx5c9-guile-automate-checkout/tests/http.scm' -> `./tests/http.scm'
`/gnu/store/4lqdcg2p32rl1g0mabzhfag7s3bbx5c9-guile-automate-checkout/tests/model.scm' -> `./tests/model.scm'
`/gnu/store/4lqdcg2p32rl1g0mabzhfag7s3bbx5c9-guile-automate-checkout/tests/records.scm' -> `./tests/records.scm'
`/gnu/store/4lqdcg2p32rl1g0mabzhfag7s3bbx5c9-guile-automate-checkout/tests/metrics.scm' -> `./tests/metrics.scm'
`/gnu/store/4lqdcg2p32rl1g0mabzhfag7s3bbx5c9-guile-automate-checkout/tests/forgejo.scm' -> `./tests/forgejo.scm'
`/gnu/store/4lqdcg2p32rl1g0mabzhfag7s3bbx5c9-guile-automate-checkout/tests/dispatch.scm' -> `./tests/dispatch.scm'
`/gnu/store/4lqdcg2p32rl1g0mabzhfag7s3bbx5c9-guile-automate-checkout/tests/attach.scm' -> `./tests/attach.scm'
`/gnu/store/4lqdcg2p32rl1g0mabzhfag7s3bbx5c9-guile-automate-checkout/tests/pipeline.scm' -> `./tests/pipeline.scm'
`/gnu/store/4lqdcg2p32rl1g0mabzhfag7s3bbx5c9-guile-automate-checkout/tests/scope.scm' -> `./tests/scope.scm'
`/gnu/store/4lqdcg2p32rl1g0mabzhfag7s3bbx5c9-guile-automate-checkout/tests/pumphouse-draining.scm' -> `./tests/pumphouse-draining.scm'
`/gnu/store/4lqdcg2p32rl1g0mabzhfag7s3bbx5c9-guile-automate-checkout/tests/pumphouse-restart.scm' -> `./tests/pumphouse-restart.scm'
`/gnu/store/4lqdcg2p32rl1g0mabzhfag7s3bbx5c9-guile-automate-checkout/tests/check.scm' -> `./tests/check.scm'
`/gnu/store/4lqdcg2p32rl1g0mabzhfag7s3bbx5c9-guile-automate-checkout/tests/relay.scm' -> `./tests/relay.scm'
`/gnu/store/4lqdcg2p32rl1g0mabzhfag7s3bbx5c9-guile-automate-checkout/tests/shepherd-bridge.scm' -> `./tests/shepherd-bridge.scm'
`/gnu/store/4lqdcg2p32rl1g0mabzhfag7s3bbx5c9-guile-automate-checkout/tests/errors.scm' -> `./tests/errors.scm'
`/gnu/store/4lqdcg2p32rl1g0mabzhfag7s3bbx5c9-guile-automate-checkout/tests/events.scm' -> `./tests/events.scm'
`/gnu/store/4lqdcg2p32rl1g0mabzhfag7s3bbx5c9-guile-automate-checkout/tests/pumphouse-stopping.scm' -> `./tests/pumphouse-stopping.scm'
`/gnu/store/4lqdcg2p32rl1g0mabzhfag7s3bbx5c9-guile-automate-checkout/tests/reconnect.scm' -> `./tests/reconnect.scm'
`/gnu/store/4lqdcg2p32rl1g0mabzhfag7s3bbx5c9-guile-automate-checkout/tests/contain.scm' -> `./tests/contain.scm'
`/gnu/store/4lqdcg2p32rl1g0mabzhfag7s3bbx5c9-guile-automate-checkout/tests/integration/lowering.scm' -> `./tests/integration/lowering.scm'
`/gnu/store/4lqdcg2p32rl1g0mabzhfag7s3bbx5c9-guile-automate-checkout/tests/steps/step.scm' -> `./tests/steps/step.scm'
`/gnu/store/4lqdcg2p32rl1g0mabzhfag7s3bbx5c9-guile-automate-checkout/tests/steps/contain.scm' -> `./tests/steps/contain.scm'
`/gnu/store/4lqdcg2p32rl1g0mabzhfag7s3bbx5c9-guile-automate-checkout/tests/pumphouse/support.scm' -> `./tests/pumphouse/support.scm'
phase `unpack' succeeded after 0.0 seconds
sh: warning: setlocale: LC_ALL: cannot change locale (C.UTF-8): No such file or directory
starting phase `patch-usr-bin-file'
phase `patch-usr-bin-file' succeeded after 0.0 seconds
sh: warning: setlocale: LC_ALL: cannot change locale (C.UTF-8): No such file or directory
starting phase `patch-source-shebangs'
phase `patch-source-shebangs' succeeded after 0.0 seconds
sh: warning: setlocale: LC_ALL: cannot change locale (C.UTF-8): No such file or directory
starting phase `patch-generated-file-shebangs'
phase `patch-generated-file-shebangs' succeeded after 0.0 seconds
sh: warning: setlocale: LC_ALL: cannot change locale (C.UTF-8): No such file or directory
starting phase `build'
Compiling with Guile 3.0...
compile flags: ("-Wunbound-variable" "-Warity-mismatch" "-Wformat")
wrote `/gnu/store/pr1sl2xihnxgb895i83p8rzw520xnmza-guile-automate-0.0.0-dev/lib/guile/3.0/site-ccache/./automate/command-line.go'
[ 1/67] Compiling...
wrote `/gnu/store/pr1sl2xihnxgb895i83p8rzw520xnmza-guile-automate-0.0.0-dev/lib/guile/3.0/site-ccache/./automate/config.go'
[ 2/67] Compiling...
wrote `/gnu/store/pr1sl2xihnxgb895i83p8rzw520xnmza-guile-automate-0.0.0-dev/lib/guile/3.0/site-ccache/./automate/forge/forgejo.go'
[ 3/67] Compiling...
wrote `/gnu/store/pr1sl2xihnxgb895i83p8rzw520xnmza-guile-automate-0.0.0-dev/lib/guile/3.0/site-ccache/./automate/forge/webhook.go'
[ 4/67] Compiling...
wrote `/gnu/store/pr1sl2xihnxgb895i83p8rzw520xnmza-guile-automate-0.0.0-dev/lib/guile/3.0/site-ccache/./automate/helpers/definitions.go'
[ 5/67] Compiling...
wrote `/gnu/store/pr1sl2xihnxgb895i83p8rzw520xnmza-guile-automate-0.0.0-dev/lib/guile/3.0/site-ccache/./automate/helpers/git.go'
[ 6/67] Compiling...
wrote `/gnu/store/pr1sl2xihnxgb895i83p8rzw520xnmza-guile-automate-0.0.0-dev/lib/guile/3.0/site-ccache/./automate/helpers/guix.go'
[ 7/67] Compiling...
wrote `/gnu/store/pr1sl2xihnxgb895i83p8rzw520xnmza-guile-automate-0.0.0-dev/lib/guile/3.0/site-ccache/./automate/helpers/notify.go'
[ 8/67] Compiling...
wrote `/gnu/store/pr1sl2xihnxgb895i83p8rzw520xnmza-guile-automate-0.0.0-dev/lib/guile/3.0/site-ccache/./automate/helpers/profiles.go'
[ 9/67] Compiling...
wrote `/gnu/store/pr1sl2xihnxgb895i83p8rzw520xnmza-guile-automate-0.0.0-dev/lib/guile/3.0/site-ccache/./automate/helpers/secrets.go'
[10/67] Compiling...
wrote `/gnu/store/pr1sl2xihnxgb895i83p8rzw520xnmza-guile-automate-0.0.0-dev/lib/guile/3.0/site-ccache/./automate/model.go'
[11/67] Compiling...
wrote `/gnu/store/pr1sl2xihnxgb895i83p8rzw520xnmza-guile-automate-0.0.0-dev/lib/guile/3.0/site-ccache/./automate/pipeline.go'
[12/67] Compiling...
wrote `/gnu/store/pr1sl2xihnxgb895i83p8rzw520xnmza-guile-automate-0.0.0-dev/lib/guile/3.0/site-ccache/./automate/pipeline/attach.go'
[13/67] Compiling...
wrote `/gnu/store/pr1sl2xihnxgb895i83p8rzw520xnmza-guile-automate-0.0.0-dev/lib/guile/3.0/site-ccache/./automate/pipeline/confinement.go'
[14/67] Compiling...
wrote `/gnu/store/pr1sl2xihnxgb895i83p8rzw520xnmza-guile-automate-0.0.0-dev/lib/guile/3.0/site-ccache/./automate/pipeline/contain.go'
[15/67] Compiling...
wrote `/gnu/store/pr1sl2xihnxgb895i83p8rzw520xnmza-guile-automate-0.0.0-dev/lib/guile/3.0/site-ccache/./automate/pipeline/daemon.go'
[16/67] Compiling...
wrote `/gnu/store/pr1sl2xihnxgb895i83p8rzw520xnmza-guile-automate-0.0.0-dev/lib/guile/3.0/site-ccache/./automate/pipeline/errors.go'
[17/67] Compiling...
wrote `/gnu/store/pr1sl2xihnxgb895i83p8rzw520xnmza-guile-automate-0.0.0-dev/lib/guile/3.0/site-ccache/./automate/pipeline/masking.go'
[18/67] Compiling...
wrote `/gnu/store/pr1sl2xihnxgb895i83p8rzw520xnmza-guile-automate-0.0.0-dev/lib/guile/3.0/site-ccache/./automate/pipeline/nrepl.go'
[19/67] Compiling...
wrote `/gnu/store/pr1sl2xihnxgb895i83p8rzw520xnmza-guile-automate-0.0.0-dev/lib/guile/3.0/site-ccache/./automate/pipeline/one-shot.go'
[20/67] Compiling...
wrote `/gnu/store/pr1sl2xihnxgb895i83p8rzw520xnmza-guile-automate-0.0.0-dev/lib/guile/3.0/site-ccache/./automate/pipeline/output-marks.go'
[21/67] Compiling...
wrote `/gnu/store/pr1sl2xihnxgb895i83p8rzw520xnmza-guile-automate-0.0.0-dev/lib/guile/3.0/site-ccache/./automate/pipeline/repl-client.go'
[22/67] Compiling...
wrote `/gnu/store/pr1sl2xihnxgb895i83p8rzw520xnmza-guile-automate-0.0.0-dev/lib/guile/3.0/site-ccache/./automate/pipeline/repl.go'
[23/67] Compiling...
wrote `/gnu/store/pr1sl2xihnxgb895i83p8rzw520xnmza-guile-automate-0.0.0-dev/lib/guile/3.0/site-ccache/./automate/pipeline/run-request.go'
[24/67] Compiling...
wrote `/gnu/store/pr1sl2xihnxgb895i83p8rzw520xnmza-guile-automate-0.0.0-dev/lib/guile/3.0/site-ccache/./automate/pipeline/step-scheduling.go'
[25/67] Compiling...
wrote `/gnu/store/pr1sl2xihnxgb895i83p8rzw520xnmza-guile-automate-0.0.0-dev/lib/guile/3.0/site-ccache/./automate/pipeline/step.go'
[26/67] Compiling...
wrote `/gnu/store/pr1sl2xihnxgb895i83p8rzw520xnmza-guile-automate-0.0.0-dev/lib/guile/3.0/site-ccache/./automate/pipeline/uploader.go'
[27/67] Compiling...
wrote `/gnu/store/pr1sl2xihnxgb895i83p8rzw520xnmza-guile-automate-0.0.0-dev/lib/guile/3.0/site-ccache/./automate/pumphouse.go'
[28/67] Compiling...
wrote `/gnu/store/pr1sl2xihnxgb895i83p8rzw520xnmza-guile-automate-0.0.0-dev/lib/guile/3.0/site-ccache/./automate/pumphouse/attachments.go'
[29/67] Compiling...
wrote `/gnu/store/pr1sl2xihnxgb895i83p8rzw520xnmza-guile-automate-0.0.0-dev/lib/guile/3.0/site-ccache/./automate/pumphouse/client.go'
[30/67] Compiling...
wrote `/gnu/store/pr1sl2xihnxgb895i83p8rzw520xnmza-guile-automate-0.0.0-dev/lib/guile/3.0/site-ccache/./automate/pumphouse/datastore.go'
[31/67] Compiling...
automate/pumphouse/http.scm:236:36: warning: "no answer from ~a in ~a ~\\nseconds": unsupported format option ~
, use (ice-9 format) instead
wrote `/gnu/store/pr1sl2xihnxgb895i83p8rzw520xnmza-guile-automate-0.0.0-dev/lib/guile/3.0/site-ccache/./automate/pumphouse/http.go'
[32/67] Compiling...
wrote `/gnu/store/pr1sl2xihnxgb895i83p8rzw520xnmza-guile-automate-0.0.0-dev/lib/guile/3.0/site-ccache/./automate/pumphouse/hub.go'
[33/67] Compiling...
wrote `/gnu/store/pr1sl2xihnxgb895i83p8rzw520xnmza-guile-automate-0.0.0-dev/lib/guile/3.0/site-ccache/./automate/pumphouse/live.go'
[34/67] Compiling...
wrote `/gnu/store/pr1sl2xihnxgb895i83p8rzw520xnmza-guile-automate-0.0.0-dev/lib/guile/3.0/site-ccache/./automate/pumphouse/metrics.go'
[35/67] Compiling...
wrote `/gnu/store/pr1sl2xihnxgb895i83p8rzw520xnmza-guile-automate-0.0.0-dev/lib/guile/3.0/site-ccache/./automate/pumphouse/process.go'
[36/67] Compiling...
wrote `/gnu/store/pr1sl2xihnxgb895i83p8rzw520xnmza-guile-automate-0.0.0-dev/lib/guile/3.0/site-ccache/./automate/pumphouse/records.go'
[37/67] Compiling...
wrote `/gnu/store/pr1sl2xihnxgb895i83p8rzw520xnmza-guile-automate-0.0.0-dev/lib/guile/3.0/site-ccache/./automate/pumphouse/run-query.go'
[38/67] Compiling...
wrote `/gnu/store/pr1sl2xihnxgb895i83p8rzw520xnmza-guile-automate-0.0.0-dev/lib/guile/3.0/site-ccache/./automate/pumphouse/schema.go'
[39/67] Compiling...
wrote `/gnu/store/pr1sl2xihnxgb895i83p8rzw520xnmza-guile-automate-0.0.0-dev/lib/guile/3.0/site-ccache/./automate/pumphouse/scope.go'
[40/67] Compiling...
wrote `/gnu/store/pr1sl2xihnxgb895i83p8rzw520xnmza-guile-automate-0.0.0-dev/lib/guile/3.0/site-ccache/./automate/pumphouse/web/diagram.go'
[41/67] Compiling...
wrote `/gnu/store/pr1sl2xihnxgb895i83p8rzw520xnmza-guile-automate-0.0.0-dev/lib/guile/3.0/site-ccache/./automate/pumphouse/web/events.go'
[42/67] Compiling...
wrote `/gnu/store/pr1sl2xihnxgb895i83p8rzw520xnmza-guile-automate-0.0.0-dev/lib/guile/3.0/site-ccache/./automate/pumphouse/web/layout.go'
[43/67] Compiling...
wrote `/gnu/store/pr1sl2xihnxgb895i83p8rzw520xnmza-guile-automate-0.0.0-dev/lib/guile/3.0/site-ccache/./automate/pumphouse/web/output.go'
[44/67] Compiling...
wrote `/gnu/store/pr1sl2xihnxgb895i83p8rzw520xnmza-guile-automate-0.0.0-dev/lib/guile/3.0/site-ccache/./automate/pumphouse/web/pages.go'
[45/67] Compiling...
wrote `/gnu/store/pr1sl2xihnxgb895i83p8rzw520xnmza-guile-automate-0.0.0-dev/lib/guile/3.0/site-ccache/./automate/resources.go'
[46/67] Compiling...
wrote `/gnu/store/pr1sl2xihnxgb895i83p8rzw520xnmza-guile-automate-0.0.0-dev/lib/guile/3.0/site-ccache/./automate/resources/cache.go'
[47/67] Compiling...
wrote `/gnu/store/pr1sl2xihnxgb895i83p8rzw520xnmza-guile-automate-0.0.0-dev/lib/guile/3.0/site-ccache/./automate/resources/file-output.go'
[48/67] Compiling...
wrote `/gnu/store/pr1sl2xihnxgb895i83p8rzw520xnmza-guile-automate-0.0.0-dev/lib/guile/3.0/site-ccache/./automate/resources/gate.go'
[49/67] Compiling...
wrote `/gnu/store/pr1sl2xihnxgb895i83p8rzw520xnmza-guile-automate-0.0.0-dev/lib/guile/3.0/site-ccache/./automate/resources/guix-daemon.go'
[50/67] Compiling...
wrote `/gnu/store/pr1sl2xihnxgb895i83p8rzw520xnmza-guile-automate-0.0.0-dev/lib/guile/3.0/site-ccache/./automate/resources/limiter.go'
[51/67] Compiling...
wrote `/gnu/store/pr1sl2xihnxgb895i83p8rzw520xnmza-guile-automate-0.0.0-dev/lib/guile/3.0/site-ccache/./automate/resources/materialise.go'
[52/67] Compiling...
wrote `/gnu/store/pr1sl2xihnxgb895i83p8rzw520xnmza-guile-automate-0.0.0-dev/lib/guile/3.0/site-ccache/./automate/resources/shepherd.go'
[53/67] Compiling...
wrote `/gnu/store/pr1sl2xihnxgb895i83p8rzw520xnmza-guile-automate-0.0.0-dev/lib/guile/3.0/site-ccache/./automate/shepherd/bridge.go'
[54/67] Compiling...
wrote `/gnu/store/pr1sl2xihnxgb895i83p8rzw520xnmza-guile-automate-0.0.0-dev/lib/guile/3.0/site-ccache/./automate/shepherd/herd.go'
[55/67] Compiling...
wrote `/gnu/store/pr1sl2xihnxgb895i83p8rzw520xnmza-guile-automate-0.0.0-dev/lib/guile/3.0/site-ccache/./automate/shepherd/pipeline-shepherd.go'
[56/67] Compiling...
wrote `/gnu/store/pr1sl2xihnxgb895i83p8rzw520xnmza-guile-automate-0.0.0-dev/lib/guile/3.0/site-ccache/./automate/shepherd/services.go'
[57/67] Compiling...
wrote `/gnu/store/pr1sl2xihnxgb895i83p8rzw520xnmza-guile-automate-0.0.0-dev/lib/guile/3.0/site-ccache/./automate/source.go'
[58/67] Compiling...
wrote `/gnu/store/pr1sl2xihnxgb895i83p8rzw520xnmza-guile-automate-0.0.0-dev/lib/guile/3.0/site-ccache/./automate/structure.go'
[59/67] Compiling...
wrote `/gnu/store/pr1sl2xihnxgb895i83p8rzw520xnmza-guile-automate-0.0.0-dev/lib/guile/3.0/site-ccache/./automate/utils/files.go'
[60/67] Compiling...
wrote `/gnu/store/pr1sl2xihnxgb895i83p8rzw520xnmza-guile-automate-0.0.0-dev/lib/guile/3.0/site-ccache/./automate/utils/goblins.go'
[61/67] Compiling...
wrote `/gnu/store/pr1sl2xihnxgb895i83p8rzw520xnmza-guile-automate-0.0.0-dev/lib/guile/3.0/site-ccache/./automate/utils/options.go'
[62/67] Compiling...
wrote `/gnu/store/pr1sl2xihnxgb895i83p8rzw520xnmza-guile-automate-0.0.0-dev/lib/guile/3.0/site-ccache/./automate/utils/processes.go'
[63/67] Compiling...
wrote `/gnu/store/pr1sl2xihnxgb895i83p8rzw520xnmza-guile-automate-0.0.0-dev/lib/guile/3.0/site-ccache/./automate/utils/sockets.go'
[64/67] Compiling...
wrote `/gnu/store/pr1sl2xihnxgb895i83p8rzw520xnmza-guile-automate-0.0.0-dev/lib/guile/3.0/site-ccache/./automate/utils/sqlite.go'
[65/67] Compiling...
wrote `/gnu/store/pr1sl2xihnxgb895i83p8rzw520xnmza-guile-automate-0.0.0-dev/lib/guile/3.0/site-ccache/./automate/utils/tcp-tls-netlayer.go'
[66/67] Compiling...
wrote `/gnu/store/pr1sl2xihnxgb895i83p8rzw520xnmza-guile-automate-0.0.0-dev/lib/guile/3.0/site-ccache/./channel/guile-automate/package.go'
[67/67] Compiling...
phase `build' succeeded after 119.5 seconds
sh: warning: setlocale: LC_ALL: cannot change locale (C.UTF-8): No such file or directory
starting phase `remove-non-modules'
phase `remove-non-modules' succeeded after 0.0 seconds
sh: warning: setlocale: LC_ALL: cannot change locale (C.UTF-8): No such file or directory
starting phase `install-static-files'
`automate/pumphouse/web/static/live.js' -> `/gnu/store/pr1sl2xihnxgb895i83p8rzw520xnmza-guile-automate-0.0.0-dev/share/guile/site/3.0/automate/pumphouse/web/static/live.js'
`automate/pumphouse/web/static/theme.js' -> `/gnu/store/pr1sl2xihnxgb895i83p8rzw520xnmza-guile-automate-0.0.0-dev/share/guile/site/3.0/automate/pumphouse/web/static/theme.js'
`automate/pumphouse/web/static/logo.svg' -> `/gnu/store/pr1sl2xihnxgb895i83p8rzw520xnmza-guile-automate-0.0.0-dev/share/guile/site/3.0/automate/pumphouse/web/static/logo.svg'
`automate/pumphouse/web/static/style.css' -> `/gnu/store/pr1sl2xihnxgb895i83p8rzw520xnmza-guile-automate-0.0.0-dev/share/guile/site/3.0/automate/pumphouse/web/static/style.css'
phase `install-static-files' succeeded after 0.0 seconds
sh: warning: setlocale: LC_ALL: cannot change locale (C.UTF-8): No such file or directory
starting phase `check'
== attach.scm
stopped at the start of this step
resumed
error: boom 1 two
  irritants: "boom" 1 two
backtrace:
  automate/pipeline/step.scm:676:62 (_)
  ice-9/boot-9.scm:2058:7 (error)
stopped at the end of this step
resumed
stopped at the end of this step
resumed
stopped at the start of this step
resumed
;;; note: auto-compilation is enabled, set GUILE_AUTO_COMPILE=0
;;;       or pass the --no-auto-compile argument to disable.
;;; compiling /tmp/guix-build-guile-automate-0.0.0-dev.drv-0/source/tests/run.scm
;;; compiling ./tests/support.scm
;;; compiled /tmp/guix-build-guile-automate-0.0.0-dev.drv-0/source/.cache/guile/ccache/3.0-LE-8-4.7/tmp/guix-build-guile-automate-0.0.0-dev.drv-0/source/tests/support.scm.go
;;; compiled /tmp/guix-build-guile-automate-0.0.0-dev.drv-0/source/.cache/guile/ccache/3.0-LE-8-4.7/tmp/guix-build-guile-automate-0.0.0-dev.drv-0/source/tests/run.scm.go
;;; compiling /tmp/guix-build-guile-automate-0.0.0-dev.drv-0/source/tests/attach.scm
;;; compiled /tmp/guix-build-guile-automate-0.0.0-dev.drv-0/source/.cache/guile/ccache/3.0-LE-8-4.7/tmp/guix-build-guile-automate-0.0.0-dev.drv-0/source/tests/attach.scm.go
Error in IO handling wrapped resource #<input-output: file 106>:
#<&compound-exception components: (#<&external-error> #<&origin origin: "fport_read"> #<&message message: "~A"> #<&irritants irritants: ("Connection reset by peer")> #<&exception-with-kind-and-args kind: system-error args: ("fport_read" "~A" ("Connection reset by peer") (104))>)>
warning: mutating the process environment while multiple threads are running;
         further behavior unspecified.
In ice-9/boot-9.scm:
  1778:15 19 (with-exception-handler #<procedure 7ffff5785f30 at ice-9/boot-9.scm:1882:7 (exn)> _ #:unwind? _ #:unwind-for-type _)
In fibers.scm:
   164:13 18 (run-fibers _ #:hz _ #:scheduler _ #:parallelism _ #:cpus _ #:install-suspendable-ports? _ #:drain? _)
     85:4 17 (%run-fibers _ _ _ _)
In fibers/interrupts.scm:
     98:4 16 (with-interrupts/thread-cputime _ _ _ _)
In fibers/scheduler.scm:
   380:26 15 (run-scheduler #<scheduler 7ffff39b5ee0 (remote-peers: (7ffff39b5e70))> _)
In ice-9/boot-9.scm:
  1778:15 14 (with-exception-handler #<procedure 7ffff41bdc00 at ice-9/boot-9.scm:1882:7 (exn)> _ #:unwind? _ #:unwind-for-type _)
  1784:12 13 (with-exception-handler _ _ #:unwind? _ #:unwind-for-type _)
In fibers/scheduler.scm:
   344:10 12 (next-task)
In fibers.scm:
    179:8 11 (_)
In goblins/actor-lib/io.scm:
    60:10 10 (_)
    85:15  9 (_ _)
In ice-9/boot-9.scm:
  1784:12  8 (with-exception-handler _ _ #:unwind? _ #:unwind-for-type _)
In goblins/actor-lib/io.scm:
    70:18  7 (run-and-send)
In ice-9/control.scm:
    91:24  6 (call-with-escape-continuation _)
In goblins/contrib/syrup.scm:
    306:7  5 (read-next)
In ice-9/suspendable-ports.scm:
    558:2  4 (peek-char _)
   184:27  3 (fill-input #<input-output: file 106> _ _)
     72:4  2 (read-bytes #<input-output: file 106> #vu8(60 49 48 39 111 112 58 100 101 108 105 118 101 114 60 49 49 39 100 101 115 99 58 101 120 112 111 114 116 50 43 62 91 54 39 97 116 116 97 99 104 60 49 56 39 100 101 115 99 58 105 109 112 111 114 116 45 111 98 106 101 99 116 51 43 62 93 50 43 60 49 56 39 100 101 115 99 58 105 109 112 111 114 116 45 111 98 106 101 99 116 52 43 62 62 164 164 216 146 196 211 81 215 57 171 60 177 197 45 246 196 208 50 236 14 2 80 9 93 93 93 60 49 48 39 111 …) …)
In unknown file:
           1 (port-read #<input-output: file 106> #vu8(60 49 48 39 111 112 58 100 101 108 105 118 101 114 60 49 49 39 100 101 115 99 58 101 120 112 111 114 116 50 43 62 91 54 39 97 116 116 97 99 104 60 49 56 39 100 101 115 99 58 105 109 112 111 114 116 45 111 98 106 101 99 116 51 43 62 93 50 43 60 49 56 39 100 101 115 99 58 105 109 112 111 114 116 45 111 98 106 101 99 116 52 43 62 62 164 164 216 146 196 211 81 215 57 171 60 177 197 45 246 196 208 50 236 14 2 80 9 93 93 93 60 49 48 39 111 # …) …)
In ice-9/boot-9.scm:
  1705:22  0 (raise-exception _ #:continuable? _)

Uncaught exception in task:
In fibers.scm:
    179:8 15 (_)
In goblins/actor-lib/io.scm:
    60:10 14 (_)
    85:15 13 (_ _)
In ice-9/boot-9.scm:
  1784:12 12 (with-exception-handler _ _ #:unwind? _ #:unwind-for-type _)
In goblins/actor-lib/io.scm:
    70:18 11 (run-and-send)
In ice-9/control.scm:
    91:24 10 (call-with-escape-continuation _)
In goblins/contrib/syrup.scm:
    306:7  9 (read-next)
In ice-9/suspendable-ports.scm:
    558:2  8 (peek-char _)
   184:27  7 (fill-input #<input-output: file 106> _ _)
     72:4  6 (read-bytes #<input-output: file 106> #vu8(60 49 48 39 111 112 58 100 101 108 105 118 101 114 60 49 49 39 100 101 115 99 58 101 120 112 111 114 116 50 43 62 91 54 39 97 116 116 97 99 104 60 49 56 39 100 101 115 99 58 105 109 112 111 114 116 45 111 98 106 101 99 116 51 43 62 93 50 43 60 49 56 39 100 101 115 99 58 105 109 112 111 114 116 45 111 98 106 101 99 116 52 43 62 62 164 164 216 146 196 211 81 215 57 171 60 177 197 45 246 196 208 50 236 14 2 80 9 93 93 93 60 49 48 39 111 …) …)
In unknown file:
           5 (port-read #<input-output: file 106> #vu8(60 49 48 39 111 112 58 100 101 108 105 118 101 114 60 49 49 39 100 101 115 99 58 101 120 112 111 114 116 50 43 62 91 54 39 97 116 116 97 99 104 60 49 56 39 100 101 115 99 58 105 109 112 111 114 116 45 111 98 106 101 99 116 51 43 62 93 50 43 60 49 56 39 100 101 115 99 58 105 109 112 111 114 116 45 111 98 106 101 99 116 52 43 62 62 164 164 216 146 196 211 81 215 57 171 60 177 197 45 246 196 208 50 236 14 2 80 9 93 93 93 60 49 48 39 111 # …) …)
In ice-9/boot-9.scm:
  1705:22  4 (raise-exception _ #:continuable? _)
In goblins/core.scm:
   1987:7  3 (<-np-extern _ . _)
In fibers/operations.scm:
   200:10  2 (perform-operation _)
In fibers/scheduler.scm:
    461:6  1 (suspend-current-task _)
In ice-9/boot-9.scm:
  1705:22  0 (raise-exception _ #:continuable? _)
ice-9/boot-9.scm:1705:22: In procedure raise-exception:
Attempt to suspend fiber within continuation barrier
;;; compiling /tmp/guix-build-guile-automate-0.0.0-dev.drv-0/source/tests/authority.scm
;;; compiled /tmp/guix-build-guile-automate-0.0.0-dev.drv-0/source/.cache/guile/ccache/3.0-LE-8-4.7/tmp/guix-build-guile-automate-0.0.0-dev.drv-0/source/tests/authority.scm.go

Goblins exception:
In message to #<local-object ^session>:
  (trigger other/elsewhere "run-1" (run-request (id . "1255d18e1423d0b3") (parameters) (cause . #f) (ancestors)))
ice-9/boot-9.scm:1705:22: In procedure raise-exception:
ERROR:
  1. &automate-error:
      kind: not-permitted
      irritants: (caller other/elsewhere)
  2. &message: "this pipeline does not declare that it runs that one"
  3. &irritants: (caller other/elsewhere)
In goblins/core.scm:
   1074:7  3 (syscaller-$ _ #<local-object ^session> (trigger other/elsewhere "run-1" (run-request (id . "1255d18e1423d0b3") (parameters) (cause . #f) (ancestors))))
In automate/pumphouse.scm:
    499:6  2 (trigger other/elsewhere "run-1" (run-request (id . "1255d18e1423d0b3") (parameters) (cause . #f) (ancestors)))
In automate/model.scm:
    119:2  1 (raise-automate-error _ _ . _)
In ice-9/boot-9.scm:
  1705:22  0 (raise-exception _ #:continuable? _)

session caller on here trigger: this pipeline does not declare that it runs that one: caller, other/elsewhere

Goblins exception:
In message to #<local-object ^session>:
  (trigger other/elsewhere "run-1" (run-request (id . "86bda43660dedb44") (parameters) (cause . #f) (ancestors)))
ice-9/boot-9.scm:1705:22: In procedure raise-exception:
ERROR:
  1. &automate-error:
      kind: not-permitted
      irritants: (caller other/elsewhere)
  2. &message: "this pipeline does not declare that it runs that one"
  3. &irritants: (caller other/elsewhere)
In goblins/core.scm:
   1074:7  3 (syscaller-$ _ #<local-object ^session> (trigger other/elsewhere "run-1" (run-request (id . "86bda43660dedb44") (parameters) (cause . #f) (ancestors))))
In automate/pumphouse.scm:
    499:6  2 (trigger other/elsewhere "run-1" (run-request (id . "86bda43660dedb44") (parameters) (cause . #f) (ancestors)))
In automate/model.scm:
    119:2  1 (raise-automate-error _ _ . _)
In ice-9/boot-9.scm:
  1705:22  0 (raise-exception _ #:continuable? _)

session caller on here trigger: this pipeline does not declare that it runs that one: caller, other/elsewhere

Goblins exception:
In message to #<local-object fulfilled-handler>:
  (#t)
ice-9/boot-9.scm:1705:22: In procedure raise-exception:
ERROR:
  1. &automate-error:
      kind: not-attached
      irritants: (other/called #f)
  2. &message: "no pipeline process serving the pipeline's definition is attached"
  3. &irritants: (other/called #f)
In goblins/core.scm:
   1074:7  3 (syscaller-$ _ #<local-object fulfilled-handler> (#t))
  2038:14  2 (_ . _)
In automate/model.scm:
    119:2  1 (raise-automate-error _ _ . _)
In ice-9/boot-9.scm:
  1705:22  0 (raise-exception _ #:continuable? _)

session caller on here trigger: no pipeline process serving the pipeline's definition is attached: other/called, #f

Goblins exception:
In message to #<local-object fulfilled-handler>:
  (#t)
ice-9/boot-9.scm:1705:22: In procedure raise-exception:
ERROR:
  1. &automate-error:
      kind: not-attached
      irritants: (other/fired #f)
  2. &message: "no pipeline process serving the pipeline's definition is attached"
  3. &irritants: (other/fired #f)
In goblins/core.scm:
   1074:7  3 (syscaller-$ _ #<local-object fulfilled-handler> (#t))
  2038:14  2 (_ . _)
In automate/model.scm:
    119:2  1 (raise-automate-error _ _ . _)
In ice-9/boot-9.scm:
  1705:22  0 (raise-exception _ #:continuable? _)

session caller on here trigger: no pipeline process serving the pipeline's definition is attached: other/fired, #f

Goblins exception:
In message to #<local-object ^session>:
  (trigger other/called "run-2" (run-request (id . "9f07a6973c86d5eb") (parameters) (cause . #f) (ancestors)))
ice-9/boot-9.scm:1705:22: In procedure raise-exception:
ERROR:
  1. &automate-error:
      kind: not-permitted
      irritants: (quiet other/called)
  2. &message: "this pipeline does not declare that it runs that one"
  3. &irritants: (quiet other/called)
In goblins/core.scm:
   1074:7  3 (syscaller-$ _ #<local-object ^session> (trigger other/called "run-2" (run-request (id . "9f07a6973c86d5eb") (parameters) (cause . #f) (ancestors))))
In automate/pumphouse.scm:
    499:6  2 (trigger other/called "run-2" (run-request (id . "9f07a6973c86d5eb") (parameters) (cause . #f) (ancestors)))
In automate/model.scm:
    119:2  1 (raise-automate-error _ _ . _)
In ice-9/boot-9.scm:
  1705:22  0 (raise-exception _ #:continuable? _)

session quiet on here trigger: this pipeline does not declare that it runs that one: quiet, other/called

Goblins exception:
In message to #<local-object ^session>:
  (find-runs other/called ())
ice-9/boot-9.scm:1705:22: In procedure raise-exception:
ERROR:
  1. &automate-error:
      kind: not-permitted
      irritants: (reader other/called)
  2. &message: "this pipeline does not declare that it lists the runs of that one"
  3. &irritants: (reader other/called)
In goblins/core.scm:
   1074:7  3 (syscaller-$ _ #<local-object ^session> (find-runs other/called ()))
In automate/pumphouse.scm:
    457:6  2 (find-runs other/called ())
In automate/model.scm:
    119:2  1 (raise-automate-error _ _ . _)
In ice-9/boot-9.scm:
  1705:22  0 (raise-exception _ #:continuable? _)

session reader on here find-runs: this pipeline does not declare that it lists the runs of that one: reader, other/called

Goblins exception:
In message to #<local-object ^session>:
  (abort "controller-1" "controller-1" "enough")
ice-9/boot-9.scm:1705:22: In procedure raise-exception:
ERROR:
  1. &automate-error:
      kind: not-permitted
      irritants: ("controller-1")
  2. &message: "a run may not abort itself"
  3. &irritants: ("controller-1")
In goblins/core.scm:
   1074:7  3 (syscaller-$ _ #<local-object ^session> (abort "controller-1" "controller-1" "enough"))
In automate/pumphouse.scm:
    467:6  2 (abort "controller-1" "controller-1" "enough")
In automate/model.scm:
    119:2  1 (raise-automate-error _ _ . _)
In ice-9/boot-9.scm:
  1705:22  0 (raise-exception _ #:continuable? _)

session controller on here abort: a run may not abort itself: "controller-1"

Goblins exception:
In message to #<local-object fulfilled-handler>:
  (#f)
ice-9/boot-9.scm:1705:22: In procedure raise-exception:
ERROR:
  1. &automate-error:
      kind: not-attached
      irritants: (other/trunk "trunk-1")
  2. &message: "no pipeline process holds the run"
  3. &irritants: (other/trunk "trunk-1")
In goblins/core.scm:
   1074:7  4 (syscaller-$ _ #<local-object fulfilled-handler> (#f))
  2038:14  3 (_ . _)
In automate/pumphouse.scm:
   170:20  2 (_ _)
In automate/model.scm:
    119:2  1 (raise-automate-error _ _ . _)
In ice-9/boot-9.scm:
  1705:22  0 (raise-exception _ #:continuable? _)

session controller on here abort: no pipeline process holds the run: other/trunk, "trunk-1"

Goblins exception:
In message to #<local-object fulfilled-handler>:
  (other/elsewhere)
ice-9/boot-9.scm:1705:22: In procedure raise-exception:
ERROR:
  1. &automate-error:
      kind: not-permitted
      irritants: (controller other/elsewhere)
  2. &message: "this pipeline does not declare that it aborts the runs of that one"
  3. &irritants: (controller other/elsewhere)
In goblins/core.scm:
   1074:7  4 (syscaller-$ _ #<local-object fulfilled-handler> (other/elsewhere))
  2038:14  3 (_ . _)
In automate/pumphouse.scm:
    182:8  2 (_ other/elsewhere)
In automate/model.scm:
    119:2  1 (raise-automate-error _ _ . _)
In ice-9/boot-9.scm:
  1705:22  0 (raise-exception _ #:continuable? _)

session controller on here abort: this pipeline does not declare that it aborts the runs of that one: controller, other/elsewhere

Goblins exception:
In message to #<local-object fulfilled-handler>:
  (#f)
ice-9/boot-9.scm:1705:22: In procedure raise-exception:
ERROR:
  1. &automate-error:
      kind: no-such-run
      irritants: ("nowhere")
  2. &message: "no run of that id"
  3. &irritants: ("nowhere")
In goblins/core.scm:
   1074:7  4 (syscaller-$ _ #<local-object fulfilled-handler> (#f))
  2038:14  3 (_ . _)
In automate/pumphouse.scm:
   181:10  2 (_ #f)
In automate/model.scm:
    119:2  1 (raise-automate-error _ _ . _)
In ice-9/boot-9.scm:
  1705:22  0 (raise-exception _ #:continuable? _)

session controller on here abort: no run of that id: "nowhere"

Goblins exception:
In message to #<local-object ^session>:
  (drain-and-stop stopper "elsewhere" "stopper-1" "upgrade" #t)
ice-9/boot-9.scm:1705:22: In procedure raise-exception:
ERROR:
  1. &automate-error:
      kind: not-attached
      irritants: (stopper "elsewhere")
  2. &message: "no pipeline process of that instance is attached under this name"
  3. &irritants: (stopper "elsewhere")
In goblins/core.scm:
   1074:7  4 (syscaller-$ _ #<local-object ^session> (drain-and-stop stopper "elsewhere" "stopper-1" "upgrade" #t))
In automate/pumphouse.scm:
    486:8  3 (drain-and-stop stopper "elsewhere" "stopper-1" "upgrade" _)
    110:6  2 (drain-processes! #<<pumphouse> records: #<local-object ^authority-records> lives: #<hash-table 7ffff4852c20 7/31> serving: #<hash-table 7ffff4852c00 7/31> owners: #<hash-table 7ffff4852be0 1/31> reporters: #<hash-table 7ffff4852bc0 0/31> shared: #<hash-table 7ffff4852ba0 0/31> gates: #<hash-table 7ffff4852b80 0/31> stopped: #<hash-table 7ffff4852b60 0/31> waiting: #<hash-table 7ffff4852b40 0/31> timers: #<hash-table 7ffff4852b20 0/31> tokens: #<hash-table 7ffff4852b00 0/31> re…> …)
In automate/model.scm:
    119:2  1 (raise-automate-error _ _ . _)
In ice-9/boot-9.scm:
  1705:22  0 (raise-exception _ #:continuable? _)

session stopper on here drain-and-stop: no pipeline process of that instance is attached under this name: stopper, "elsewhere"

Goblins exception:
In message to #<local-object ^session>:
  (drain-and-stop other/trunk #f "stopper-1" "upgrade" #t)
ice-9/boot-9.scm:1705:22: In procedure raise-exception:
ERROR:
  1. &automate-error:
      kind: not-attached
      irritants: (other/trunk #f)
  2. &message: "no pipeline process is attached under this name"
  3. &irritants: (other/trunk #f)
In goblins/core.scm:
   1074:7  4 (syscaller-$ _ #<local-object ^session> (drain-and-stop other/trunk #f "stopper-1" "upgrade" #t))
In automate/pumphouse.scm:
    486:8  3 (drain-and-stop other/trunk #f "stopper-1" "upgrade" _)
    110:6  2 (drain-processes! #<<pumphouse> records: #<local-object ^authority-records> lives: #<hash-table 7ffff4852c20 7/31> serving: #<hash-table 7ffff4852c00 7/31> owners: #<hash-table 7ffff4852be0 1/31> reporters: #<hash-table 7ffff4852bc0 0/31> shared: #<hash-table 7ffff4852ba0 0/31> gates: #<hash-table 7ffff4852b80 0/31> stopped: #<hash-table 7ffff4852b60 0/31> waiting: #<hash-table 7ffff4852b40 0/31> timers: #<hash-table 7ffff4852b20 0/31> tokens: #<hash-table 7ffff4852b00 0/31> re…> …)
In automate/model.scm:
    119:2  1 (raise-automate-error _ _ . _)
In ice-9/boot-9.scm:
  1705:22  0 (raise-exception _ #:continuable? _)

session stopper on here drain-and-stop: no pipeline process is attached under this name: other/trunk, #f

Goblins exception:
In message to #<local-object ^session>:
  (drain-and-stop other/elsewhere #f "stopper-1" "upgrade" #f)
ice-9/boot-9.scm:1705:22: In procedure raise-exception:
ERROR:
  1. &automate-error:
      kind: not-permitted
      irritants: (stopper other/elsewhere)
  2. &message: "this pipeline does not declare that it stops the processes of that one"
  3. &irritants: (stopper other/elsewhere)
In goblins/core.scm:
   1074:7  3 (syscaller-$ _ #<local-object ^session> (drain-and-stop other/elsewhere #f "stopper-1" "upgrade" #f))
In automate/pumphouse.scm:
    482:6  2 (drain-and-stop other/elsewhere #f "stopper-1" "upgrade" #f)
In automate/model.scm:
    119:2  1 (raise-automate-error _ _ . _)
In ice-9/boot-9.scm:
  1705:22  0 (raise-exception _ #:continuable? _)

session stopper on here drain-and-stop: this pipeline does not declare that it stops the processes of that one: stopper, other/elsewhere

Goblins exception:
In message to #<local-object ^session>:
  (drain-and-stop other/elsewhere #f "stopper-1" "upgrade" #t)
ice-9/boot-9.scm:1705:22: In procedure raise-exception:
ERROR:
  1. &automate-error:
      kind: not-permitted
      irritants: (stopper other/elsewhere)
  2. &message: "this pipeline does not declare that it stops the processes of that one"
  3. &irritants: (stopper other/elsewhere)
In goblins/core.scm:
   1074:7  3 (syscaller-$ _ #<local-object ^session> (drain-and-stop other/elsewhere #f "stopper-1" "upgrade" #t))
In automate/pumphouse.scm:
    482:6  2 (drain-and-stop other/elsewhere #f "stopper-1" "upgrade" #t)
In automate/model.scm:
    119:2  1 (raise-automate-error _ _ . _)
In ice-9/boot-9.scm:
  1705:22  0 (raise-exception _ #:continuable? _)

session stopper on here drain-and-stop: this pipeline does not declare that it stops the processes of that one: stopper, other/elsewhere
;;; compiling /tmp/guix-build-guile-automate-0.0.0-dev.drv-0/source/tests/check.scm
;;; compiling ./automate/pipeline/lower.scm
;;; compiled /tmp/guix-build-guile-automate-0.0.0-dev.drv-0/source/.cache/guile/ccache/3.0-LE-8-4.7/tmp/guix-build-guile-automate-0.0.0-dev.drv-0/source/automate/pipeline/lower.scm.go
;;; compiled /tmp/guix-build-guile-automate-0.0.0-dev.drv-0/source/.cache/guile/ccache/3.0-LE-8-4.7/tmp/guix-build-guile-automate-0.0.0-dev.drv-0/source/tests/check.scm.go
;;; compiling /tmp/guix-build-guile-automate-0.0.0-dev.drv-0/source/tests/contain.scm
;;; compiled /tmp/guix-build-guile-automate-0.0.0-dev.drv-0/source/.cache/guile/ccache/3.0-LE-8-4.7/tmp/guix-build-guile-automate-0.0.0-dev.drv-0/source/tests/contain.scm.go
warning: mutating the process environment while multiple threads are running;
         further behavior unspecified.
warning: mutating the process environment while multiple threads are running;
         further behavior unspecified.
warning: mutating the process environment while multiple threads are running;
         further behavior unspecified.
warning: mutating the process environment while multiple threads are running;
         further behavior unspecified.
warning: mutating the process environment while multiple threads are running;
         further behavior unspecified.
warning: mutating the process environment while multiple threads are running;
         further behavior unspecified.
warning: mutating the process environment while multiple threads are running;
         further behavior unspecified.
warning: mutating the process environment while multiple threads are running;
         further behavior unspecified.
warning: mutating the process environment while multiple threads are running;
         further behavior unspecified.
warning: mutating the process environment while multiple threads are running;
         further behavior unspecified.
warning: mutating the process environment while multiple threads are running;
         further behavior unspecified.
warning: mutating the process environment while multiple threads are running;
         further behavior unspecified.
warning: mutating the process environment while multiple threads are running;
         further behavior unspecified.
warning: mutating the process environment while multiple threads are running;
         further behavior unspecified.
;;; compiling /tmp/guix-build-guile-automate-0.0.0-dev.drv-0/source/tests/dispatch.scm
;;; compiled /tmp/guix-build-guile-automate-0.0.0-dev.drv-0/source/.cache/guile/ccache/3.0-LE-8-4.7/tmp/guix-build-guile-automate-0.0.0-dev.drv-0/source/tests/dispatch.scm.go

Goblins exception:
In message to #<local-object broken-handler>:
  ((automate-error busy "this process is stopping" () "" ""))
ice-9/boot-9.scm:1705:22: In procedure raise-exception:
ERROR:
  1. &automate-error:
      kind: busy
      irritants: (tests/stopped)
  2. &message: "every pipeline process serving the pipeline is busy"
  3. &irritants: (tests/stopped)
In goblins/core.scm:
   1074:7  3 (syscaller-$ _ #<local-object broken-handler> ((automate-error busy "this process is stopping" () "" "")))
  2038:14  2 (_ . _)
In automate/model.scm:
    119:2  1 (raise-automate-error _ _ . _)
In ice-9/boot-9.scm:
  1705:22  0 (raise-exception _ #:continuable? _)


Goblins exception:
In message to #<local-object fulfilled-handler>:
  (#t)
ice-9/boot-9.scm:1705:22: In procedure raise-exception:
ERROR:
  1. &automate-error:
      kind: not-attached
      irritants: (tests/nobody #f)
  2. &message: "no pipeline process serving the pipeline's definition is attached"
  3. &irritants: (tests/nobody #f)
In goblins/core.scm:
   1074:7  3 (syscaller-$ _ #<local-object fulfilled-handler> (#t))
  2038:14  2 (_ . _)
In automate/model.scm:
    119:2  1 (raise-automate-error _ _ . _)
In ice-9/boot-9.scm:
  1705:22  0 (raise-exception _ #:continuable? _)

;;; compiling /tmp/guix-build-guile-automate-0.0.0-dev.drv-0/source/tests/errors.scm
;;; compiled /tmp/guix-build-guile-automate-0.0.0-dev.drv-0/source/.cache/guile/ccache/3.0-LE-8-4.7/tmp/guix-build-guile-automate-0.0.0-dev.drv-0/source/tests/errors.scm.go

Goblins exception:
In message to #<local-object>:
  (fail)
ice-9/boot-9.scm:1705:22: In procedure raise-exception:
ERROR:
  1. &automate-error:
      kind: no-timer
      irritants: (fail)
  2. &message: "no timer of this name"
  3. &irritants: (fail)
In goblins/core.scm:
   1074:7  2 (syscaller-$ _ #<local-object> (fail))
In automate/model.scm:
    119:2  1 (raise-automate-error _ _ . _)
In ice-9/boot-9.scm:
  1705:22  0 (raise-exception _ #:continuable? _)

answerer fail: no timer of this name: fail

Goblins exception:
In message to #<local-object>:
  (fail)
ice-9/boot-9.scm:1705:22: In procedure raise-exception:
ERROR:
  1. &automate-error:
      kind: no-timer
      irritants: (fail)
  2. &message: "no timer of this name"
  3. &irritants: (fail)
In goblins/core.scm:
   1074:7  2 (syscaller-$ _ #<local-object> (fail))
In automate/model.scm:
    119:2  1 (raise-automate-error _ _ . _)
In ice-9/boot-9.scm:
  1705:22  0 (raise-exception _ #:continuable? _)

answerer fail: no timer of this name: fail

Goblins exception:
In message to #<local-object>:
  (fail)
ice-9/boot-9.scm:1705:22: In procedure raise-exception:
ERROR:
  1. &automate-error:
      kind: no-timer
      irritants: (fail)
  2. &message: "no timer of this name"
  3. &irritants: (fail)
In execvp of /tmp/guix-build-guile-automate-0.0.0-dev.drv-0/automate-tests-OBbrB1/automate-notify-AxDGmN/missing: No such file or directory
49 passed, 0 failed
== authority.scm
27 passed, 0 failed
== check.scm
27 passed, 0 failed
== contain.scm
27 passed, 0 failed
== dispatch.scm
6 passed, 0 failed
== errors.scm
25 passed, 0 failed
== events.scm
9 passed, 0 failed
== files.scm
8 passed, 0 failed
== forgejo.scm
99 passed, 0 failed
== http.scm
49 passed, 0 failed
== layout.scm
46 passed, 0 failed
== masking.scm
34 passed, 0 failed
== metrics.scm
38 passed, 0 failed
== model.scm
170 passed, 0 failed
== notify.scm
In goblins/core.scm:
   1074:7  2 (syscaller-$ _ #<local-object> (fail))
In automate/model.scm:
    119:2  1 (raise-automate-error _ _ . _)
In ice-9/boot-9.scm:
  1705:22  0 (raise-exception _ #:continuable? _)

;;; compiling /tmp/guix-build-guile-automate-0.0.0-dev.drv-0/source/tests/events.scm
;;; compiling /gnu/store/a7k8b77qmv34vjbw5gkgm160zph4lxlg-guile-webutils-0.1-1.d309d65/share/guile/site/3.0/webutils/cookie.scm
;;; compiling /gnu/store/a7k8b77qmv34vjbw5gkgm160zph4lxlg-guile-webutils-0.1-1.d309d65/share/guile/site/3.0/webutils/date.scm
;;; compiled /tmp/guix-build-guile-automate-0.0.0-dev.drv-0/source/.cache/guile/ccache/3.0-LE-8-4.7/gnu/store/a7k8b77qmv34vjbw5gkgm160zph4lxlg-guile-webutils-0.1-1.d309d65/share/guile/site/3.0/webutils/date.scm.go
;;; compiled /tmp/guix-build-guile-automate-0.0.0-dev.drv-0/source/.cache/guile/ccache/3.0-LE-8-4.7/gnu/store/a7k8b77qmv34vjbw5gkgm160zph4lxlg-guile-webutils-0.1-1.d309d65/share/guile/site/3.0/webutils/cookie.scm.go
;;; compiled /tmp/guix-build-guile-automate-0.0.0-dev.drv-0/source/.cache/guile/ccache/3.0-LE-8-4.7/tmp/guix-build-guile-automate-0.0.0-dev.drv-0/source/tests/events.scm.go
;;; compiling /tmp/guix-build-guile-automate-0.0.0-dev.drv-0/source/tests/files.scm
;;; compiled /tmp/guix-build-guile-automate-0.0.0-dev.drv-0/source/.cache/guile/ccache/3.0-LE-8-4.7/tmp/guix-build-guile-automate-0.0.0-dev.drv-0/source/tests/files.scm.go
;;; compiling /tmp/guix-build-guile-automate-0.0.0-dev.drv-0/source/tests/forgejo.scm
;;; compiled /tmp/guix-build-guile-automate-0.0.0-dev.drv-0/source/.cache/guile/ccache/3.0-LE-8-4.7/tmp/guix-build-guile-automate-0.0.0-dev.drv-0/source/tests/forgejo.scm.go
;;; compiling /tmp/guix-build-guile-automate-0.0.0-dev.drv-0/source/tests/http.scm
;;; compiled /tmp/guix-build-guile-automate-0.0.0-dev.drv-0/source/.cache/guile/ccache/3.0-LE-8-4.7/tmp/guix-build-guile-automate-0.0.0-dev.drv-0/source/tests/http.scm.go
;;; compiling /tmp/guix-build-guile-automate-0.0.0-dev.drv-0/source/tests/layout.scm
;;; compiled /tmp/guix-build-guile-automate-0.0.0-dev.drv-0/source/.cache/guile/ccache/3.0-LE-8-4.7/tmp/guix-build-guile-automate-0.0.0-dev.drv-0/source/tests/layout.scm.go
;;; compiling /tmp/guix-build-guile-automate-0.0.0-dev.drv-0/source/tests/masking.scm
;;; compiled /tmp/guix-build-guile-automate-0.0.0-dev.drv-0/source/.cache/guile/ccache/3.0-LE-8-4.7/tmp/guix-build-guile-automate-0.0.0-dev.drv-0/source/tests/masking.scm.go
;;; compiling /tmp/guix-build-guile-automate-0.0.0-dev.drv-0/source/tests/metrics.scm
;;; compiled /tmp/guix-build-guile-automate-0.0.0-dev.drv-0/source/.cache/guile/ccache/3.0-LE-8-4.7/tmp/guix-build-guile-automate-0.0.0-dev.drv-0/source/tests/metrics.scm.go
;;; compiling /tmp/guix-build-guile-automate-0.0.0-dev.drv-0/source/tests/model.scm
;;; compiled /tmp/guix-build-guile-automate-0.0.0-dev.drv-0/source/.cache/guile/ccache/3.0-LE-8-4.7/tmp/guix-build-guile-automate-0.0.0-dev.drv-0/source/tests/model.scm.go
;;; compiling /tmp/guix-build-guile-automate-0.0.0-dev.drv-0/source/tests/notify.scm
;;; compiled /tmp/guix-build-guile-automate-0.0.0-dev.drv-0/source/.cache/guile/ccache/3.0-LE-8-4.7/tmp/guix-build-guile-automate-0.0.0-dev.drv-0/source/tests/notify.scm.go
2026-10-15 12:21:34 (with-exception-handler) INFO: POST /hook 200 0ms
2026-10-15 12:21:34 (with-exception-handler) INFO: POST /refuse 403 0ms
18 passed, 0 failed
== output-marks.scm
;;; compiling /tmp/guix-build-guile-automate-0.0.0-dev.drv-0/source/tests/output-marks.scm
;;; compiled /tmp/guix-build-guile-automate-0.0.0-dev.drv-0/source/.cache/guile/ccache/3.0-LE-8-4.7/tmp/guix-build-guile-automate-0.0.0-dev.drv-0/source/tests/output-marks.scm.go
20 passed, 0 failed
== pages.scm
;;; compiling /tmp/guix-build-guile-automate-0.0.0-dev.drv-0/source/tests/pages.scm
;;; compiled /tmp/guix-build-guile-automate-0.0.0-dev.drv-0/source/.cache/guile/ccache/3.0-LE-8-4.7/tmp/guix-build-guile-automate-0.0.0-dev.drv-0/source/tests/pages.scm.go
130 passed, 0 failed
== pipeline-shepherd.scm
;;; compiling /tmp/guix-build-guile-automate-0.0.0-dev.drv-0/source/tests/pipeline-shepherd.scm
;;; compiled /tmp/guix-build-guile-automate-0.0.0-dev.drv-0/source/.cache/guile/ccache/3.0-LE-8-4.7/tmp/guix-build-guile-automate-0.0.0-dev.drv-0/source/tests/pipeline-shepherd.scm.go
GNU Shepherd 1.0.9 (Guile 3.0.9, Fibers 1.4.3, x86_64-unknown-linux-gnu)
Starting service root...
Service root started.
Service root running with value #<<process> id: 648 command: #f>.
Service root has been started.
Configuration successfully loaded from '/tmp/guix-build-guile-automate-0.0.0-dev.drv-0/automate-tests-OBbrB1/automate-ps-vsHhop/ps/shepherd.scm'.
Starting service shepherd-bridge...
Service shepherd-bridge started.
Service shepherd-bridge running with value #<<process> id: 654 command: ("/gnu/store/k7vkw9x3wl3lni6a0i2w8xz2z8ylrqyz-guile-3.0.11/bin/guile" "-L" "/tmp/guix-build-guile-automate-0.0.0-dev.drv-0/source" "-L" "/gnu/store/r5gafvw9iapq6173liw37bzxj40bslhs-guile-documenta-0.4.0/share/guile/site/3.0" "-L" "/gnu/store/qzml053shmjml5vj6rbcfss5247h20f6-guile-syntax-highlight-0.3.1/share/guile/site/3.0" "-L" "/gnu/store/7a6l3fzjvr3nvbnw579wdkhhszzzh3ql-guix-1.5.0-6.64d4de2/share/guile/site/3.0" "-L" "/gnu/store/zplkplr3qmp5dpvhcxpgqr1lg44wmxyk-guile-goblins-0.18.0/share/guile/site/3.0" "-L" "/gnu/store/5la7a0imnji190xnfmxf0jrsp82dn9hq-guile-fibers-1.4.3/share/guile/site/3.0" "-L" "/gnu/store/z4fnbwa7d6dprqvd7f89wcifq6ggr2wm-guile-gcrypt-0.5.0/share/guile/site/3.0" "-L" "/gnu/store/b9928rpaj24whj9cz36yd1h28w7pwphq-guile-gnutls-5.0.2/share/guile/site/3.0" "-L" "/gnu/store/nw7d5iijwm9sa16k2swxjalgp0vlm01v-guile-json-4.7.3/share/guile/site/3.0" "-L" "/gnu/store/gyf1hm3gzbq00aw3m9x1xickf3zs3pq8-guile-knots-0.1-39.3417d25/share/guile/site/3.0" "-L" "/gnu/store/wsg7chjw2cg6xnp4il5caff5w0w69ikc-guile-sqlite3-0.1.3/share/guile/site/3.0" "-L" "/gnu/store/8n90dzhz177l1lz8bjrxsgbiyh1kmjap-guile-zlib-0.2.2/share/guile/site/3.0" "-L" "/gnu/store/2qm9a3n19pnznv791jvglb4sgh1jda3s-guile-safsaf-0.5-1.8b35410/share/guile/site/3.0" "-L" "/gnu/store/9ia4lplmfhpdxnnkvk0zyhyainyn0r0q-guile-prometheus-0-11.8f70b4b/share/guile/site/3.0" "-L" "/gnu/store/fp4rjwzvrm309wg11jahx8qcm7ypkai3-guile-ares-rs-0.9.8/share/guile/site/3.0" "-L" "/gnu/store/hfx188ymz9y9ialr175lqifn3b6xfdnz-shepherd-1.0.9/share/guile/site/3.0" "-L" "/gnu/store/x9ypa71lzv9jrd5n0qxq51hxnra83z2x-guile-lib-0.2.8.1/share/guile/site/3.0" "-L" "/gnu/store/9rd4c5w765bmsx0cimk0idpfasicvcdr-guile-config-0.5.1/share/guile/site/3.0" "-L" "/gnu/store/lsys62yw1wnmchmvv3q5x7bzkghyasil-guile-zstd-0.1.1/share/guile/site/3.0" "-L" "/gnu/store/gq36qbm22984252qxrzrgvrqzx807kd0-guile-lzlib-0.4.0/share/guile/site/3.0" "-L" "/gnu/store/axcsnac5kji5p4apyf67jqgpbvs47hcm-guile-git-0.12.1/share/guile/site/3.0" "-L" "/gnu/store/3xl1r2ppwspvhrlv4rzdcw3izhnvlkzm-guile-ssh-1.0.0/share/guile/site/3.0" "-L" "/gnu/store/dkzraln87ih1cbl36npg9fgyfqnmpqhh-guile-semver-0.2.0/share/guile/site/3.0" "-L" "/gnu/store/06k0pq8d20w6f3ymkgdwkm6k6rf2v7yj-guile-lib-0.2.8.1/share/guile/site/3.0" "-L" "/gnu/store/gl031z5csmpkyvicv8q4a3wjjgl5gqbi-guile-avahi-0.4.1/share/guile/site/3.0" "-L" "/gnu/store/k1yhnx32pjwr409ag3l25816ylasvzrf-guile-websocket-0.3.0/share/guile/site/3.0" "-L" "/gnu/store/c7k95lcd985bph7kycpjcwsbw0ky0yw1-guile-bstructs-0.2.0/share/guile/site/3.0" "-L" "/gnu/store/a7k8b77qmv34vjbw5gkgm160zph4lxlg-guile-webutils-0.1-1.d309d65/share/guile/site/3.0" "-L" "/gnu/store/cjnz2ikdas5ih7x2gs95fgi9q6f376gk-guile-bytestructures-2.0.2/share/guile/site/3.0" "-L" "/gnu/store/kwd8v8nwvw00d6akyr58d5bjqjcmfy5d-guile-irregex-0.9.12/share/guile/site/3.0" "-L" "/gnu/store/k7vkw9x3wl3lni6a0i2w8xz2z8ylrqyz-guile-3.0.11/share/guile/3.0" "-L" "/gnu/store/k7vkw9x3wl3lni6a0i2w8xz2z8ylrqyz-guile-3.0.11/share/guile/site/3.0" "-L" "/gnu/store/k7vkw9x3wl3lni6a0i2w8xz2z8ylrqyz-guile-3.0.11/share/guile/site" "-L" "/gnu/store/k7vkw9x3wl3lni6a0i2w8xz2z8ylrqyz-guile-3.0.11/share/guile" "-C" "/gnu/store/pr1sl2xihnxgb895i83p8rzw520xnmza-guile-automate-0.0.0-dev/lib/guile/3.0/site-ccache" "-C" "/gnu/store/pr1sl2xihnxgb895i83p8rzw520xnmza-guile-automate-0.0.0-dev/lib/guile/3.0/site-ccache/" "-C" "/gnu/store/r5gafvw9iapq6173liw37bzxj40bslhs-guile-documenta-0.4.0/lib/guile/3.0/site-ccache" "-C" "/gnu/store/r5gafvw9iapq6173liw37bzxj40bslhs-guile-documenta-0.4.0/share/guile/site/3.0" "-C" "/gnu/store/qzml053shmjml5vj6rbcfss5247h20f6-guile-syntax-highlight-0.3.1/lib/guile/3.0/site-ccache" "-C" "/gnu/store/qzml053shmjml5vj6rbcfss5247h20f6-guile-syntax-highlight-0.3.1/share/guile/site/3.0" "-C" "/gnu/store/7a6l3fzjvr3nvbnw579wdkhhszzzh3ql-guix-1.5.0-6.64d4de2/lib/guile/3.0/site-ccache" "-C" "/gnu/store/7a6l3fzjvr3nvbnw579wdkhhszzzh3ql-guix-1.5.0-6.64d4de2/share/guile/site/3.0" "-C" "/gnu/store/zplkplr3qmp5dpvhcxpgqr1lg44wmxyk-guile-goblins-0.18.0/lib/guile/3.0/site-ccache" "-C" "/gnu/store/zplkplr3qmp5dpvhcxpgqr1lg44wmxyk-guile-goblins-0.18.0/share/guile/site/3.0" "-C" "/gnu/store/5la7a0imnji190xnfmxf0jrsp82dn9hq-guile-fibers-1.4.3/lib/guile/3.0/site-ccache" "-C" "/gnu/store/5la7a0imnji190xnfmxf0jrsp82dn9hq-guile-fibers-1.4.3/share/guile/site/3.0" "-C" "/gnu/store/z4fnbwa7d6dprqvd7f89wcifq6ggr2wm-guile-gcrypt-0.5.0/lib/guile/3.0/site-ccache" "-C" "/gnu/store/z4fnbwa7d6dprqvd7f89wcifq6ggr2wm-guile-gcrypt-0.5.0/share/guile/site/3.0" "-C" "/gnu/store/b9928rpaj24whj9cz36yd1h28w7pwphq-guile-gnutls-5.0.2/lib/guile/3.0/site-ccache" "-C" "/gnu/store/b9928rpaj24whj9cz36yd1h28w7pwphq-guile-gnutls-5.0.2/share/guile/site/3.0" "-C" "/gnu/store/nw7d5iijwm9sa16k2swxjalgp0vlm01v-guile-json-4.7.3/lib/guile/3.0/site-ccache" "-C" "/gnu/store/nw7d5iijwm9sa16k2swxjalgp0vlm01v-guile-json-4.7.3/share/guile/site/3.0" "-C" "/gnu/store/gyf1hm3gzbq00aw3m9x1xickf3zs3pq8-guile-knots-0.1-39.3417d25/lib/guile/3.0/site-ccache" "-C" "/gnu/store/gyf1hm3gzbq00aw3m9x1xickf3zs3pq8-guile-knots-0.1-39.3417d25/share/guile/site/3.0" "-C" "/gnu/store/wsg7chjw2cg6xnp4il5caff5w0w69ikc-guile-sqlite3-0.1.3/lib/guile/3.0/site-ccache" "-C" "/gnu/store/wsg7chjw2cg6xnp4il5caff5w0w69ikc-guile-sqlite3-0.1.3/share/guile/site/3.0" "-C" "/gnu/store/8n90dzhz177l1lz8bjrxsgbiyh1kmjap-guile-zlib-0.2.2/lib/guile/3.0/site-ccache" "-C" "/gnu/store/8n90dzhz177l1lz8bjrxsgbiyh1kmjap-guile-zlib-0.2.2/share/guile/site/3.0" "-C" "/gnu/store/2qm9a3n19pnznv791jvglb4sgh1jda3s-guile-safsaf-0.5-1.8b35410/lib/guile/3.0/site-ccache" "-C" "/gnu/store/2qm9a3n19pnznv791jvglb4sgh1jda3s-guile-safsaf-0.5-1.8b35410/share/guile/site/3.0" "-C" "/gnu/store/9ia4lplmfhpdxnnkvk0zyhyainyn0r0q-guile-prometheus-0-11.8f70b4b/lib/guile/3.0/site-ccache" "-C" "/gnu/store/9ia4lplmfhpdxnnkvk0zyhyainyn0r0q-guile-prometheus-0-11.8f70b4b/share/guile/site/3.0" "-C" "/gnu/store/fp4rjwzvrm309wg11jahx8qcm7ypkai3-guile-ares-rs-0.9.8/lib/guile/3.0/site-ccache" "-C" "/gnu/store/fp4rjwzvrm309wg11jahx8qcm7ypkai3-guile-ares-rs-0.9.8/share/guile/site/3.0" "-C" "/gnu/store/hfx188ymz9y9ialr175lqifn3b6xfdnz-shepherd-1.0.9/lib/guile/3.0/site-ccache" "-C" "/gnu/store/hfx188ymz9y9ialr175lqifn3b6xfdnz-shepherd-1.0.9/share/guile/site/3.0" "-C" "/gnu/store/x9ypa71lzv9jrd5n0qxq51hxnra83z2x-guile-lib-0.2.8.1/lib/guile/3.0/site-ccache" "-C" "/gnu/store/x9ypa71lzv9jrd5n0qxq51hxnra83z2x-guile-lib-0.2.8.1/share/guile/site/3.0" "-C" "/gnu/store/9rd4c5w765bmsx0cimk0idpfasicvcdr-guile-config-0.5.1/lib/guile/3.0/site-ccache" "-C" "/gnu/store/9rd4c5w765bmsx0cimk0idpfasicvcdr-guile-config-0.5.1/share/guile/site/3.0" "-C" "/gnu/store/lsys62yw1wnmchmvv3q5x7bzkghyasil-guile-zstd-0.1.1/lib/guile/3.0/site-ccache" "-C" "/gnu/store/lsys62yw1wnmchmvv3q5x7bzkghyasil-guile-zstd-0.1.1/share/guile/site/3.0" "-C" "/gnu/store/gq36qbm22984252qxrzrgvrqzx807kd0-guile-lzlib-0.4.0/lib/guile/3.0/site-ccache" "-C" "/gnu/store/gq36qbm22984252qxrzrgvrqzx807kd0-guile-lzlib-0.4.0/share/guile/site/3.0" "-C" "/gnu/store/axcsnac5kji5p4apyf67jqgpbvs47hcm-guile-git-0.12.1/lib/guile/3.0/site-ccache" "-C" "/gnu/store/axcsnac5kji5p4apyf67jqgpbvs47hcm-guile-git-0.12.1/share/guile/site/3.0" "-C" "/gnu/store/3xl1r2ppwspvhrlv4rzdcw3izhnvlkzm-guile-ssh-1.0.0/lib/guile/3.0/site-ccache" "-C" "/gnu/store/3xl1r2ppwspvhrlv4rzdcw3izhnvlkzm-guile-ssh-1.0.0/share/guile/site/3.0" "-C" "/gnu/store/dkzraln87ih1cbl36npg9fgyfqnmpqhh-guile-semver-0.2.0/lib/guile/3.0/site-ccache" "-C" "/gnu/store/dkzraln87ih1cbl36npg9fgyfqnmpqhh-guile-semver-0.2.0/share/guile/site/3.0" "-C" "/gnu/store/06k0pq8d20w6f3ymkgdwkm6k6rf2v7yj-guile-lib-0.2.8.1/lib/guile/3.0/site-ccache" "-C" "/gnu/store/06k0pq8d20w6f3ymkgdwkm6k6rf2v7yj-guile-lib-0.2.8.1/share/guile/site/3.0" "-C" "/gnu/store/gl031z5csmpkyvicv8q4a3wjjgl5gqbi-guile-avahi-0.4.1/lib/guile/3.0/site-ccache" "-C" "/gnu/store/gl031z5csmpkyvicv8q4a3wjjgl5gqbi-guile-avahi-0.4.1/share/guile/site/3.0" "-C" "/gnu/store/k1yhnx32pjwr409ag3l25816ylasvzrf-guile-websocket-0.3.0/lib/guile/3.0/site-ccache" "-C" "/gnu/store/k1yhnx32pjwr409ag3l25816ylasvzrf-guile-websocket-0.3.0/share/guile/site/3.0" "-C" "/gnu/store/c7k95lcd985bph7kycpjcwsbw0ky0yw1-guile-bstructs-0.2.0/lib/guile/3.0/site-ccache" "-C" "/gnu/store/c7k95lcd985bph7kycpjcwsbw0ky0yw1-guile-bstructs-0.2.0/share/guile/site/3.0" "-C" "/gnu/store/a7k8b77qmv34vjbw5gkgm160zph4lxlg-guile-webutils-0.1-1.d309d65/share/guile/site/3.0" "-C" "/gnu/store/cjnz2ikdas5ih7x2gs95fgi9q6f376gk-guile-bytestructures-2.0.2/lib/guile/3.0/site-ccache" "-C" "/gnu/store/cjnz2ikdas5ih7x2gs95fgi9q6f376gk-guile-bytestructures-2.0.2/share/guile/site/3.0" "-C" "/gnu/store/kwd8v8nwvw00d6akyr58d5bjqjcmfy5d-guile-irregex-0.9.12/lib/guile/3.0/site-ccache" "-C" "/gnu/store/kwd8v8nwvw00d6akyr58d5bjqjcmfy5d-guile-irregex-0.9.12/share/guile/site/3.0" "-C" "/gnu/store/k7vkw9x3wl3lni6a0i2w8xz2z8ylrqyz-guile-3.0.11/lib/guile/3.0/ccache" "-C" "/gnu/store/k7vkw9x3wl3lni6a0i2w8xz2z8ylrqyz-guile-3.0.11/lib/guile/3.0/site-ccache" "/tmp/guix-build-guile-automate-0.0.0-dev.drv-0/automate-tests-OBbrB1/automate-ps-vsHhop/ps/bridge.scm")>.
Service shepherd-bridge has been started.
Successfully started 1 service in the background.
Stopping service root...
Exiting shepherd...
Stopping service shepherd-bridge...
Service shepherd-bridge stopped.
Service shepherd-bridge is now stopped.
Exiting.
GNU Shepherd 1.0.9 (Guile 3.0.9, Fibers 1.4.3, x86_64-unknown-linux-gnu)
Starting service root...
Service root started.
Service root running with value #<<process> id: 668 command: #f>.
Service root has been started.
Configuration successfully loaded from '/tmp/guix-build-guile-automate-0.0.0-dev.drv-0/automate-tests-OBbrB1/automate-ps-vsHhop/ps/shepherd.scm'.
Starting service shepherd-bridge...
Starting service sleeper...
Service shepherd-bridge started.
Service sleeper started.
Service shepherd-bridge running with value #<<process> id: 674 command: ("/gnu/store/k7vkw9x3wl3lni6a0i2w8xz2z8ylrqyz-guile-3.0.11/bin/guile" "-L" "/tmp/guix-build-guile-automate-0.0.0-dev.drv-0/source" "-L" "/gnu/store/r5gafvw9iapq6173liw37bzxj40bslhs-guile-documenta-0.4.0/share/guile/site/3.0" "-L" "/gnu/store/qzml053shmjml5vj6rbcfss5247h20f6-guile-syntax-highlight-0.3.1/share/guile/site/3.0" "-L" "/gnu/store/7a6l3fzjvr3nvbnw579wdkhhszzzh3ql-guix-1.5.0-6.64d4de2/share/guile/site/3.0" "-L" "/gnu/store/zplkplr3qmp5dpvhcxpgqr1lg44wmxyk-guile-goblins-0.18.0/share/guile/site/3.0" "-L" "/gnu/store/5la7a0imnji190xnfmxf0jrsp82dn9hq-guile-fibers-1.4.3/share/guile/site/3.0" "-L" "/gnu/store/z4fnbwa7d6dprqvd7f89wcifq6ggr2wm-guile-gcrypt-0.5.0/share/guile/site/3.0" "-L" "/gnu/store/b9928rpaj24whj9cz36yd1h28w7pwphq-guile-gnutls-5.0.2/share/guile/site/3.0" "-L" "/gnu/store/nw7d5iijwm9sa16k2swxjalgp0vlm01v-guile-json-4.7.3/share/guile/site/3.0" "-L" "/gnu/store/gyf1hm3gzbq00aw3m9x1xickf3zs3pq8-guile-knots-0.1-39.3417d25/share/guile/site/3.0" "-L" "/gnu/store/wsg7chjw2cg6xnp4il5caff5w0w69ikc-guile-sqlite3-0.1.3/share/guile/site/3.0" "-L" "/gnu/store/8n90dzhz177l1lz8bjrxsgbiyh1kmjap-guile-zlib-0.2.2/share/guile/site/3.0" "-L" "/gnu/store/2qm9a3n19pnznv791jvglb4sgh1jda3s-guile-safsaf-0.5-1.8b35410/share/guile/site/3.0" "-L" "/gnu/store/9ia4lplmfhpdxnnkvk0zyhyainyn0r0q-guile-prometheus-0-11.8f70b4b/share/guile/site/3.0" "-L" "/gnu/store/fp4rjwzvrm309wg11jahx8qcm7ypkai3-guile-ares-rs-0.9.8/share/guile/site/3.0" "-L" "/gnu/store/hfx188ymz9y9ialr175lqifn3b6xfdnz-shepherd-1.0.9/share/guile/site/3.0" "-L" "/gnu/store/x9ypa71lzv9jrd5n0qxq51hxnra83z2x-guile-lib-0.2.8.1/share/guile/site/3.0" "-L" "/gnu/store/9rd4c5w765bmsx0cimk0idpfasicvcdr-guile-config-0.5.1/share/guile/site/3.0" "-L" "/gnu/store/lsys62yw1wnmchmvv3q5x7bzkghyasil-guile-zstd-0.1.1/share/guile/site/3.0" "-L" "/gnu/store/gq36qbm22984252qxrzrgvrqzx807kd0-guile-lzlib-0.4.0/share/guile/site/3.0" "-L" "/gnu/store/axcsnac5kji5p4apyf67jqgpbvs47hcm-guile-git-0.12.1/share/guile/site/3.0" "-L" "/gnu/store/3xl1r2ppwspvhrlv4rzdcw3izhnvlkzm-guile-ssh-1.0.0/share/guile/site/3.0" "-L" "/gnu/store/dkzraln87ih1cbl36npg9fgyfqnmpqhh-guile-semver-0.2.0/share/guile/site/3.0" "-L" "/gnu/store/06k0pq8d20w6f3ymkgdwkm6k6rf2v7yj-guile-lib-0.2.8.1/share/guile/site/3.0" "-L" "/gnu/store/gl031z5csmpkyvicv8q4a3wjjgl5gqbi-guile-avahi-0.4.1/share/guile/site/3.0" "-L" "/gnu/store/k1yhnx32pjwr409ag3l25816ylasvzrf-guile-websocket-0.3.0/share/guile/site/3.0" "-L" "/gnu/store/c7k95lcd985bph7kycpjcwsbw0ky0yw1-guile-bstructs-0.2.0/share/guile/site/3.0" "-L" "/gnu/store/a7k8b77qmv34vjbw5gkgm160zph4lxlg-guile-webutils-0.1-1.d309d65/share/guile/site/3.0" "-L" "/gnu/store/cjnz2ikdas5ih7x2gs95fgi9q6f376gk-guile-bytestructures-2.0.2/share/guile/site/3.0" "-L" "/gnu/store/kwd8v8nwvw00d6akyr58d5bjqjcmfy5d-guile-irregex-0.9.12/share/guile/site/3.0" "-L" "/gnu/store/k7vkw9x3wl3lni6a0i2w8xz2z8ylrqyz-guile-3.0.11/share/guile/3.0" "-L" "/gnu/store/k7vkw9x3wl3lni6a0i2w8xz2z8ylrqyz-guile-3.0.11/share/guile/site/3.0" "-L" "/gnu/store/k7vkw9x3wl3lni6a0i2w8xz2z8ylrqyz-guile-3.0.11/share/guile/site" "-L" "/gnu/store/k7vkw9x3wl3lni6a0i2w8xz2z8ylrqyz-guile-3.0.11/share/guile" "-C" "/gnu/store/pr1sl2xihnxgb895i83p8rzw520xnmza-guile-automate-0.0.0-dev/lib/guile/3.0/site-ccache" "-C" "/gnu/store/pr1sl2xihnxgb895i83p8rzw520xnmza-guile-automate-0.0.0-dev/lib/guile/3.0/site-ccache/" "-C" "/gnu/store/r5gafvw9iapq6173liw37bzxj40bslhs-guile-documenta-0.4.0/lib/guile/3.0/site-ccache" "-C" "/gnu/store/r5gafvw9iapq6173liw37bzxj40bslhs-guile-documenta-0.4.0/share/guile/site/3.0" "-C" "/gnu/store/qzml053shmjml5vj6rbcfss5247h20f6-guile-syntax-highlight-0.3.1/lib/guile/3.0/site-ccache" "-C" "/gnu/store/qzml053shmjml5vj6rbcfss5247h20f6-guile-syntax-highlight-0.3.1/share/guile/site/3.0" "-C" "/gnu/store/7a6l3fzjvr3nvbnw579wdkhhszzzh3ql-guix-1.5.0-6.64d4de2/lib/guile/3.0/site-ccache" "-C" "/gnu/store/7a6l3fzjvr3nvbnw579wdkhhszzzh3ql-guix-1.5.0-6.64d4de2/share/guile/site/3.0" "-C" "/gnu/store/zplkplr3qmp5dpvhcxpgqr1lg44wmxyk-guile-goblins-0.18.0/lib/guile/3.0/site-ccache" "-C" "/gnu/store/zplkplr3qmp5dpvhcxpgqr1lg44wmxyk-guile-goblins-0.18.0/share/guile/site/3.0" "-C" "/gnu/store/5la7a0imnji190xnfmxf0jrsp82dn9hq-guile-fibers-1.4.3/lib/guile/3.0/site-ccache" "-C" "/gnu/store/5la7a0imnji190xnfmxf0jrsp82dn9hq-guile-fibers-1.4.3/share/guile/site/3.0" "-C" "/gnu/store/z4fnbwa7d6dprqvd7f89wcifq6ggr2wm-guile-gcrypt-0.5.0/lib/guile/3.0/site-ccache" "-C" "/gnu/store/z4fnbwa7d6dprqvd7f89wcifq6ggr2wm-guile-gcrypt-0.5.0/share/guile/site/3.0" "-C" "/gnu/store/b9928rpaj24whj9cz36yd1h28w7pwphq-guile-gnutls-5.0.2/lib/guile/3.0/site-ccache" "-C" "/gnu/store/b9928rpaj24whj9cz36yd1h28w7pwphq-guile-gnutls-5.0.2/share/guile/site/3.0" "-C" "/gnu/store/nw7d5iijwm9sa16k2swxjalgp0vlm01v-guile-json-4.7.3/lib/guile/3.0/site-ccache" "-C" "/gnu/store/nw7d5iijwm9sa16k2swxjalgp0vlm01v-guile-json-4.7.3/share/guile/site/3.0" "-C" "/gnu/store/gyf1hm3gzbq00aw3m9x1xickf3zs3pq8-guile-knots-0.1-39.3417d25/lib/guile/3.0/site-ccache" "-C" "/gnu/store/gyf1hm3gzbq00aw3m9x1xickf3zs3pq8-guile-knots-0.1-39.3417d25/share/guile/site/3.0" "-C" "/gnu/store/wsg7chjw2cg6xnp4il5caff5w0w69ikc-guile-sqlite3-0.1.3/lib/guile/3.0/site-ccache" "-C" "/gnu/store/wsg7chjw2cg6xnp4il5caff5w0w69ikc-guile-sqlite3-0.1.3/share/guile/site/3.0" "-C" "/gnu/store/8n90dzhz177l1lz8bjrxsgbiyh1kmjap-guile-zlib-0.2.2/lib/guile/3.0/site-ccache" "-C" "/gnu/store/8n90dzhz177l1lz8bjrxsgbiyh1kmjap-guile-zlib-0.2.2/share/guile/site/3.0" "-C" "/gnu/store/2qm9a3n19pnznv791jvglb4sgh1jda3s-guile-safsaf-0.5-1.8b35410/lib/guile/3.0/site-ccache" "-C" "/gnu/store/2qm9a3n19pnznv791jvglb4sgh1jda3s-guile-safsaf-0.5-1.8b35410/share/guile/site/3.0" "-C" "/gnu/store/9ia4lplmfhpdxnnkvk0zyhyainyn0r0q-guile-prometheus-0-11.8f70b4b/lib/guile/3.0/site-ccache" "-C" "/gnu/store/9ia4lplmfhpdxnnkvk0zyhyainyn0r0q-guile-prometheus-0-11.8f70b4b/share/guile/site/3.0" "-C" "/gnu/store/fp4rjwzvrm309wg11jahx8qcm7ypkai3-guile-ares-rs-0.9.8/lib/guile/3.0/site-ccache" "-C" "/gnu/store/fp4rjwzvrm309wg11jahx8qcm7ypkai3-guile-ares-rs-0.9.8/share/guile/site/3.0" "-C" "/gnu/store/hfx188ymz9y9ialr175lqifn3b6xfdnz-shepherd-1.0.9/lib/guile/3.0/site-ccache" "-C" "/gnu/store/hfx188ymz9y9ialr175lqifn3b6xfdnz-shepherd-1.0.9/share/guile/site/3.0" "-C" "/gnu/store/x9ypa71lzv9jrd5n0qxq51hxnra83z2x-guile-lib-0.2.8.1/lib/guile/3.0/site-ccache" "-C" "/gnu/store/x9ypa71lzv9jrd5n0qxq51hxnra83z2x-guile-lib-0.2.8.1/share/guile/site/3.0" "-C" "/gnu/store/9rd4c5w765bmsx0cimk0idpfasicvcdr-guile-config-0.5.1/lib/guile/3.0/site-ccache" "-C" "/gnu/store/9rd4c5w765bmsx0cimk0idpfasicvcdr-guile-config-0.5.1/share/guile/site/3.0" "-C" "/gnu/store/lsys62yw1wnmchmvv3q5x7bzkghyasil-guile-zstd-0.1.1/lib/guile/3.0/site-ccache" "-C" "/gnu/store/lsys62yw1wnmchmvv3q5x7bzkghyasil-guile-zstd-0.1.1/share/guile/site/3.0" "-C" "/gnu/store/gq36qbm22984252qxrzrgvrqzx807kd0-guile-lzlib-0.4.0/lib/guile/3.0/site-ccache" "-C" "/gnu/store/gq36qbm22984252qxrzrgvrqzx807kd0-guile-lzlib-0.4.0/share/guile/site/3.0" "-C" "/gnu/store/axcsnac5kji5p4apyf67jqgpbvs47hcm-guile-git-0.12.1/lib/guile/3.0/site-ccache" "-C" "/gnu/store/axcsnac5kji5p4apyf67jqgpbvs47hcm-guile-git-0.12.1/share/guile/site/3.0" "-C" "/gnu/store/3xl1r2ppwspvhrlv4rzdcw3izhnvlkzm-guile-ssh-1.0.0/lib/guile/3.0/site-ccache" "-C" "/gnu/store/3xl1r2ppwspvhrlv4rzdcw3izhnvlkzm-guile-ssh-1.0.0/share/guile/site/3.0" "-C" "/gnu/store/dkzraln87ih1cbl36npg9fgyfqnmpqhh-guile-semver-0.2.0/lib/guile/3.0/site-ccache" "-C" "/gnu/store/dkzraln87ih1cbl36npg9fgyfqnmpqhh-guile-semver-0.2.0/share/guile/site/3.0" "-C" "/gnu/store/06k0pq8d20w6f3ymkgdwkm6k6rf2v7yj-guile-lib-0.2.8.1/lib/guile/3.0/site-ccache" "-C" "/gnu/store/06k0pq8d20w6f3ymkgdwkm6k6rf2v7yj-guile-lib-0.2.8.1/share/guile/site/3.0" "-C" "/gnu/store/gl031z5csmpkyvicv8q4a3wjjgl5gqbi-guile-avahi-0.4.1/lib/guile/3.0/site-ccache" "-C" "/gnu/store/gl031z5csmpkyvicv8q4a3wjjgl5gqbi-guile-avahi-0.4.1/share/guile/site/3.0" "-C" "/gnu/store/k1yhnx32pjwr409ag3l25816ylasvzrf-guile-websocket-0.3.0/lib/guile/3.0/site-ccache" "-C" "/gnu/store/k1yhnx32pjwr409ag3l25816ylasvzrf-guile-websocket-0.3.0/share/guile/site/3.0" "-C" "/gnu/store/c7k95lcd985bph7kycpjcwsbw0ky0yw1-guile-bstructs-0.2.0/lib/guile/3.0/site-ccache" "-C" "/gnu/store/c7k95lcd985bph7kycpjcwsbw0ky0yw1-guile-bstructs-0.2.0/share/guile/site/3.0" "-C" "/gnu/store/a7k8b77qmv34vjbw5gkgm160zph4lxlg-guile-webutils-0.1-1.d309d65/share/guile/site/3.0" "-C" "/gnu/store/cjnz2ikdas5ih7x2gs95fgi9q6f376gk-guile-bytestructures-2.0.2/lib/guile/3.0/site-ccache" "-C" "/gnu/store/cjnz2ikdas5ih7x2gs95fgi9q6f376gk-guile-bytestructures-2.0.2/share/guile/site/3.0" "-C" "/gnu/store/kwd8v8nwvw00d6akyr58d5bjqjcmfy5d-guile-irregex-0.9.12/lib/guile/3.0/site-ccache" "-C" "/gnu/store/kwd8v8nwvw00d6akyr58d5bjqjcmfy5d-guile-irregex-0.9.12/share/guile/site/3.0" "-C" "/gnu/store/k7vkw9x3wl3lni6a0i2w8xz2z8ylrqyz-guile-3.0.11/lib/guile/3.0/ccache" "-C" "/gnu/store/k7vkw9x3wl3lni6a0i2w8xz2z8ylrqyz-guile-3.0.11/lib/guile/3.0/site-ccache" "/tmp/guix-build-guile-automate-0.0.0-dev.drv-0/automate-tests-OBbrB1/automate-ps-vsHhop/ps/bridge.scm")>.
Service sleeper running with value #<<process> id: 675 command: ("/gnu/store/k7vkw9x3wl3lni6a0i2w8xz2z8ylrqyz-guile-3.0.11/bin/guile" "--no-auto-compile" "/tmp/guix-build-guile-automate-0.0.0-dev.drv-0/automate-tests-OBbrB1/automate-ps-vsHhop/daemon.scm" "/tmp/guix-build-guile-automate-0.0.0-dev.drv-0/automate-tests-OBbrB1/automate-ps-vsHhop/marker" "--pumphouse=/tmp/guix-build-guile-automate-0.0.0-dev.drv-0/automate-tests-OBbrB1/automate-ps-vsHhop/ps/secrets/sleeper/pumphouse" "--secrets=/tmp/guix-build-guile-automate-0.0.0-dev.drv-0/automate-tests-OBbrB1/automate-ps-vsHhop/ps/secrets/sleeper" "--working-directory=/tmp/guix-build-guile-automate-0.0.0-dev.drv-0/automate-tests-OBbrB1/automate-ps-vsHhop/ps/work/sleeper" "--cache-directory=/tmp/guix-build-guile-automate-0.0.0-dev.drv-0/automate-tests-OBbrB1/automate-ps-vsHhop/ps/cache/sleeper")>.
Service shepherd-bridge has been started.
Service sleeper has been started.
Successfully started 2 services in the background.
Stopping service root...
Exiting shepherd...
Stopping service shepherd-bridge...
Service shepherd-bridge stopped.
Service shepherd-bridge is now stopped.
Stopping service sleeper...
Service sleeper stopped.
Service sleeper is now stopped.
Exiting.
21 passed, 0 failed
== pipeline.scm
;;; compiling /tmp/guix-build-guile-automate-0.0.0-dev.drv-0/source/tests/pipeline.scm
;;; compiled /tmp/guix-build-guile-automate-0.0.0-dev.drv-0/source/.cache/guile/ccache/3.0-LE-8-4.7/tmp/guix-build-guile-automate-0.0.0-dev.drv-0/source/tests/pipeline.scm.go
error: boom 1 two
  irritants: "boom" 1 two
backtrace:
  automate/pipeline/step.scm:676:62 (_)
  ice-9/boot-9.scm:2058:7 (error)
error: boom 1 two
  irritants: "boom" 1 two
backtrace:
  automate/pipeline/step.scm:676:62 (_)
  ice-9/boot-9.scm:2058:7 (error)
error: boom 1 two
  irritants: "boom" 1 two
backtrace:
  automate/pipeline/step.scm:676:62 (_)
  ice-9/boot-9.scm:2058:7 (error)
error: body ended without providing outputs
  kind: missing-outputs
  irritants: (count)
backtrace:
  automate/model.scm:119:2 (raise-automate-error)

Goblins exception:
In message to #<local-object ^file-output>:
  (commit publish-nothing)
ice-9/boot-9.scm:1705:22: In procedure raise-exception:
ERROR:
  1. &automate-error:
      kind: nothing-to-commit
      irritants: (site "/tmp/guix-build-guile-automate-0.0.0-dev.drv-0/automate-tests-OBbrB1/automate-output-hLd2xN/.automate-site/staging-x776Dt/site")
  2. &message: "a file output is committed with nothing staged: the body makes the content at the path attach answered"
  3. &irritants: (site "/tmp/guix-build-guile-automate-0.0.0-dev.drv-0/automate-tests-OBbrB1/automate-output-hLd2xN/.automate-site/staging-x776Dt/site")
In goblins/core.scm:
   1074:7  3 (syscaller-$ _ #<local-object ^file-output> (commit publish-nothing))
In automate/resources/file-output.scm:
    173:6  2 (commit publish-nothing)
In automate/model.scm:
    119:2  1 (raise-automate-error _ _ . _)
In ice-9/boot-9.scm:
  1705:22  0 (raise-exception _ #:continuable? _)

error: a file output is committed with nothing staged: the body makes the content at the path attach answered
  kind: nothing-to-commit
  irritants: site "/tmp/guix-build-guile-automate-0.0.0-dev.drv-0/automate-tests-OBbrB1/automate-output-hLd2xN/.automate-site/staging-x776Dt/site"
backtrace:
  the step received it at:
    automate/pipeline/step.scm:676:62 (_)
    automate/utils/goblins.scm:277:20 (await-in-vat)

Goblins exception:
In message to #<local-object ^file-output>:
  (commit publish-twice)
ice-9/boot-9.scm:1705:22: In procedure raise-exception:
ERROR:
  1. &automate-error:
      kind: already-committed
      irritants: (site "/tmp/guix-build-guile-automate-0.0.0-dev.drv-0/automate-tests-OBbrB1/automate-output-7JEhx6/site")
  2. &message: "this file output was committed already"
  3. &irritants: (site "/tmp/guix-build-guile-automate-0.0.0-dev.drv-0/automate-tests-OBbrB1/automate-output-7JEhx6/site")
In goblins/core.scm:
   1074:7  3 (syscaller-$ _ #<local-object ^file-output> (commit publish-twice))
In automate/resources/file-output.scm:
    169:6  2 (commit publish-twice)
In automate/model.scm:
    119:2  1 (raise-automate-error _ _ . _)
In ice-9/boot-9.scm:
  1705:22  0 (raise-exception _ #:continuable? _)

error: this file output was committed already
  kind: already-committed
  irritants: site "/tmp/guix-build-guile-automate-0.0.0-dev.drv-0/automate-tests-OBbrB1/automate-output-7JEhx6/site"
backtrace:
  the step received it at:
    automate/pipeline/step.scm:676:62 (_)
    automate/utils/goblins.scm:277:20 (await-in-vat)
`/tmp/guix-build-guile-automate-0.0.0-dev.drv-0/automate-tests-OBbrB1/automate-output-kbavgX/.automate-site/staging-ASnuil/site/index' -> `/tmp/guix-build-guile-automate-0.0.0-dev.drv-0/automate-tests-OBbrB1/automate-output-kbavgX/.automate-site/6ad0c578-128-ccf1ae01/index'
error: value cannot be masked
  kind: unmaskable
  irritants: too-short
backtrace:
  the step received it at:
    automate/pipeline/step.scm:676:62 (_)
    automate/pipeline/step.scm:226:6 (mask)

Goblins exception:
In message to #<local-object ^file-input>:
  (attach read-only)
ice-9/boot-9.scm:1705:22: In procedure raise-exception:
ERROR:
  1. &automate-error:
      kind: missing-file-input
      irritants: (sources "/nowhere-at-all")
  2. &message: "no file or directory for this file input"
  3. &irritants: (sources "/nowhere-at-all")
In goblins/core.scm:
   1074:7  3 (syscaller-$ _ #<local-object ^file-input> (attach read-only))
In automate/resources/materialise.scm:
    109:6  2 (attach _)
In automate/model.scm:
    119:2  1 (raise-automate-error _ _ . _)
In ice-9/boot-9.scm:
  1705:22  0 (raise-exception _ #:continuable? _)

error: no file or directory for this file input
  kind: missing-file-input
  irritants: sources "/nowhere-at-all"
backtrace:
  the step received it at:
    automate/pipeline/step.scm:676:62 (_)
    ice-9/eval.scm:293:34 (_)
    automate/utils/goblins.scm:277:20 (await-in-vat)

Goblins exception:
In message to #<local-object ^secret>:
  (attach missing)
ice-9/boot-9.scm:1705:22: In procedure raise-exception:
ERROR:
  1. &automate-error:
      kind: missing-secret
      irritants: (token "/tmp/guix-build-guile-automate-0.0.0-dev.drv-0/automate-tests-OBbrB1/automate-secrets-n49jyV/token")
  2. &message: "no file for this secret"
  3. &irritants: (token "/tmp/guix-build-guile-automate-0.0.0-dev.drv-0/automate-tests-OBbrB1/automate-secrets-n49jyV/token")
In goblins/core.scm:
   1074:7  3 (syscaller-$ _ #<local-object ^secret> (attach missing))
In automate/resources/materialise.scm:
     87:6  2 (attach _)
In automate/model.scm:
    119:2  1 (raise-automate-error _ _ . _)
In ice-9/boot-9.scm:
  1705:22  0 (raise-exception _ #:continuable? _)

error: no file for this secret
  kind: missing-secret
  irritants: token "/tmp/guix-build-guile-automate-0.0.0-dev.drv-0/automate-tests-OBbrB1/automate-secrets-n49jyV/token"
backtrace:
  the step received it at:
    automate/pipeline/step.scm:676:62 (_)
    automate/utils/goblins.scm:277:20 (await-in-vat)

Goblins exception:
In message to #<local-object ^call-with-vat>:
ice-9/boot-9.scm:1705:22: In procedure raise-exception:
ERROR:
  1. &automate-error:
      kind: missing-configuration
      irritants: (secrets-directory)
  2. &message: "resource needs a configuration value"
  3. &irritants: (secrets-directory)
In goblins/core.scm:
   1074:7  8 (syscaller-$ _ #<local-object ^call-with-vat> ())
In unknown file:
           7 (_ #<procedure list _>)
In automate/pipeline.scm:
  1277:17  6 (spawn-run #<<pipeline-process> directory: "/tmp/guix-build-guile-automate-0.0.0-dev.drv-0/automate-tests-OBbrB1/automate-nggCK2" socket-path: "/tmp/guix-build-guile-automate-0.0.0-dev.drv-0/automate-tests-OBbrB1/automate-nggCK2/intro.sock" intro-vat: #<vat id: 154 name: intro> vat: #<vat id: 155 name: pipeline> netlayer: #<local-object ^unix-domain-socket-netlayer> mycapn: #<local-object ^mycapn> mailbox: #<<mailbox> mutex: #<mutex 7fffbf9aff00> condition: #<condition-variable…> …)
In srfi/srfi-1.scm:
   702:17  5 (map1 ((token . #<local-object ^per-run>)))
In automate/pipeline.scm:
  1225:27  4 (_ _)
In goblins/core.scm:
   1074:7  3 (syscaller-$ _ #<local-object ^per-run> (for-run "run57324" ((open-gate . #<procedure open-gate! (name handler)>) (record . #<procedure record-event! (event)>) (mask . #<procedure mask-secret! (name value)>) (workspace-root . #f) (parameters))))
In automate/resources/materialise.scm:
    295:6  2 (_ _ ((open-gate . #<procedure open-gate! (name handler)>) (record . #<procedure record-event! (event)>) (mask . #<procedure mask-secret! (name value)>) (workspace-root . #f) (parameters)))
In automate/model.scm:
    119:2  1 (raise-automate-error _ _ . _)
In ice-9/boot-9.scm:
  1705:22  0 (raise-exception _ #:continuable? _)

warning: mutating the process environment while multiple threads are running;
         further behavior unspecified.
warning: mutating the process environment while multiple threads are running;
         further behavior unspecified.
warning: mutating the process environment while multiple threads are running;
         further behavior unspecified.
warning: mutating the process environment while multiple threads are running;
         further behavior unspecified.
warning: mutating the process environment while multiple threads are running;
         further behavior unspecified.
warning: mutating the process environment while multiple threads are running;
         further behavior unspecified.
warning: mutating the process environment while multiple threads are running;
         further behavior unspecified.
guile: warning: failed to install locale
warning: mutating the process environment while multiple threads are running;
         further behavior unspecified.
warning: mutating the process environment while multiple threads are running;
         further behavior unspecified.
warning: mutating the process environment while multiple threads are running;
         further behavior unspecified.
warning: mutating the process environment while multiple threads are running;
         further behavior unspecified.
warning: mutating the process environment while multiple threads are running;
         further behavior unspecified.

Goblins exception:
In message to #<local-object ^guix-daemon>:
  (keep keep-elsewhere "/tmp/thing")
ice-9/boot-9.scm:1705:22: In procedure raise-exception:
ERROR:
  1. &automate-error:
      kind: not-a-store-item
      irritants: (daemon "/tmp/thing")
  2. &message: "only a store path can be kept"
  3. &irritants: (daemon "/tmp/thing")
In goblins/core.scm:
   1074:7  3 (syscaller-$ _ #<local-object ^guix-daemon> (keep keep-elsewhere "/tmp/thing"))
In automate/resources/guix-daemon.scm:
    212:7  2 (keep keep-elsewhere "/tmp/thing")
In automate/model.scm:
    119:2  1 (raise-automate-error _ _ . _)
In ice-9/boot-9.scm:
  1705:22  0 (raise-exception _ #:continuable? _)

error: only a store path can be kept
  kind: not-a-store-item
  irritants: daemon "/tmp/thing"
backtrace:
  the step received it at:
    automate/pipeline/step.scm:676:62 (_)
    automate/utils/goblins.scm:277:20 (await-in-vat)
197 passed, 0 failed
== processes.scm
;;; compiling /tmp/guix-build-guile-automate-0.0.0-dev.drv-0/source/tests/processes.scm
;;; compiled /tmp/guix-build-guile-automate-0.0.0-dev.drv-0/source/.cache/guile/ccache/3.0-LE-8-4.7/tmp/guix-build-guile-automate-0.0.0-dev.drv-0/source/tests/processes.scm.go
4 passed, 0 failed
== pumphouse-draining.scm
;;; compiling /tmp/guix-build-guile-automate-0.0.0-dev.drv-0/source/tests/pumphouse-draining.scm
;;; compiling ./tests/pumphouse/support.scm
;;; compiled /tmp/guix-build-guile-automate-0.0.0-dev.drv-0/source/.cache/guile/ccache/3.0-LE-8-4.7/tmp/guix-build-guile-automate-0.0.0-dev.drv-0/source/tests/pumphouse/support.scm.go
;;; compiled /tmp/guix-build-guile-automate-0.0.0-dev.drv-0/source/.cache/guile/ccache/3.0-LE-8-4.7/tmp/guix-build-guile-automate-0.0.0-dev.drv-0/source/tests/pumphouse-draining.scm.go
http on port 37087
pumphouse listening on /tmp/guix-build-guile-automate-0.0.0-dev.drv-0/automate-tests-OBbrB1/automate-pumphouse-4umfIM/socket
admin: /tmp/guix-build-guile-automate-0.0.0-dev.drv-0/automate-tests-OBbrB1/automate-pumphouse-4umfIM/admin
remote admin: /tmp/guix-build-guile-automate-0.0.0-dev.drv-0/automate-tests-OBbrB1/automate-pumphouse-4umfIM/remote-admin
attached to the pumphouse of /tmp/guix-build-guile-automate-0.0.0-dev.drv-0/automate-tests-OBbrB1/automate-pumphouse-4umfIM/any
run f3114410e9971085 asked this process to drain and stop: upgraded
stopping: taking no more runs; 1 in flight

Goblins exception:
In message to #<local-object ^pipeline-endpoint>:
  (run (run-request (id . "e229ff3747d5e378") (parameters) (cause . #f) (ancestors)))
ice-9/boot-9.scm:1705:22: In procedure raise-exception:
ERROR:
  1. &automate-error:
      kind: busy
      irritants: (tests/stopping/other)
  2. &message: "this process is stopping"
  3. &irritants: (tests/stopping/other)
In goblins/core.scm:
   1074:7  2 (syscaller-$ _ #<local-object ^pipeline-endpoint> (run (run-request (id . "e229ff3747d5e378") (parameters) (cause . #f) (ancestors))))
In automate/model.scm:
    119:2  1 (raise-automate-error _ _ . _)
In ice-9/boot-9.scm:
  1705:22  0 (raise-exception _ #:continuable? _)

tests/stopping/other run: this process is stopping: tests/stopping/other

Goblins exception:
In message to #<local-object broken-handler>:
  (#<&compound-exception components: (#<&automate-error kind: busy irritants: (tests/stopping/other)> #<&message message: "this process is stopping"> #<&irritants irritants: (tests/stopping/other)>)>)
ice-9/boot-9.scm:1705:22: In procedure raise-exception:
In procedure string-append: Wrong type (expecting string): tests/stopping/other
In goblins/core.scm:
   1074:7  4 (syscaller-$ _ #<local-object broken-handler> (#<&compound-exception components: (#<&automate-error kind: busy irritants: (tests/stopping/other)> #<&message message: "this process is stopping"> #<&irritants irritants: (tests/stopping/other)>)>))
  2038:14  3 (_ . _)
In automate/pipeline/errors.scm:
   234:41  2 (_ _)
In unknown file:
           1 (string-append tests/stopping/other " answered it")
In ice-9/boot-9.scm:
  1705:22  0 (raise-exception _ #:continuable? _)

admin run: #<&compound-exception components: (#<&mystery-exception> #<&message message: "Unknown error occurred with remote object"> #<&irritants irritants: ()>)>
  fail: after which it takes no new run of any pipeline it serves
    error:    #<&compound-exception components: (#<&mystery-exception> #<&message message: "Unknown error occurred with remote object"> #<&irritants irritants: ()>)>
attached to the pumphouse of /tmp/guix-build-guile-automate-0.0.0-dev.drv-0/automate-tests-OBbrB1/automate-pumphouse-4umfIM/any
attached to the pumphouse of /tmp/guix-build-guile-automate-0.0.0-dev.drv-0/automate-tests-OBbrB1/automate-pumphouse-4umfIM/any
attached to the pumphouse of /tmp/guix-build-guile-automate-0.0.0-dev.drv-0/automate-tests-OBbrB1/automate-pumphouse-4umfIM/any
the pumphouse asked this process to drain and stop: fleet upgrade
stopping: taking no more runs; 0 in flight
the pumphouse asked this process to drain and stop: operator
stopping: taking no more runs; 0 in flight

Goblins exception:
In message to #<local-object ^admin>:
  (drain-and-stop tests/stopping/fleet #f "again")
ice-9/boot-9.scm:1705:22: In procedure raise-exception:
ERROR:
  1. &automate-error:
      kind: not-attached
      irritants: (tests/stopping/fleet #f)
  2. &message: "no pipeline process is attached under this name"
  3. &irritants: (tests/stopping/fleet #f)
In goblins/core.scm:
   1074:7  3 (syscaller-$ _ #<local-object ^admin> (drain-and-stop tests/stopping/fleet #f "again"))
In automate/pumphouse.scm:
    110:6  2 (drain-processes! #<<pumphouse> records: #<local-object ^records> lives: #<hash-table 7ffff7807140 4/31> serving: #<hash-table 7ffff7807120 4/31> owners: #<hash-table 7ffff7807100 0/31> reporters: #<hash-table 7ffff78070e0 0/31> shared: #<hash-table 7ffff78070c0 0/31> gates: #<hash-table 7ffff78070a0 0/31> stopped: #<hash-table 7ffff7807080 0/31> waiting: #<hash-table 7ffff7807060 0/31> timers: #<hash-table 7ffff7807040 0/31> tokens: #<hash-table 7ffff7807020 2/31> registration…> …)
In automate/model.scm:
    119:2  1 (raise-automate-error _ _ . _)
In ice-9/boot-9.scm:
  1705:22  0 (raise-exception _ #:continuable? _)

admin drain-and-stop: no pipeline process is attached under this name: tests/stopping/fleet, #f
stop 1545: kill #<unspecified>, waitpid (1545 . 9)
stop 1514: kill #<unspecified>, waitpid (1514 . 0)
18 passed, 1 failed
== pumphouse-lost.scm
;;; compiling /tmp/guix-build-guile-automate-0.0.0-dev.drv-0/source/tests/pumphouse-lost.scm
;;; compiled /tmp/guix-build-guile-automate-0.0.0-dev.drv-0/source/.cache/guile/ccache/3.0-LE-8-4.7/tmp/guix-build-guile-automate-0.0.0-dev.drv-0/source/tests/pumphouse-lost.scm.go
http on port 46305
pumphouse listening on /tmp/guix-build-guile-automate-0.0.0-dev.drv-0/automate-tests-OBbrB1/automate-pumphouse-EqXLzQ/socket
admin: /tmp/guix-build-guile-automate-0.0.0-dev.drv-0/automate-tests-OBbrB1/automate-pumphouse-EqXLzQ/admin
remote admin: /tmp/guix-build-guile-automate-0.0.0-dev.drv-0/automate-tests-OBbrB1/automate-pumphouse-EqXLzQ/remote-admin
attached to the pumphouse of /tmp/guix-build-guile-automate-0.0.0-dev.drv-0/automate-tests-OBbrB1/automate-pumphouse-EqXLzQ/any
attached to the pumphouse of /tmp/guix-build-guile-automate-0.0.0-dev.drv-0/automate-tests-OBbrB1/automate-pumphouse-EqXLzQ/any

Goblins exception:
In message to #<local-object fulfilled-handler>:
  (((pipeline . tests/gone) (outcome . #f) (instance . "gone")))
ice-9/boot-9.scm:1705:22: In procedure raise-exception:
ERROR:
  1. &automate-error:
      kind: attached
      irritants: ("14d3751d25023319")
  2. &message: "the process holding the run is attached; abort the run instead"
  3. &irritants: ("14d3751d25023319")
In goblins/core.scm:
   1074:7  3 (syscaller-$ _ #<local-object fulfilled-handler> (((pipeline . tests/gone) (outcome . #f) (instance . "gone"))))
  2038:14  2 (_ . _)
In automate/model.scm:
    119:2  1 (raise-automate-error _ _ . _)
In ice-9/boot-9.scm:
  1705:22  0 (raise-exception _ #:continuable? _)

admin abandon: the process holding the run is attached; abort the run instead: "14d3751d25023319"
stop 1602: kill #<unspecified>, waitpid (1602 . 9)

Goblins exception:
In message to #<local-object fulfilled-handler>:
  (#f)
ice-9/boot-9.scm:1705:22: In procedure raise-exception:
ERROR:
  1. &automate-error:
      kind: no-such-run
      irritants: ("no-such-run")
  2. &message: "no run of that id"
  3. &irritants: ("no-such-run")
In goblins/core.scm:
   1074:7  3 (syscaller-$ _ #<local-object fulfilled-handler> (#f))
  2038:14  2 (_ . _)
In automate/model.scm:
    119:2  1 (raise-automate-error _ _ . _)
In ice-9/boot-9.scm:
  1705:22  0 (raise-exception _ #:continuable? _)

admin abandon: no run of that id: "no-such-run"
lost the pumphouse; reconnecting
stop 1582: kill #<unspecified>, waitpid (1582 . 0)
cannot reach the pumphouse of /tmp/guix-build-guile-automate-0.0.0-dev.drv-0/automate-tests-OBbrB1/automate-pumphouse-EqXLzQ/any; retrying every 1 seconds
http on port 46773
pumphouse listening on /tmp/guix-build-guile-automate-0.0.0-dev.drv-0/automate-tests-OBbrB1/automate-pumphouse-EqXLzQ/socket
admin: /tmp/guix-build-guile-automate-0.0.0-dev.drv-0/automate-tests-OBbrB1/automate-pumphouse-EqXLzQ/admin
remote admin: /tmp/guix-build-guile-automate-0.0.0-dev.drv-0/automate-tests-OBbrB1/automate-pumphouse-EqXLzQ/remote-admin
registration (/): /tmp/guix-build-guile-automate-0.0.0-dev.drv-0/automate-tests-OBbrB1/automate-pumphouse-EqXLzQ/any
registration (tests/declared/): /tmp/guix-build-guile-automate-0.0.0-dev.drv-0/automate-tests-OBbrB1/automate-pumphouse-EqXLzQ/declared
attached to the pumphouse of /tmp/guix-build-guile-automate-0.0.0-dev.drv-0/automate-tests-OBbrB1/automate-pumphouse-EqXLzQ/any
stop 1640: kill #<unspecified>, waitpid (1640 . 9)

Goblins exception:
In message to #<local-object ^admin>:
  (registration (tests/only) #f)
ice-9/boot-9.scm:1705:22: In procedure raise-exception:
ERROR:
  1. &automate-error:
      kind: declared-registrations
      irritants: ()
  2. &message: "this pumphouse's registrations are declared by its script, which is where to change them"
  3. &irritants: ()
In goblins/core.scm:
   1074:7  3 (syscaller-$ _ #<local-object ^admin> (registration (tests/only) #f))
In automate/pumphouse.scm:
    658:4  2 (registration (tests/only) #f)
In automate/model.scm:
    119:2  1 (raise-automate-error _ _ . _)
In ice-9/boot-9.scm:
  1705:22  0 (raise-exception _ #:continuable? _)

admin registration: this pumphouse's registrations are declared by its script, which is where to change them

Goblins exception:
In message to #<local-object ^admin>:
  (revoke (/) #f)
ice-9/boot-9.scm:1705:22: In procedure raise-exception:
ERROR:
  1. &automate-error:
      kind: declared-registrations
      irritants: ()
  2. &message: "this pumphouse's registrations are declared by its script, which is where to change them"
  3. &irritants: ()
In goblins/core.scm:
   1074:7  3 (syscaller-$ _ #<local-object ^admin> (revoke (/) #f))
In automate/pumphouse.scm:
    658:4  2 (revoke (/) #f)
In automate/model.scm:
    119:2  1 (raise-automate-error _ _ . _)
In ice-9/boot-9.scm:
  1705:22  0 (raise-exception _ #:continuable? _)

admin revoke: this pumphouse's registrations are declared by its script, which is where to change them

Goblins exception:
In message to #<local-object ^admin>:
  (forget-pipeline tests/linger)
ice-9/boot-9.scm:1705:22: In procedure raise-exception:
ERROR:
  1. &automate-error:
      kind: attached
      irritants: (tests/linger)
  2. &message: "a pipeline process is attached under this name"
  3. &irritants: (tests/linger)
In goblins/core.scm:
   1074:7  3 (syscaller-$ _ #<local-object ^admin> (forget-pipeline tests/linger))
In automate/pumphouse.scm:
     64:4  2 (forget-pipeline! #<<pumphouse> records: #<local-object ^records> lives: #<hash-table 7ffff76653a0 1/31> serving: #<hash-table 7ffff7665360 1/31> owners: #<hash-table 7ffff7665320 0/31> reporters: #<hash-table 7ffff76652e0 0/31> shared: #<hash-table 7ffff76652a0 0/31> gates: #<hash-table 7ffff7665260 0/31> stopped: #<hash-table 7ffff7665220 0/31> waiting: #<hash-table 7ffff76651e0 0/31> timers: #<hash-table 7ffff76651a0 0/31> tokens: #<hash-table 7ffff7665160 1/31> registration…> …)
In automate/model.scm:
    119:2  1 (raise-automate-error _ _ . _)
In ice-9/boot-9.scm:
  1705:22  0 (raise-exception _ #:continuable? _)

admin forget-pipeline: a pipeline process is attached under this name: tests/linger
stop 1592: kill #<unspecified>, waitpid (1592 . 9)

Goblins exception:
In message to #<local-object fulfilled-handler>:
  (#f)
ice-9/boot-9.scm:1705:22: In procedure raise-exception:
ERROR:
  1. &automate-error:
      kind: no-such-pipeline
      irritants: (tests/linger)
  2. &message: "no such pipeline"
  3. &irritants: (tests/linger)
In goblins/core.scm:
   1074:7  4 (syscaller-$ _ #<local-object fulfilled-handler> (#f))
  2038:14  3 (_ . _)
In automate/pumphouse.scm:
    72:10  2 (_ #f)
In automate/model.scm:
    119:2  1 (raise-automate-error _ _ . _)
In ice-9/boot-9.scm:
  1705:22  0 (raise-exception _ #:continuable? _)

admin forget-pipeline: no such pipeline: tests/linger
attached to the pumphouse of /tmp/guix-build-guile-automate-0.0.0-dev.drv-0/automate-tests-OBbrB1/automate-pumphouse-EqXLzQ/any
attached to the pumphouse of /tmp/guix-build-guile-automate-0.0.0-dev.drv-0/automate-tests-OBbrB1/automate-pumphouse-EqXLzQ/any

Goblins exception:
In message to #<local-object ^pipeline-endpoint>:
  (run (run-request (id . "3fb50a87e3e97460") (parameters (marker . "/tmp/guix-build-guile-automate-0.0.0-dev.drv-0/automate-tests-OBbrB1/automate-pumphouse-EqXLzQ/linger-8")) (cause . #f) (ancestors)))
ice-9/boot-9.scm:1705:22: In procedure raise-exception:
ERROR:
  1. &automate-error:
      kind: busy
      irritants: (tests/pool 1)
  2. &message: "as many runs are in flight as this process takes"
  3. &irritants: (tests/pool 1)
In goblins/core.scm:
   1074:7  2 (syscaller-$ _ #<local-object ^pipeline-endpoint> (run (run-request (id . "3fb50a87e3e97460") (parameters (marker . "/tmp/guix-build-guile-automate-0.0.0-dev.drv-0/automate-tests-OBbrB1/automate-pumphouse-EqXLzQ/linger-8")) (cause . #f) (ancestors))))
In automate/model.scm:
    119:2  1 (raise-automate-error _ _ . _)
In ice-9/boot-9.scm:
  1705:22  0 (raise-exception _ #:continuable? _)

tests/pool run: as many runs are in flight as this process takes: tests/pool, 1

Goblins exception:
In message to #<local-object broken-handler>:
  (#<&compound-exception components: (#<&automate-error kind: busy irritants: (tests/pool 1)> #<&message message: "as many runs are in flight as this process takes"> #<&irritants irritants: (tests/pool 1)>)>)
ice-9/boot-9.scm:1705:22: In procedure raise-exception:
In procedure string-append: Wrong type (expecting string): tests/pool
In goblins/core.scm:
   1074:7  4 (syscaller-$ _ #<local-object broken-handler> (#<&compound-exception components: (#<&automate-error kind: busy irritants: (tests/pool 1)> #<&message message: "as many runs are in flight as this process takes"> #<&irritants irritants: (tests/pool 1)>)>))
  2038:14  3 (_ . _)
In automate/pipeline/errors.scm:
   234:41  2 (_ _)
In unknown file:
           1 (string-append tests/pool " answered it")
In ice-9/boot-9.scm:
  1705:22  0 (raise-exception _ #:continuable? _)

admin run: #<&compound-exception components: (#<&mystery-exception> #<&message message: "Unknown error occurred with remote object"> #<&irritants irritants: ()>)>
stop 1668: kill #<unspecified>, waitpid (1668 . 9)
attached to the pumphouse of /tmp/guix-build-guile-automate-0.0.0-dev.drv-0/automate-tests-OBbrB1/automate-pumphouse-EqXLzQ/any

Goblins exception:
In message to #<local-object ^pipeline-endpoint>:
  (run (run-request (id . "4d0949ce36f1ee0f") (parameters (marker . "/tmp/guix-build-guile-automate-0.0.0-dev.drv-0/automate-tests-OBbrB1/automate-pumphouse-EqXLzQ/linger-10")) (cause . #f) (ancestors)))
ice-9/boot-9.scm:1705:22: In procedure raise-exception:
ERROR:
  1. &automate-error:
      kind: busy
      irritants: (tests/pool 1)
  2. &message: "as many runs are in flight as this process takes"
  3. &irritants: (tests/pool 1)
In goblins/core.scm:
   1074:7  2 (syscaller-$ _ #<local-object ^pipeline-endpoint> (run (run-request (id . "4d0949ce36f1ee0f") (parameters (marker . "/tmp/guix-build-guile-automate-0.0.0-dev.drv-0/automate-tests-OBbrB1/automate-pumphouse-EqXLzQ/linger-10")) (cause . #f) (ancestors))))
In automate/model.scm:
    119:2  1 (raise-automate-error _ _ . _)
In ice-9/boot-9.scm:
  1705:22  0 (raise-exception _ #:continuable? _)

tests/pool run: as many runs are in flight as this process takes: tests/pool, 1

Goblins exception:
In message to #<local-object broken-handler>:
  (#<&compound-exception components: (#<&automate-error kind: busy irritants: (tests/pool 1)> #<&message message: "as many runs are in flight as this process takes"> #<&irritants irritants: (tests/pool 1)>)>)
ice-9/boot-9.scm:1705:22: In procedure raise-exception:
In procedure string-append: Wrong type (expecting string): tests/pool
In goblins/core.scm:
   1074:7  4 (syscaller-$ _ #<local-object broken-handler> (#<&compound-exception components: (#<&automate-error kind: busy irritants: (tests/pool 1)> #<&message message: "as many runs are in flight as this process takes"> #<&irritants irritants: (tests/pool 1)>)>))
  2038:14  3 (_ . _)
In automate/pipeline/errors.scm:
   234:41  2 (_ _)
In unknown file:
           1 (string-append tests/pool " answered it")
In ice-9/boot-9.scm:
  1705:22  0 (raise-exception _ #:continuable? _)

admin run: #<&compound-exception components: (#<&mystery-exception> #<&message message: "Unknown error occurred with remote object"> #<&irritants irritants: ()>)>
stop 1706: kill #<unspecified>, waitpid (1706 . 9)
stop 1669: kill #<unspecified>, waitpid (1669 . 9)
stop 1630: kill #<unspecified>, waitpid (1630 . 0)
53 passed, 0 failed
== pumphouse-replay.scm
;;; compiling /tmp/guix-build-guile-automate-0.0.0-dev.drv-0/source/tests/pumphouse-replay.scm
;;; compiled /tmp/guix-build-guile-automate-0.0.0-dev.drv-0/source/.cache/guile/ccache/3.0-LE-8-4.7/tmp/guix-build-guile-automate-0.0.0-dev.drv-0/source/tests/pumphouse-replay.scm.go
http on port 34921
pumphouse listening on /tmp/guix-build-guile-automate-0.0.0-dev.drv-0/automate-tests-OBbrB1/automate-pumphouse-ha5g1m/socket
admin: /tmp/guix-build-guile-automate-0.0.0-dev.drv-0/automate-tests-OBbrB1/automate-pumphouse-ha5g1m/admin
remote admin: /tmp/guix-build-guile-automate-0.0.0-dev.drv-0/automate-tests-OBbrB1/automate-pumphouse-ha5g1m/remote-admin
attached to the pumphouse of /tmp/guix-build-guile-automate-0.0.0-dev.drv-0/automate-tests-OBbrB1/automate-pumphouse-ha5g1m/any
lost the pumphouse; reconnecting
cannot reach the pumphouse of /tmp/guix-build-guile-automate-0.0.0-dev.drv-0/automate-tests-OBbrB1/automate-pumphouse-ha5g1m/any; retrying every 1 seconds
stop 1725: kill #<unspecified>, waitpid (1725 . 0)
http on port 37779
pumphouse listening on /tmp/guix-build-guile-automate-0.0.0-dev.drv-0/automate-tests-OBbrB1/automate-pumphouse-ha5g1m/socket
admin: /tmp/guix-build-guile-automate-0.0.0-dev.drv-0/automate-tests-OBbrB1/automate-pumphouse-ha5g1m/admin
remote admin: /tmp/guix-build-guile-automate-0.0.0-dev.drv-0/automate-tests-OBbrB1/automate-pumphouse-ha5g1m/remote-admin
attached to the pumphouse of /tmp/guix-build-guile-automate-0.0.0-dev.drv-0/automate-tests-OBbrB1/automate-pumphouse-ha5g1m/any
stop 1735: kill #<unspecified>, waitpid (1735 . 9)
attached to the pumphouse of /tmp/guix-build-guile-automate-0.0.0-dev.drv-0/automate-tests-OBbrB1/automate-pumphouse-ha5g1m/any
stop 1773: kill #<unspecified>, waitpid (1773 . 9)
stop 1750: kill #<unspecified>, waitpid (1750 . 0)
14 passed, 0 failed
== pumphouse-restart.scm
;;; compiling /tmp/guix-build-guile-automate-0.0.0-dev.drv-0/source/tests/pumphouse-restart.scm
;;; compiled /tmp/guix-build-guile-automate-0.0.0-dev.drv-0/source/.cache/guile/ccache/3.0-LE-8-4.7/tmp/guix-build-guile-automate-0.0.0-dev.drv-0/source/tests/pumphouse-restart.scm.go
http on port 46237
pumphouse listening on /tmp/guix-build-guile-automate-0.0.0-dev.drv-0/automate-tests-OBbrB1/automate-pumphouse-piqbxc/socket
admin: /tmp/guix-build-guile-automate-0.0.0-dev.drv-0/automate-tests-OBbrB1/automate-pumphouse-piqbxc/admin
remote admin: /tmp/guix-build-guile-automate-0.0.0-dev.drv-0/automate-tests-OBbrB1/automate-pumphouse-piqbxc/remote-admin
attached to the pumphouse of /tmp/guix-build-guile-automate-0.0.0-dev.drv-0/automate-tests-OBbrB1/automate-pumphouse-piqbxc/any
attached to the pumphouse
lost the pumphouse; reconnecting
cannot reach the pumphouse of /tmp/guix-build-guile-automate-0.0.0-dev.drv-0/automate-tests-OBbrB1/automate-pumphouse-piqbxc/anylost the pumphouse; reconnecting
; retrying every 1 seconds
http on port 38021
pumphouse listening on /tmp/guix-build-guile-automate-0.0.0-dev.drv-0/automate-tests-OBbrB1/automate-pumphouse-piqbxc/socket
admin: /tmp/guix-build-guile-automate-0.0.0-dev.drv-0/automate-tests-OBbrB1/automate-pumphouse-piqbxc/admin
remote admin: /tmp/guix-build-guile-automate-0.0.0-dev.drv-0/automate-tests-OBbrB1/automate-pumphouse-piqbxc/remote-admin
attached to the pumphouse
attached to the pumphouse of /tmp/guix-build-guile-automate-0.0.0-dev.drv-0/automate-tests-OBbrB1/automate-pumphouse-piqbxc/any
stop 1802: kill #<unspecified>, waitpid (1802 . 9)
stop 1803: kill #<unspecified>, waitpid (1803 . 9)
stop 1849: kill #<unspecified>, waitpid (1849 . 0)
19 passed, 0 failed
== pumphouse-shepherd.scm
;;; compiling /tmp/guix-build-guile-automate-0.0.0-dev.drv-0/source/tests/pumphouse-shepherd.scm
;;; compiled /tmp/guix-build-guile-automate-0.0.0-dev.drv-0/source/.cache/guile/ccache/3.0-LE-8-4.7/tmp/guix-build-guile-automate-0.0.0-dev.drv-0/source/tests/pumphouse-shepherd.scm.go
http on port 36321
pumphouse listening on /tmp/guix-build-guile-automate-0.0.0-dev.drv-0/automate-tests-OBbrB1/automate-pumphouse-xkyXcy/socket
admin: /tmp/guix-build-guile-automate-0.0.0-dev.drv-0/automate-tests-OBbrB1/automate-pumphouse-xkyXcy/admin
remote admin: /tmp/guix-build-guile-automate-0.0.0-dev.drv-0/automate-tests-OBbrB1/automate-pumphouse-xkyXcy/remote-admin
registration (/): /tmp/guix-build-guile-automate-0.0.0-dev.drv-0/automate-tests-OBbrB1/automate-pumphouse-xkyXcy/any
registration (tests/registered): /tmp/guix-build-guile-automate-0.0.0-dev.drv-0/automate-tests-OBbrB1/ps-oG1fW1/secrets/registered/pumphouse
GNU Shepherd 1.0.9 (Guile 3.0.9, Fibers 1.4.3, x86_64-unknown-linux-gnu)
Starting service root...
Service root started.
Service root running with value #<<process> id: 1896 command: #f>.
Service root has been started.
Configuration successfully loaded from '/tmp/guix-build-guile-automate-0.0.0-dev.drv-0/automate-tests-OBbrB1/ps-oG1fW1/shepherd.scm'.
Starting service shepherd-bridge...
Service shepherd-bridge started.
Service shepherd-bridge running with value #<<process> id: 1902 command: ("/gnu/store/k7vkw9x3wl3lni6a0i2w8xz2z8ylrqyz-guile-3.0.11/bin/guile" "-L" "/tmp/guix-build-guile-automate-0.0.0-dev.drv-0/source" "-L" "/gnu/store/r5gafvw9iapq6173liw37bzxj40bslhs-guile-documenta-0.4.0/share/guile/site/3.0" "-L" "/gnu/store/qzml053shmjml5vj6rbcfss5247h20f6-guile-syntax-highlight-0.3.1/share/guile/site/3.0" "-L" "/gnu/store/7a6l3fzjvr3nvbnw579wdkhhszzzh3ql-guix-1.5.0-6.64d4de2/share/guile/site/3.0" "-L" "/gnu/store/zplkplr3qmp5dpvhcxpgqr1lg44wmxyk-guile-goblins-0.18.0/share/guile/site/3.0" "-L" "/gnu/store/5la7a0imnji190xnfmxf0jrsp82dn9hq-guile-fibers-1.4.3/share/guile/site/3.0" "-L" "/gnu/store/z4fnbwa7d6dprqvd7f89wcifq6ggr2wm-guile-gcrypt-0.5.0/share/guile/site/3.0" "-L" "/gnu/store/b9928rpaj24whj9cz36yd1h28w7pwphq-guile-gnutls-5.0.2/share/guile/site/3.0" "-L" "/gnu/store/nw7d5iijwm9sa16k2swxjalgp0vlm01v-guile-json-4.7.3/share/guile/site/3.0" "-L" "/gnu/store/gyf1hm3gzbq00aw3m9x1xickf3zs3pq8-guile-knots-0.1-39.3417d25/share/guile/site/3.0" "-L" "/gnu/store/wsg7chjw2cg6xnp4il5caff5w0w69ikc-guile-sqlite3-0.1.3/share/guile/site/3.0" "-L" "/gnu/store/8n90dzhz177l1lz8bjrxsgbiyh1kmjap-guile-zlib-0.2.2/share/guile/site/3.0" "-L" "/gnu/store/2qm9a3n19pnznv791jvglb4sgh1jda3s-guile-safsaf-0.5-1.8b35410/share/guile/site/3.0" "-L" "/gnu/store/9ia4lplmfhpdxnnkvk0zyhyainyn0r0q-guile-prometheus-0-11.8f70b4b/share/guile/site/3.0" "-L" "/gnu/store/fp4rjwzvrm309wg11jahx8qcm7ypkai3-guile-ares-rs-0.9.8/share/guile/site/3.0" "-L" "/gnu/store/hfx188ymz9y9ialr175lqifn3b6xfdnz-shepherd-1.0.9/share/guile/site/3.0" "-L" "/gnu/store/x9ypa71lzv9jrd5n0qxq51hxnra83z2x-guile-lib-0.2.8.1/share/guile/site/3.0" "-L" "/gnu/store/9rd4c5w765bmsx0cimk0idpfasicvcdr-guile-config-0.5.1/share/guile/site/3.0" "-L" "/gnu/store/lsys62yw1wnmchmvv3q5x7bzkghyasil-guile-zstd-0.1.1/share/guile/site/3.0" "-L" "/gnu/store/gq36qbm22984252qxrzrgvrqzx807kd0-guile-lzlib-0.4.0/share/guile/site/3.0" "-L" "/gnu/store/axcsnac5kji5p4apyf67jqgpbvs47hcm-guile-git-0.12.1/share/guile/site/3.0" "-L" "/gnu/store/3xl1r2ppwspvhrlv4rzdcw3izhnvlkzm-guile-ssh-1.0.0/share/guile/site/3.0" "-L" "/gnu/store/dkzraln87ih1cbl36npg9fgyfqnmpqhh-guile-semver-0.2.0/share/guile/site/3.0" "-L" "/gnu/store/06k0pq8d20w6f3ymkgdwkm6k6rf2v7yj-guile-lib-0.2.8.1/share/guile/site/3.0" "-L" "/gnu/store/gl031z5csmpkyvicv8q4a3wjjgl5gqbi-guile-avahi-0.4.1/share/guile/site/3.0" "-L" "/gnu/store/k1yhnx32pjwr409ag3l25816ylasvzrf-guile-websocket-0.3.0/share/guile/site/3.0" "-L" "/gnu/store/c7k95lcd985bph7kycpjcwsbw0ky0yw1-guile-bstructs-0.2.0/share/guile/site/3.0" "-L" "/gnu/store/a7k8b77qmv34vjbw5gkgm160zph4lxlg-guile-webutils-0.1-1.d309d65/share/guile/site/3.0" "-L" "/gnu/store/cjnz2ikdas5ih7x2gs95fgi9q6f376gk-guile-bytestructures-2.0.2/share/guile/site/3.0" "-L" "/gnu/store/kwd8v8nwvw00d6akyr58d5bjqjcmfy5d-guile-irregex-0.9.12/share/guile/site/3.0" "-L" "/gnu/store/k7vkw9x3wl3lni6a0i2w8xz2z8ylrqyz-guile-3.0.11/share/guile/3.0" "-L" "/gnu/store/k7vkw9x3wl3lni6a0i2w8xz2z8ylrqyz-guile-3.0.11/share/guile/site/3.0" "-L" "/gnu/store/k7vkw9x3wl3lni6a0i2w8xz2z8ylrqyz-guile-3.0.11/share/guile/site" "-L" "/gnu/store/k7vkw9x3wl3lni6a0i2w8xz2z8ylrqyz-guile-3.0.11/share/guile" "-C" "/gnu/store/pr1sl2xihnxgb895i83p8rzw520xnmza-guile-automate-0.0.0-dev/lib/guile/3.0/site-ccache" "-C" "/gnu/store/pr1sl2xihnxgb895i83p8rzw520xnmza-guile-automate-0.0.0-dev/lib/guile/3.0/site-ccache/" "-C" "/gnu/store/r5gafvw9iapq6173liw37bzxj40bslhs-guile-documenta-0.4.0/lib/guile/3.0/site-ccache" "-C" "/gnu/store/r5gafvw9iapq6173liw37bzxj40bslhs-guile-documenta-0.4.0/share/guile/site/3.0" "-C" "/gnu/store/qzml053shmjml5vj6rbcfss5247h20f6-guile-syntax-highlight-0.3.1/lib/guile/3.0/site-ccache" "-C" "/gnu/store/qzml053shmjml5vj6rbcfss5247h20f6-guile-syntax-highlight-0.3.1/share/guile/site/3.0" "-C" "/gnu/store/7a6l3fzjvr3nvbnw579wdkhhszzzh3ql-guix-1.5.0-6.64d4de2/lib/guile/3.0/site-ccache" "-C" "/gnu/store/7a6l3fzjvr3nvbnw579wdkhhszzzh3ql-guix-1.5.0-6.64d4de2/share/guile/site/3.0" "-C" "/gnu/store/zplkplr3qmp5dpvhcxpgqr1lg44wmxyk-guile-goblins-0.18.0/lib/guile/3.0/site-ccache" "-C" "/gnu/store/zplkplr3qmp5dpvhcxpgqr1lg44wmxyk-guile-goblins-0.18.0/share/guile/site/3.0" "-C" "/gnu/store/5la7a0imnji190xnfmxf0jrsp82dn9hq-guile-fibers-1.4.3/lib/guile/3.0/site-ccache" "-C" "/gnu/store/5la7a0imnji190xnfmxf0jrsp82dn9hq-guile-fibers-1.4.3/share/guile/site/3.0" "-C" "/gnu/store/z4fnbwa7d6dprqvd7f89wcifq6ggr2wm-guile-gcrypt-0.5.0/lib/guile/3.0/site-ccache" "-C" "/gnu/store/z4fnbwa7d6dprqvd7f89wcifq6ggr2wm-guile-gcrypt-0.5.0/share/guile/site/3.0" "-C" "/gnu/store/b9928rpaj24whj9cz36yd1h28w7pwphq-guile-gnutls-5.0.2/lib/guile/3.0/site-ccache" "-C" "/gnu/store/b9928rpaj24whj9cz36yd1h28w7pwphq-guile-gnutls-5.0.2/share/guile/site/3.0" "-C" "/gnu/store/nw7d5iijwm9sa16k2swxjalgp0vlm01v-guile-json-4.7.3/lib/guile/3.0/site-ccache" "-C" "/gnu/store/nw7d5iijwm9sa16k2swxjalgp0vlm01v-guile-json-4.7.3/share/guile/site/3.0" "-C" "/gnu/store/gyf1hm3gzbq00aw3m9x1xickf3zs3pq8-guile-knots-0.1-39.3417d25/lib/guile/3.0/site-ccache" "-C" "/gnu/store/gyf1hm3gzbq00aw3m9x1xickf3zs3pq8-guile-knots-0.1-39.3417d25/share/guile/site/3.0" "-C" "/gnu/store/wsg7chjw2cg6xnp4il5caff5w0w69ikc-guile-sqlite3-0.1.3/lib/guile/3.0/site-ccache" "-C" "/gnu/store/wsg7chjw2cg6xnp4il5caff5w0w69ikc-guile-sqlite3-0.1.3/share/guile/site/3.0" "-C" "/gnu/store/8n90dzhz177l1lz8bjrxsgbiyh1kmjap-guile-zlib-0.2.2/lib/guile/3.0/site-ccache" "-C" "/gnu/store/8n90dzhz177l1lz8bjrxsgbiyh1kmjap-guile-zlib-0.2.2/share/guile/site/3.0" "-C" "/gnu/store/2qm9a3n19pnznv791jvglb4sgh1jda3s-guile-safsaf-0.5-1.8b35410/lib/guile/3.0/site-ccache" "-C" "/gnu/store/2qm9a3n19pnznv791jvglb4sgh1jda3s-guile-safsaf-0.5-1.8b35410/share/guile/site/3.0" "-C" "/gnu/store/9ia4lplmfhpdxnnkvk0zyhyainyn0r0q-guile-prometheus-0-11.8f70b4b/lib/guile/3.0/site-ccache" "-C" "/gnu/store/9ia4lplmfhpdxnnkvk0zyhyainyn0r0q-guile-prometheus-0-11.8f70b4b/share/guile/site/3.0" "-C" "/gnu/store/fp4rjwzvrm309wg11jahx8qcm7ypkai3-guile-ares-rs-0.9.8/lib/guile/3.0/site-ccache" "-C" "/gnu/store/fp4rjwzvrm309wg11jahx8qcm7ypkai3-guile-ares-rs-0.9.8/share/guile/site/3.0" "-C" "/gnu/store/hfx188ymz9y9ialr175lqifn3b6xfdnz-shepherd-1.0.9/lib/guile/3.0/site-ccache" "-C" "/gnu/store/hfx188ymz9y9ialr175lqifn3b6xfdnz-shepherd-1.0.9/share/guile/site/3.0" "-C" "/gnu/store/x9ypa71lzv9jrd5n0qxq51hxnra83z2x-guile-lib-0.2.8.1/lib/guile/3.0/site-ccache" "-C" "/gnu/store/x9ypa71lzv9jrd5n0qxq51hxnra83z2x-guile-lib-0.2.8.1/share/guile/site/3.0" "-C" "/gnu/store/9rd4c5w765bmsx0cimk0idpfasicvcdr-guile-config-0.5.1/lib/guile/3.0/site-ccache" "-C" "/gnu/store/9rd4c5w765bmsx0cimk0idpfasicvcdr-guile-config-0.5.1/share/guile/site/3.0" "-C" "/gnu/store/lsys62yw1wnmchmvv3q5x7bzkghyasil-guile-zstd-0.1.1/lib/guile/3.0/site-ccache" "-C" "/gnu/store/lsys62yw1wnmchmvv3q5x7bzkghyasil-guile-zstd-0.1.1/share/guile/site/3.0" "-C" "/gnu/store/gq36qbm22984252qxrzrgvrqzx807kd0-guile-lzlib-0.4.0/lib/guile/3.0/site-ccache" "-C" "/gnu/store/gq36qbm22984252qxrzrgvrqzx807kd0-guile-lzlib-0.4.0/share/guile/site/3.0" "-C" "/gnu/store/axcsnac5kji5p4apyf67jqgpbvs47hcm-guile-git-0.12.1/lib/guile/3.0/site-ccache" "-C" "/gnu/store/axcsnac5kji5p4apyf67jqgpbvs47hcm-guile-git-0.12.1/share/guile/site/3.0" "-C" "/gnu/store/3xl1r2ppwspvhrlv4rzdcw3izhnvlkzm-guile-ssh-1.0.0/lib/guile/3.0/site-ccache" "-C" "/gnu/store/3xl1r2ppwspvhrlv4rzdcw3izhnvlkzm-guile-ssh-1.0.0/share/guile/site/3.0" "-C" "/gnu/store/dkzraln87ih1cbl36npg9fgyfqnmpqhh-guile-semver-0.2.0/lib/guile/3.0/site-ccache" "-C" "/gnu/store/dkzraln87ih1cbl36npg9fgyfqnmpqhh-guile-semver-0.2.0/share/guile/site/3.0" "-C" "/gnu/store/06k0pq8d20w6f3ymkgdwkm6k6rf2v7yj-guile-lib-0.2.8.1/lib/guile/3.0/site-ccache" "-C" "/gnu/store/06k0pq8d20w6f3ymkgdwkm6k6rf2v7yj-guile-lib-0.2.8.1/share/guile/site/3.0" "-C" "/gnu/store/gl031z5csmpkyvicv8q4a3wjjgl5gqbi-guile-avahi-0.4.1/lib/guile/3.0/site-ccache" "-C" "/gnu/store/gl031z5csmpkyvicv8q4a3wjjgl5gqbi-guile-avahi-0.4.1/share/guile/site/3.0" "-C" "/gnu/store/k1yhnx32pjwr409ag3l25816ylasvzrf-guile-websocket-0.3.0/lib/guile/3.0/site-ccache" "-C" "/gnu/store/k1yhnx32pjwr409ag3l25816ylasvzrf-guile-websocket-0.3.0/share/guile/site/3.0" "-C" "/gnu/store/c7k95lcd985bph7kycpjcwsbw0ky0yw1-guile-bstructs-0.2.0/lib/guile/3.0/site-ccache" "-C" "/gnu/store/c7k95lcd985bph7kycpjcwsbw0ky0yw1-guile-bstructs-0.2.0/share/guile/site/3.0" "-C" "/gnu/store/a7k8b77qmv34vjbw5gkgm160zph4lxlg-guile-webutils-0.1-1.d309d65/share/guile/site/3.0" "-C" "/gnu/store/cjnz2ikdas5ih7x2gs95fgi9q6f376gk-guile-bytestructures-2.0.2/lib/guile/3.0/site-ccache" "-C" "/gnu/store/cjnz2ikdas5ih7x2gs95fgi9q6f376gk-guile-bytestructures-2.0.2/share/guile/site/3.0" "-C" "/gnu/store/kwd8v8nwvw00d6akyr58d5bjqjcmfy5d-guile-irregex-0.9.12/lib/guile/3.0/site-ccache" "-C" "/gnu/store/kwd8v8nwvw00d6akyr58d5bjqjcmfy5d-guile-irregex-0.9.12/share/guile/site/3.0" "-C" "/gnu/store/k7vkw9x3wl3lni6a0i2w8xz2z8ylrqyz-guile-3.0.11/lib/guile/3.0/ccache" "-C" "/gnu/store/k7vkw9x3wl3lni6a0i2w8xz2z8ylrqyz-guile-3.0.11/lib/guile/3.0/site-ccache" "/tmp/guix-build-guile-automate-0.0.0-dev.drv-0/automate-tests-OBbrB1/ps-oG1fW1/bridge.scm")>.
Service shepherd-bridge has been started.
Successfully started 1 service in the background.
attached to the pumphouse of /tmp/guix-build-guile-automate-0.0.0-dev.drv-0/automate-tests-OBbrB1/automate-pumphouse-xkyXcy/any
stop 1911: kill #<unspecified>, waitpid (1911 . 9)
Stopping service root...
Exiting shepherd...
Stopping service shepherd-bridge...
Service shepherd-bridge stopped.
Service shepherd-bridge is now stopped.
Exiting.
(started quick)
run 22955a927cf13fa0 reported to the pumphouse
(launched quick 1987)
(provided quick value)
(output quick value done)
(finished quick succeeded)
(retired quick)
(exited quick 0)
run succeeded
  quick: succeeded
run-pipeline-daemon: error: --once names no pipeline of this program's definitions: "tests/absent"
stop 1886: kill #<unspecified>, waitpid (1886 . 0)
17 passed, 0 failed
== pumphouse-stopping.scm
;;; compiling /tmp/guix-build-guile-automate-0.0.0-dev.drv-0/source/tests/pumphouse-stopping.scm
;;; compiled /tmp/guix-build-guile-automate-0.0.0-dev.drv-0/source/.cache/guile/ccache/3.0-LE-8-4.7/tmp/guix-build-guile-automate-0.0.0-dev.drv-0/source/tests/pumphouse-stopping.scm.go
http on port 45353
pumphouse listening on /tmp/guix-build-guile-automate-0.0.0-dev.drv-0/automate-tests-OBbrB1/automate-pumphouse-qKfpct/socket
admin: /tmp/guix-build-guile-automate-0.0.0-dev.drv-0/automate-tests-OBbrB1/automate-pumphouse-qKfpct/admin
remote admin: /tmp/guix-build-guile-automate-0.0.0-dev.drv-0/automate-tests-OBbrB1/automate-pumphouse-qKfpct/remote-admin
attached to the pumphouse of /tmp/guix-build-guile-automate-0.0.0-dev.drv-0/automate-tests-OBbrB1/automate-pumphouse-qKfpct/any
stopping: taking no more runs; 1 in flight
attached to the pumphouse of /tmp/guix-build-guile-automate-0.0.0-dev.drv-0/automate-tests-OBbrB1/automate-pumphouse-qKfpct/any
stopping: taking no more runs; 1 in flight
stopping: 1 still in flight at the deadline; aborting

Goblins exception:
In message to #<local-object ^pipeline-endpoint>:
  (run (run-request (id . "15b97b5b45b53280") (parameters) (cause . #f) (ancestors)))
ice-9/boot-9.scm:1705:22: In procedure raise-exception:
ERROR:
  1. &automate-error:
      kind: busy
      irritants: (tests/stopping/nap)
  2. &message: "this process is stopping"
  3. &irritants: (tests/stopping/nap)
In goblins/core.scm:
   1074:7  2 (syscaller-$ _ #<local-object ^pipeline-endpoint> (run (run-request (id . "15b97b5b45b53280") (parameters) (cause . #f) (ancestors))))
In automate/model.scm:
    119:2  1 (raise-automate-error _ _ . _)
In ice-9/boot-9.scm:
  1705:22  0 (raise-exception _ #:continuable? _)

tests/stopping/nap run: this process is stopping: tests/stopping/nap

Goblins exception:
In message to #<local-object broken-handler>:
  (#<&compound-exception components: (#<&automate-error kind: busy irritants: (tests/stopping/nap)> #<&message message: "this process is stopping"> #<&irritants irritants: (tests/stopping/nap)>)>)
ice-9/boot-9.scm:1705:22: In procedure raise-exception:
In procedure string-append: Wrong type (expecting string): tests/stopping/nap
In goblins/core.scm:
   1074:7  4 (syscaller-$ _ #<local-object broken-handler> _)
  2038:14  3 (_ . _)
In automate/pipeline/errors.scm:
   234:41  2 (_ _)
In unknown file:
           1 (string-append tests/stopping/nap " answered it")
In ice-9/boot-9.scm:
  1705:22  0 (raise-exception _ #:continuable? _)

admin run: #<&compound-exception components: (#<&mystery-exception> #<&message message: "Unknown error occurred with remote object"> #<&irritants irritants: ()>)>
  fail: a pipeline daemon stopping takes no new run
    error:    #<&compound-exception components: (#<&mystery-exception> #<&message message: "Unknown error occurred with remote object"> #<&irritants irritants: ()>)>
stop 2047: kill #<unspecified>, waitpid (2047 . 9)
removed what an earlier process left in /tmp/guix-build-guile-automate-0.0.0-dev.drv-0/automate-tests-OBbrB1/automate-pumphouse-qKfpct/working
stop 2056: kill #<unspecified>, waitpid (2056 . 9)
run fcf89ceb8657ff73 reported to the pumphouse
run errored
  linger: abandoned
stop 1999: kill #<unspecified>, waitpid (1999 . 0)
19 passed, 1 failed
== pumphouse-timers.scm
;;; compiling /tmp/guix-build-guile-automate-0.0.0-dev.drv-0/source/tests/pumphouse-timers.scm
;;; compiled /tmp/guix-build-guile-automate-0.0.0-dev.drv-0/source/.cache/guile/ccache/3.0-LE-8-4.7/tmp/guix-build-guile-automate-0.0.0-dev.drv-0/source/tests/pumphouse-timers.scm.go
http on port 41481
pumphouse listening on /tmp/guix-build-guile-automate-0.0.0-dev.drv-0/automate-tests-OBbrB1/automate-pumphouse-zq6Vvg/socket
admin: /tmp/guix-build-guile-automate-0.0.0-dev.drv-0/automate-tests-OBbrB1/automate-pumphouse-zq6Vvg/admin
remote admin: /tmp/guix-build-guile-automate-0.0.0-dev.drv-0/automate-tests-OBbrB1/automate-pumphouse-zq6Vvg/remote-admin
attached to the pumphouse of /tmp/guix-build-guile-automate-0.0.0-dev.drv-0/automate-tests-OBbrB1/automate-pumphouse-zq6Vvg/any
2026-10-15 12:23:53 (with-exception-handler) INFO: POST /output/45931f7abfdc40d9/tick 200 7ms
2026-10-15 12:23:54 (with-exception-handler) INFO: POST /output/3d2ef2cc2895fc4f/tick 200 3ms

Goblins exception:
In message to #<local-object ^admin>:
  (pause tests/no-such-timer)
ice-9/boot-9.scm:1705:22: In procedure raise-exception:
ERROR:
  1. &automate-error:
      kind: no-timer
      irritants: (tests/no-such-timer)
  2. &message: "no timer of this name"
  3. &irritants: (tests/no-such-timer)
In goblins/core.scm:
   1074:7  3 (syscaller-$ _ #<local-object ^admin> (pause tests/no-such-timer))
In automate/pumphouse.scm:
    750:6  2 (pause _)
In automate/model.scm:
    119:2  1 (raise-automate-error _ _ . _)
In ice-9/boot-9.scm:
  1705:22  0 (raise-exception _ #:continuable? _)

admin pause: no timer of this name: tests/no-such-timer

Goblins exception:
In message to #<local-object ^admin>:
  (pause tests/no-such-timer)
ice-9/boot-9.scm:1705:22: In procedure raise-exception:
ERROR:
  1. &automate-error:
      kind: no-timer
      irritants: (tests/no-such-timer)
  2. &message: "no timer of this name"
  3. &irritants: (tests/no-such-timer)
In goblins/core.scm:
   1074:7  3 (syscaller-$ _ #<local-object ^admin> (pause tests/no-such-timer))
In automate/pumphouse.scm:
    750:6  2 (pause _)
In automate/model.scm:
    119:2  1 (raise-automate-error _ _ . _)
In ice-9/boot-9.scm:
  1705:22  0 (raise-exception _ #:continuable? _)

admin pause: no timer of this name: tests/no-such-timer

Goblins exception:
In message to #<local-object ^pipeline-endpoint>:
  (run (run-request (id . "45dd879b9dfc3d97") (parameters) (cause . #f) (ancestors)))
ice-9/boot-9.scm:1705:22: In procedure raise-exception:
ERROR:
  1. &automate-error:
      kind: missing-parameter
      irritants: (n)
  2. &message: "run request lacks a parameter"
  3. &irritants: (n)
In goblins/core.scm:
   1074:7  4 (syscaller-$ _ #<local-object ^pipeline-endpoint> (run (run-request (id . "45dd879b9dfc3d97") (parameters) (cause . #f) (ancestors))))
In automate/pipeline/daemon.scm:
    507:7  3 (run (run-request (id . "45dd879b9dfc3d97") (parameters) (cause . #f) (ancestors)))
In srfi/srfi-1.scm:
    750:9  2 (for-each #<procedure 7ffff59d76c0 at automate/pipeline.scm:1181:12 (entry)> ((param (name n))))
In automate/model.scm:
    119:2  1 (raise-automate-error _ _ . _)
In ice-9/boot-9.scm:
  1705:22  0 (raise-exception _ #:continuable? _)

tests/tick run: run request lacks a parameter: n

Goblins exception:
In message to #<local-object broken-handler>:
  (#<&compound-exception components: (#<&automate-error kind: missing-parameter irritants: (n)> #<&message message: "run request lacks a parameter"> #<&irritants irritants: (n)>)>)
ice-9/boot-9.scm:1705:22: In procedure raise-exception:
In procedure string-append: Wrong type (expecting string): tests/tick
In goblins/core.scm:
   1074:7  4 (syscaller-$ _ #<local-object broken-handler> (#<&compound-exception components: (#<&automate-error kind: missing-parameter irritants: (n)> #<&message message: "run request lacks a parameter"> #<&irritants irritants: (n)>)>))
  2038:14  3 (_ . _)
In automate/pipeline/errors.scm:
   234:41  2 (_ _)
In unknown file:
           1 (string-append tests/tick " answered it")
In ice-9/boot-9.scm:
  1705:22  0 (raise-exception _ #:continuable? _)

admin run: #<&compound-exception components: (#<&mystery-exception> #<&message message: "Unknown error occurred with remote object"> #<&irritants irritants: ()>)>
  fail: and passes on why the pipeline process refused
    error:    #<&compound-exception components: (#<&mystery-exception> #<&message message: "Unknown error occurred with remote object"> #<&irritants irritants: ()>)>
admin run: no answer in time: tests/hook
2026-10-15 12:24:01 (with-exception-handler) INFO: POST /output/ce0da13e14447396/tick 200 4ms
stop 2088: kill #<unspecified>, waitpid (2088 . 9)
Error in IO handling wrapped resource #<input-output: file 53>:
#<&compound-exception components: (#<&external-error> #<&origin origin: "fport_read"> #<&message message: "~A"> #<&irritants irritants: ("Connection reset by peer")> #<&exception-with-kind-and-args kind: system-error args: ("fport_read" "~A" ("Connection reset by peer") (104))>)>
In ice-9/boot-9.scm:
  1778:15 19 (with-exception-handler #<procedure 7ffff4e98d50 at ice-9/boot-9.scm:1882:7 (exn)> _ #:unwind? _ #:unwind-for-type _)
In fibers.scm:
   164:13 18 (run-fibers _ #:hz _ #:scheduler _ #:parallelism _ #:cpus _ #:install-suspendable-ports? _ #:drain? _)
     85:4 17 (%run-fibers _ _ _ _)
In fibers/interrupts.scm:
     98:4 16 (with-interrupts/thread-cputime _ _ _ _)
In fibers/scheduler.scm:
   380:26 15 (run-scheduler #<scheduler 7ffff42e3620 (remote-peers: (7ffff42e3310))> _)
In ice-9/boot-9.scm:
  1778:15 14 (with-exception-handler #<procedure 7ffff4312e70 at ice-9/boot-9.scm:1882:7 (exn)> _ #:unwind? _ #:unwind-for-type _)
  1784:12 13 (with-exception-handler _ _ #:unwind? _ #:unwind-for-type _)
In fibers/scheduler.scm:
   344:10 12 (next-task)
In fibers.scm:
    179:8 11 (_)
In goblins/actor-lib/io.scm:
    60:10 10 (_)
    85:15  9 (_ _)
In ice-9/boot-9.scm:
  1784:12  8 (with-exception-handler _ _ #:unwind? _ #:unwind-for-type _)
In goblins/actor-lib/io.scm:
    70:18  7 (run-and-send)
In ice-9/control.scm:
    91:24  6 (call-with-escape-continuation _)
In goblins/contrib/syrup.scm:
    306:7  5 (read-next)
In ice-9/suspendable-ports.scm:
    558:2  4 (peek-char _)
   184:27  3 (fill-input #<input-output: file 53> _ _)
     72:4  2 (read-bytes #<input-output: file 53> #vu8(60 49 48 39 111 112 58 100 101 108 105 118 101 114 60 49 49 39 100 101 115 99 58 101 120 112 111 114 116 50 43 62 91 57 39 104 101 97 114 116 98 101 97 116 93 57 53 43 60 49 56 39 100 101 115 99 58 105 109 112 111 114 116 45 111 98 106 101 99 116 57 56 43 62 62 60 49 48 39 111 112 58 100 101 108 105 118 101 114 60 49 49 39 100 101 115 99 58 101 120 112 111 114 116 51 43 62 91 57 39 104 101 97 114 116 98 101 97 116 93 57 54 43 60 49 56 …) …)
In unknown file:
           1 (port-read #<input-output: file 53> #vu8(60 49 48 39 111 112 58 100 101 108 105 118 101 114 60 49 49 39 100 101 115 99 58 101 120 112 111 114 116 50 43 62 91 57 39 104 101 97 114 116 98 101 97 116 93 57 53 43 60 49 56 39 100 101 115 99 58 105 109 112 111 114 116 45 111 98 106 101 99 116 57 56 43 62 62 60 49 48 39 111 112 58 100 101 108 105 118 101 114 60 49 49 39 100 101 115 99 58 101 120 112 111 114 116 51 43 62 91 57 39 104 101 97 114 116 98 101 97 116 93 57 54 43 60 49 56 # …) …)
In ice-9/boot-9.scm:
  1705:22  0 (raise-exception _ #:continuable? _)

Uncaught exception in task:
In fibers.scm:
    179:8 12 (_)
In goblins/actor-lib/io.scm:
    60:10 11 (_)
    85:15 10 (_ _)
In ice-9/boot-9.scm:
  1784:12  9 (with-exception-handler _ _ #:unwind? _ #:unwind-for-type _)
In goblins/actor-lib/io.scm:
    70:18  8 (run-and-send)
In ice-9/control.scm:
    91:24  7 (call-with-escape-continuation _)
In goblins/contrib/syrup.scm:
    306:7  6 (read-next)
In ice-9/suspendable-ports.scm:
    558:2  5 (peek-char _)
   184:27  4 (fill-input #<input-output: file 53> _ _)
     72:4  3 (read-bytes #<input-output: file 53> #vu8(60 49 48 39 111 112 58 100 101 108 105 118 101 114 60 49 49 39 100 101 115 99 58 101 120 112 111 114 116 50 43 62 91 57 39 104 101 97 114 116 98 101 97 116 93 57 53 43 60 49 56 39 100 101 115 99 58 105 109 112 111 114 116 45 111 98 106 101 99 116 57 56 43 62 62 60 49 48 39 111 112 58 100 101 108 105 118 101 114 60 49 49 39 100 101 115 99 58 101 120 112 111 114 116 51 43 62 91 57 39 104 101 97 114 116 98 101 97 116 93 57 54 43 60 49 56 …) …)
In unknown file:
           2 (port-read #<input-output: file 53> #vu8(60 49 48 39 111 112 58 100 101 108 105 118 101 114 60 49 49 39 100 101 115 99 58 101 120 112 111 114 116 50 43 62 91 57 39 104 101 97 114 116 98 101 97 116 93 57 53 43 60 49 56 39 100 101 115 99 58 105 109 112 111 114 116 45 111 98 106 101 99 116 57 56 43 62 62 60 49 48 39 111 112 58 100 101 108 105 118 101 114 60 49 49 39 100 101 115 99 58 101 120 112 111 114 116 51 43 62 91 57 39 104 101 97 114 116 98 101 97 116 93 57 54 43 60 49 56 # …) …)
In ice-9/boot-9.scm:
  1706:22  1 (raise-exception _ #:continuable? _)
  1705:22  0 (raise-exception _ #:continuable? _)
ice-9/boot-9.scm:1705:22: In procedure raise-exception:
ERROR:
  1. &non-continuable
stop 2078: kill #<unspecified>, waitpid (2078 . 0)
14 passed, 1 failed
== pumphouse.scm
;;; compiling /tmp/guix-build-guile-automate-0.0.0-dev.drv-0/source/tests/pumphouse.scm
;;; compiled /tmp/guix-build-guile-automate-0.0.0-dev.drv-0/source/.cache/guile/ccache/3.0-LE-8-4.7/tmp/guix-build-guile-automate-0.0.0-dev.drv-0/source/tests/pumphouse.scm.go
http on port 34907
pumphouse listening on /tmp/guix-build-guile-automate-0.0.0-dev.drv-0/automate-tests-OBbrB1/automate-pumphouse-aij2P9/socket
admin: /tmp/guix-build-guile-automate-0.0.0-dev.drv-0/automate-tests-OBbrB1/automate-pumphouse-aij2P9/admin
remote admin: /tmp/guix-build-guile-automate-0.0.0-dev.drv-0/automate-tests-OBbrB1/automate-pumphouse-aij2P9/remote-admin
attached to the pumphouse of /tmp/guix-build-guile-automate-0.0.0-dev.drv-0/automate-tests-OBbrB1/automate-pumphouse-aij2P9/any

Goblins exception:
In message to #<local-object fulfilled-handler>:
  (((pipeline . tests/sum) (outcome . succeeded) (instance . "localhost")))
ice-9/boot-9.scm:1705:22: In procedure raise-exception:
ERROR:
  1. &automate-error:
      kind: invalid-request
      irritants: ("29f38c9721f70fc5" tests/sum)
  2. &message: "the run is of another pipeline"
  3. &irritants: ("29f38c9721f70fc5" tests/sum)
In goblins/core.scm:
   1074:7  3 (syscaller-$ _ #<local-object fulfilled-handler> (((pipeline . tests/sum) (outcome . succeeded) (instance . "localhost"))))
  2038:14  2 (_ . _)
In automate/model.scm:
    119:2  1 (raise-automate-error _ _ . _)
In ice-9/boot-9.scm:
  1705:22  0 (raise-exception _ #:continuable? _)

admin run: the run is of another pipeline: "29f38c9721f70fc5", tests/sum

Goblins exception:
In message to #<local-object ^pipeline-endpoint>:
  (run (run-request (id . "0858fb0949f4e1d2") (parameters) (cause . #f) (ancestors)))
ice-9/boot-9.scm:1705:22: In procedure raise-exception:
ERROR:
  1. &automate-error:
      kind: missing-parameter
      irritants: (n)
  2. &message: "run request lacks a parameter"
  3. &irritants: (n)
In goblins/core.scm:
   1074:7  4 (syscaller-$ _ #<local-object ^pipeline-endpoint> _)
In automate/pipeline/daemon.scm:
    507:7  3 (run (run-request (id . "0858fb0949f4e1d2") (parameters) (cause . #f) (ancestors)))
In srfi/srfi-1.scm:
    750:9  2 (for-each #<procedure 7fffe8e0fa20 at automate/pipeline.scm:1181:12 (entry)> ((param (name n))))
In automate/model.scm:
    119:2  1 (raise-automate-error _ _ . _)
In ice-9/boot-9.scm:
  1705:22  0 (raise-exception _ #:continuable? _)

tests/sum run: run request lacks a parameter: n

Goblins exception:
In message to #<local-object broken-handler>:
  (#<&compound-exception components: (#<&automate-error kind: missing-parameter irritants: (n)> #<&message message: "run request lacks a parameter"> #<&irritants irritants: (n)>)>)
ice-9/boot-9.scm:1705:22: In procedure raise-exception:
In procedure string-append: Wrong type (expecting string): tests/sum
In goblins/core.scm:
   1074:7  4 (syscaller-$ _ #<local-object broken-handler> (#<&compound-exception components: (#<&automate-error kind: missing-parameter irritants: (n)> #<&message message: "run request lacks a parameter"> #<&irritants irritants: (n)>)>))
  2038:14  3 (_ . _)
In automate/pipeline/errors.scm:
   234:41  2 (_ _)
In unknown file:
           1 (string-append tests/sum " answered it")
In ice-9/boot-9.scm:
  1705:22  0 (raise-exception _ #:continuable? _)

admin run: #<&compound-exception components: (#<&mystery-exception> #<&message message: "Unknown error occurred with remote object"> #<&irritants irritants: ()>)>

Goblins exception:
In message to #<local-object ^call-with-vat>:
ice-9/boot-9.scm:1705:22: In procedure raise-exception:
ERROR:
  1. &automate-error:
      kind: no-unix-socket
      irritants: ("/tmp/guix-build-guile-automate-0.0.0-dev.drv-0/automate-tests-OBbrB1/automate-pumphouse-aij2P9/no-socket")
  2. &message: "no pumphouse socket here; --unix-socket names another"
  3. &irritants: ("/tmp/guix-build-guile-automate-0.0.0-dev.drv-0/automate-tests-OBbrB1/automate-pumphouse-aij2P9/no-socket")
In goblins/core.scm:
   1074:7  4 (syscaller-$ _ #<local-object ^call-with-vat> ())
In unknown file:
           3 (_ #<procedure list _>)
In automate/pumphouse/client.scm:
    168:7  2 (spawn-pumphouse-netlayer _ "/tmp/guix-build-guile-automate-0.0.0-dev.drv-0/automate-tests-OBbrB1/automate-pumphouse-aij2P9/no-socket")
In automate/model.scm:
    119:2  1 (raise-automate-error _ _ . _)
In ice-9/boot-9.scm:
  1705:22  0 (raise-exception _ #:continuable? _)

2026-10-15 12:24:08 INFO: dropping a connection that failed to hand shake: #<&compound-exception components: (#<&error> #<&irritants irritants: (#<gnutls-error-enum Error in the pull function.> handshake)> #<&exception-with-kind-and-args kind: gnutls-error args: (#<gnutls-error-enum Error in the pull function.> handshake)>)>
2026-10-15 12:24:08 INFO: dropping a connection that failed to hand shake: #<&compound-exception components: (#<&external-error> #<&origin origin: "fport_write"> #<&message message: "~A"> #<&irritants irritants: ("Broken pipe")> #<&exception-with-kind-and-args kind: system-error args: ("fport_write" "~A" ("Broken pipe") (32))>)>
2026-10-15 12:24:09 INFO: dropping a connection that failed to hand shake: #<&compound-exception components: (#<&error> #<&irritants irritants: (#<gnutls-error-enum Error in the pull function.> handshake)> #<&exception-with-kind-and-args kind: gnutls-error args: (#<gnutls-error-enum Error in the pull function.> handshake)>)>

Goblins exception:
In message to #<local-object ^scoped-registrar>:
  (register tests/nap "localhost" "/tmp/guix-build-guile-automate-0.0.0-dev.drv-0/automate-tests-OBbrB1/automate-def-7gjSd4" (structure (version 3) (name tests/nap) (steps ((step (name nap) (label #f) (group #f) (timeout #f) (error-permitted #f) (outputs (value)) (inputs ())))) (resources ()) (params ()) (outputs ()) (web-ui-options ())) #<remote-object> "ocapn://4jetbem7vc4wqeikfw2u7vcue2urbwqkm6uov5gm6622nbbgamtq.tcp-tls/s/EROu4UycwAxH7h1V7da-8lbp2XBhSyAJW7PcGnjT2r4?" ())
ice-9/boot-9.scm:1705:22: In procedure raise-exception:
ERROR:
  1. &automate-error:
      kind: not-permitted
      irritants: (tests/nap (tests/only tests/scoped/))
  2. &message: "this registration does not cover the pipeline"
  3. &irritants: (tests/nap (tests/only tests/scoped/))
In goblins/core.scm:
   1074:7  3 (syscaller-$ _ #<local-object ^scoped-registrar> (register tests/nap "localhost" "/tmp/guix-build-guile-automate-0.0.0-dev.drv-0/automate-tests-OBbrB1/automate-def-7gjSd4" (structure (version 3) (name tests/nap) (steps ((step (name nap) (label #f) (group #f) (timeout #f) (error-permitted #f) (outputs (value)) (inputs ())))) (resources ()) (params ()) (outputs ()) (web-ui-options ())) #<remote-object> "ocapn://4jetbem7vc4wqeikfw2u7vcue2urbwqkm6uov5gm6622nbbgamtq.tcp-tls/s/EROu…" …))
In automate/pumphouse.scm:
    607:6  2 (register tests/nap "localhost" "/tmp/guix-build-guile-automate-0.0.0-dev.drv-0/automate-tests-OBbrB1/automate-def-7gjSd4" (structure (version 3) (name tests/nap) (steps ((step (name nap) (label #f) (group #f) (timeout #f) (error-permitted #f) (outputs (value)) (inputs ())))) (resources ()) (params ()) (outputs ()) (web-ui-options ())) #<remote-object> "ocapn://4jetbem7vc4wqeikfw2u7vcue2urbwqkm6uov5gm6622nbbgamtq.tcp-tls/s/EROu4UycwAxH7h1V7da-8lbp2XBhSyAJW7PcGnjT2r4?" ())
In automate/model.scm:
    119:2  1 (raise-automate-error _ _ . _)
In ice-9/boot-9.scm:
  1705:22  0 (raise-exception _ #:continuable? _)

pumphouse refused tests/nap: Unknown error occurred with remote object
attached to the pumphouse

Goblins exception:
In message to #<local-object ^admin>:
  (revoke (tests/nowhere) #f)
ice-9/boot-9.scm:1705:22: In procedure raise-exception:
ERROR:
  1. &automate-error:
      kind: no-registration
      irritants: ((tests/nowhere) #f)
  2. &message: "no registration of this scope"
  3. &irritants: ((tests/nowhere) #f)
In goblins/core.scm:
   1074:7  2 (syscaller-$ _ #<local-object ^admin> (revoke (tests/nowhere) #f))
In automate/model.scm:
    119:2  1 (raise-automate-error _ _ . _)
In ice-9/boot-9.scm:
  1705:22  0 (raise-exception _ #:continuable? _)

admin revoke: no registration of this scope: (tests/nowhere), #f

Goblins exception:
In message to #<local-object fulfilled-handler>:
  (#t)
ice-9/boot-9.scm:1705:22: In procedure raise-exception:
ERROR:
  1. &automate-error:
      kind: not-attached
      irritants: (tests/nowhere #f)
  2. &message: "no pipeline process serving the pipeline's definition is attached"
  3. &irritants: (tests/nowhere #f)
In goblins/core.scm:
   1074:7  3 (syscaller-$ _ #<local-object fulfilled-handler> (#t))
  2038:14  2 (_ . _)
In automate/model.scm:
    119:2  1 (raise-automate-error _ _ . _)
In ice-9/boot-9.scm:
  1705:22  0 (raise-exception _ #:continuable? _)

admin run: no pipeline process serving the pipeline's definition is attached: tests/nowhere, #f
2026-10-15 12:24:15 (with-exception-handler) INFO: POST /output/71b2f90907a86c46/chatty 200 5ms
2026-10-15 12:24:17 (with-exception-handler) INFO: POST /output/bd5989e86f53bbd0/chatty 200 3ms
run bd5989e86f53bbd0 reported to the pumphouse
run succeeded
  chatty: succeeded
2026-10-15 12:24:17 (with-exception-handler) INFO: GET /events/runs/c9d1294bd9d78123 200 45ms
2026-10-15 12:24:17 (with-exception-handler) INFO: GET /events/runs/nothing 404 1ms
2026-10-15 12:24:17 (with-exception-handler) INFO: GET /health 200 22ms
2026-10-15 12:24:17 (with-exception-handler) INFO: GET / 200 44ms
2026-10-15 12:24:17 (with-exception-handler) INFO: GET /runs/71b2f90907a86c46 200 7ms
2026-10-15 12:24:17 (with-exception-handler) INFO: GET /runs/71b2f90907a86c46/steps/chatty 200 17ms
GET /events/pumphouse: error replying to client
2026-10-15 12:24:18 (with-exception-handler) INFO: GET /events/pumphouse 200 incomplete
2026-10-15 12:24:19 (with-exception-handler) INFO: POST /output/7958221f484fc57c/after 200 6ms
2026-10-15 12:24:23 (with-exception-handler) INFO: POST /webhook 202 57ms
2026-10-15 12:24:23 (with-exception-handler) INFO: POST /webhook 202 5ms
2026-10-15 12:24:23 (with-exception-handler) INFO: POST /hooks/other 202 2ms
2026-10-15 12:24:23 (with-exception-handler) INFO: POST /hooks/other 403 0ms
2026-10-15 12:24:23 (with-exception-handler) INFO: POST /webhook 403 0ms

Goblins exception:
In message to #<local-object ^session>:
  (abort "e47381fd3cebc07d" "e47381fd3cebc07d" "aborted")
ice-9/boot-9.scm:1705:22: In procedure raise-exception:
ERROR:
  1. &automate-error:
      kind: not-permitted
      irritants: ("e47381fd3cebc07d")
  2. &message: "a run may not abort itself"
  3. &irritants: ("e47381fd3cebc07d")
In goblins/core.scm:
   1074:7  3 (syscaller-$ _ #<local-object ^session> (abort "e47381fd3cebc07d" "e47381fd3cebc07d" "aborted"))
In automate/pumphouse.scm:
    467:6  2 (abort "e47381fd3cebc07d" "e47381fd3cebc07d" "aborted")
In automate/model.scm:
    119:2  1 (raise-automate-error _ _ . _)
In ice-9/boot-9.scm:
  1705:22  0 (raise-exception _ #:continuable? _)

session tests/stopper on localhost abort: a run may not abort itself: "e47381fd3cebc07d"

Goblins exception:
In message to #<local-object ^session>:
  (abort "6aab702b541a4682" "6aab702b541a4682" "aborted")
ice-9/boot-9.scm:1705:22: In procedure raise-exception:
ERROR:
  1. &automate-error:
      kind: not-permitted
      irritants: ("6aab702b541a4682")
  2. &message: "a run may not abort itself"
  3. &irritants: ("6aab702b541a4682")
In goblins/core.scm:
   1074:7  3 (syscaller-$ _ #<local-object ^session> (abort "6aab702b541a4682" "6aab702b541a4682" "aborted"))
In automate/pumphouse.scm:
    467:6  2 (abort "6aab702b541a4682" "6aab702b541a4682" "aborted")
In automate/model.scm:
    119:2  1 (raise-automate-error _ _ . _)
In ice-9/boot-9.scm:
  1705:22  0 (raise-exception _ #:continuable? _)

session tests/stopper on localhost abort: a run may not abort itself: "6aab702b541a4682"
stop 2181: kill #<unspecified>, waitpid (2181 . 9)
stop 2144: kill #<unspecified>, waitpid (2144 . 9)
stop 2134: kill #<unspecified>, waitpid (2134 . 0)
135 passed, 0 failed
== reconnect.scm
;;; compiling /tmp/guix-build-guile-automate-0.0.0-dev.drv-0/source/tests/reconnect.scm
;;; compiled /tmp/guix-build-guile-automate-0.0.0-dev.drv-0/source/.cache/guile/ccache/3.0-LE-8-4.7/tmp/guix-build-guile-automate-0.0.0-dev.drv-0/source/tests/reconnect.scm.go
pumphouse refused tests/one: not-permitted
attached to the pumphouse
lost the pumphouse; reconnecting
attached to the pumphouse
attached to the pumphouse
lost the pumphouse; reconnecting
attached to the pumphouse
cannot reach the pumphouse; retrying every 0.1 seconds
cannot reach the pumphouse; retrying every 0.1 seconds
attached to the pumphouse
cannot reach the pumphouse; retrying every 1 seconds
not attached to the pumphouse for 1.5 seconds; giving up
warning: mutating the process environment while multiple threads are running;
         further behavior unspecified.
warning: mutating the process environment while multiple threads are running;
         further behavior unspecified.
Error in IO handling wrapped resour29 passed, 0 failed
ce #<input-output: socket 843>:
#<&compound-exception components: (#<&external-error> #<&origin origin: "fport_read"> #<&message message: "~A"> #<&irritants irritants: ("Connection reset by peer")> #<&exception-with-kind-and-args kind: system-error args: ("fport_read" "~A" ("Connection reset by peer") (104))>)>
== records.scm
;;
In ice-9/boot-9.scm:
;; compiling /tmp/guix-build-guile-automate-0.0.0-dev.drv-0/source/tests/records.scm
  1778:15 22 (with-exception-handler #<procedure 7ffff5785f30 at ice-9/boot-9.scm:1882:7 (exn)> _ #:unwind? _ #:unwind-for-type _)
In fibers.scm:
   164:13 21 (run-fibers _ #:hz _ #:scheduler _ #:parallelism _ #:cpus _ #:install-suspendable-ports? _ #:drain? _)
     85:4 20 (%run-fibers _ _ _ _)
In fibers/interrupts.scm:
     98:4 19 (with-interrupts/thread-cputime _ _ _ _)
In fibers/scheduler.scm:
   380:26 18 (run-scheduler #<scheduler 7ffff39b5ee0 (remote-peers: (7ffff39b5e70))> _)
In ice-9/boot-9.scm:
  1778:15 17 (with-exception-handler #<procedure 7ffff14a2360 at ice-9/boot-9.scm:1882:7 (exn)> _ #:unwind? _ #:unwind-for-type _)
  1784:12 16 (with-exception-handler _ _ #:unwind? _ #:unwind-for-type _)
In fibers/scheduler.scm:
   344:10 15 (next-task)
In fibers.scm:
    179:8 14 (_)
In goblins/actor-lib/io.scm:
    60:10 13 (_)
    85:15 12 (_ _)
In ice-9/boot-9.scm:
  1784:12 11 (with-exception-handler _ _ #:unwind? _ #:unwind-for-type _)
In goblins/actor-lib/io.scm:
    70:18 10 (run-and-send)
In ice-9/control.scm:
    91:24  9 (call-with-escape-continuation _)
In goblins/contrib/syrup.scm:
    306:7  8 (read-next)
In ice-9/suspendable-ports.scm:
    558:2  7 (peek-char _)
    159:2  6 (fill-input #<input-output: socket 843> _ _)
   124:14  5 (maybe-consume-bom #vu8(239 187 191))
    221:2  4 (peek-byte _)
   184:27  3 (fill-input #<input-output: socket 843> _ _)
     72:4  2 (read-bytes #<input-output: socket 843> #vu8(0) 0 1)
In unknown file:
           1 (port-read #<input-output: socket 843> #vu8(0) 0 1)
In ice-9/boot-9.scm:
  1705:22  0 (raise-exception _ #:continuable? _)

Uncaught exception in task:
In fibers.scm:
    179:8 15 (_)
In goblins/actor-lib/io.scm:
    60:10 14 (_)
    85:15 13 (_ _)
In ice-9/boot-9.scm:
  1784:12 12 (with-exception-handler _ _ #:unwind? _ #:unwind-for-type _)
In goblins/actor-lib/io.scm:
    70:18 11 (run-and-send)
In ice-9/control.scm:
    91:24 10 (call-with-escape-continuation _)
In goblins/contrib/syrup.scm:
    306:7  9 (read-next)
In ice-9/suspendable-ports.scm:
    558:2  8 (peek-char _)
    159:2  7 (fill-input #<input-output: socket 843> _ _)
   124:14  6 (maybe-consume-bom #vu8(239 187 191))
    221:2  5 (peek-byte _)
   184:27  4 (fill-input #<input-output: socket 843> _ _)
     72:4  3 (read-bytes #<input-output: socket 843> #vu8(0) 0 1)
In unknown file:
           2 (port-read #<input-output: socket 843> #vu8(0) 0 1)
In ice-9/boot-9.scm:
  1706:22  1 (raise-exception _ #:continuable? _)
  1705:22  0 (raise-exception _ #:continuable? _)
ice-9/boot-9.scm:1705:22: In procedure raise-exception:
ERROR:
  1. &non-continuable
;;; compiled /tmp/guix-build-guile-automate-0.0.0-dev.drv-0/source/.cache/guile/ccache/3.0-LE-8-4.7/tmp/guix-build-guile-automate-0.0.0-dev.drv-0/source/tests/records.scm.go

Goblins exception:
In message to #<local-object ^records>:
  (pipelines)
ice-9/boot-9.scm:1705:22: In procedure raise-exception:
ERROR:
  1. &automate-error:
      kind: records-closed
      irritants: (pipelines)
  2. &message: "the pumphouse's records are closed"
  3. &irritants: (pipelines)
In goblins/core.scm:
   1074:7  2 (syscaller-$ _ #<local-object ^records> (pipelines))
In automate/model.scm:
    119:2  1 (raise-automate-error _ _ . _)
In ice-9/boot-9.scm:
  1705:22  0 (raise-exception _ #:continuable? _)

207 passed, 0 failed
== relay.scm
;;; compiling /tmp/guix-build-guile-automate-0.0.0-dev.drv-0/source/tests/relay.scm
;;; compiled /tmp/guix-build-guile-automate-0.0.0-dev.drv-0/source/.cache/guile/ccache/3.0-LE-8-4.7/tmp/guix-build-guile-automate-0.0.0-dev.drv-0/source/tests/relay.scm.go

Goblins exception:
In message to #<local-object ^admin>:
  (repl relayed rollback start "other")
ice-9/boot-9.scm:1705:22: In procedure raise-exception:
ERROR:
  1. &automate-error:
      kind: already-armed
      irritants: (relayed rollback)
  2. &message: "a request for this step is armed already"
  3. &irritants: (relayed rollback)
In goblins/core.scm:
   1074:7  3 (syscaller-$ _ #<local-object ^admin> (repl relayed rollback start "other"))
In automate/pumphouse.scm:
    914:4  2 (arm-repl! #<<pumphouse> records: #<local-object ^records> lives: #<hash-table 7fffbfccd900 1/31> serving: #<hash-table 7fffbfccd8e0 1/31> owners: #<hash-table 7fffbfccd8c0 0/31> reporters: #<hash-table 7fffbfccd8a0 0/31> shared: #<hash-table 7fffbfccd820 0/31> gates: #<hash-table 7fffbfccd800 0/31> stopped: #<hash-table 7fffbfccd7e0 0/31> waiting: #<hash-table 7fffbfccd780 1/31> timers: #<hash-table 7fffbfccd760 0/31> tokens: #<hash-table 7fffbfccd740 0/31> registrations: #<ha…> …)
In automate/model.scm:
    119:2  1 (raise-automate-error _ _ . _)
In ice-9/boot-9.scm:
  1705:22  0 (raise-exception _ #:continuable? _)

stopped at the start of this step
resumed
15 passed, 0 failed
== repl.scm
;;; compiling /tmp/guix-build-guile-automate-0.0.0-dev.drv-0/source/tests/repl.scm
pipeline process gone: #<&compound-exception components: (#<&external-error> #<&origin origin: "connect"> #<&message message: "~A"> #<&irritants irritants: ("No such file or directory")> #<&exception-with-kind-and-args kind: system-error args: ("connect" "~A" ("No such file or directory") (2))>)>; exiting
In goblins/vat.scm:
    955:4  1 (call-with-vat #<vat id: 206 name: pipeline> #<procedure 7fffc6072e70 at automate/pipeline.scm:1135:10 ()>)
In ice-9/boot-9.scm:
  1705:22  0 (raise-exception _ #:continuable? _)
ice-9/boot-9.scm:1705:22: In procedure raise-exception:
vat is not running #<vat id: 206 name: pipeline>
;;; compiled /tmp/guix-build-guile-automate-0.0.0-dev.drv-0/source/.cache/guile/ccache/3.0-LE-8-4.7/tmp/guix-build-guile-automate-0.0.0-dev.drv-0/source/tests/repl.scm.go
stopped at the start of this step
resumed
stopped at the start of this step
resumed
17 passed, 0 failed
== run-query.scm
;;; compiling /tmp/guix-build-guile-automate-0.0.0-dev.drv-0/source/tests/run-query.scm
;;; compiled /tmp/guix-build-guile-automate-0.0.0-dev.drv-0/source/.cache/guile/ccache/3.0-LE-8-4.7/tmp/guix-build-guile-automate-0.0.0-dev.drv-0/source/tests/run-query.scm.go
33 passed, 0 failed
== scope.scm
;;; compiling /tmp/guix-build-guile-automate-0.0.0-dev.drv-0/source/tests/scope.scm
;;; compiled /tmp/guix-build-guile-automate-0.0.0-dev.drv-0/source/.cache/guile/ccache/3.0-LE-8-4.7/tmp/guix-build-guile-automate-0.0.0-dev.drv-0/source/tests/scope.scm.go
18 passed, 0 failed
== shepherd-bridge.scm
;;; compiling /tmp/guix-build-guile-automate-0.0.0-dev.drv-0/source/tests/shepherd-bridge.scm
;;; compiled /tmp/guix-build-guile-automate-0.0.0-dev.drv-0/source/.cache/guile/ccache/3.0-LE-8-4.7/tmp/guix-build-guile-automate-0.0.0-dev.drv-0/source/tests/shepherd-bridge.scm.go
shepherd client /tmp/guix-build-guile-automate-0.0.0-dev.drv-0/automate-tests-OBbrB1/automate-bridge-rjG7im/daemon: (status register unregister) on (web-daemon other-daemon)
shepherd client /tmp/guix-build-guile-automate-0.0.0-dev.drv-0/automate-tests-OBbrB1/automate-bridge-rjG7im/secrets/web: (status restart) on (nginx)
shepherd client /tmp/guix-build-guile-automate-0.0.0-dev.drv-0/automate-tests-OBbrB1/automate-bridge-rjG7im/all: (status start stop restart load) on (nginx postgres ghost)
shepherd bridge: listening on /tmp/guix-build-guile-automate-0.0.0-dev.drv-0/automate-tests-OBbrB1/automate-bridge-rjG7im/bridge.sock for the Shepherd at /tmp/guix-build-guile-automate-0.0.0-dev.drv-0/automate-tests-OBbrB1/automate-bridge-rjG7im/shepherd.sock
web: status nginx
web: restart nginx
web: shepherd: restart nginx

Goblins exception:
In message to #<local-object ^shepherd-client>:
  (stop nginx)
ice-9/boot-9.scm:1705:22: In procedure raise-exception:
ERROR:
  1. &automate-error:
      kind: not-permitted
      irritants: ("web" stop)
  2. &message: "this shepherd client does not offer that action"
  3. &irritants: ("web" stop)
In goblins/core.scm:
   1074:7  3 (syscaller-$ _ #<local-object ^shepherd-client> (stop nginx))
In automate/shepherd/bridge.scm:
    223:6  2 (stop nginx)
In automate/model.scm:
    119:2  1 (raise-automate-error _ _ . _)
In ice-9/boot-9.scm:
  1705:22  0 (raise-exception _ #:continuable? _)

shepherd client web stop: this shepherd client does not offer that action: "web", stop

Goblins exception:
In message to #<local-object ^shepherd-client>:
  (status postgres)
ice-9/boot-9.scm:1705:22: In procedure raise-exception:
ERROR:
  1. &automate-error:
      kind: not-permitted
      irritants: ("web" postgres)
  2. &message: "this shepherd client does not reach that service"
  3. &irritants: ("web" postgres)
all: status ghost
In goblins/core.scm:
   1074:7  3 (syscaller-$ _ #<local-object ^shepherd-client> (status postgres))
In automate/shepherd/bridge.scm:
    227:6  2 (status postgres)
In automate/model.scm:
    119:2  1 (raise-automate-error _ _ . _)
In ice-9/boot-9.scm:
  1705:22  0 (raise-exception _ #:continuable? _)

shepherd client web status: this shepherd client does not reach that service: "web", postgres

Goblins exception:
In message to #<local-object ^herd>:
  (action ghost status ())
ice-9/boot-9.scm:1705:22: In procedure raise-exception:
ERROR:
  1. &automate-error:
      kind: shepherd-error
      irritants: (ghost status (error (version 0) service-not-found ghost))
  2. &message: "the Shepherd has no service ghost"
  3. &irritants: (ghost status (error (version 0) service-not-found ghost))
In goblins/core.scm:
   1074:7  4 (syscaller-$ _ #<local-object ^herd> (action ghost status ()))
In automate/shepherd/bridge.scm:
   188:28  3 (action _ _ _)
In automate/shepherd/herd.scm:
   124:11  2 (herd-action _ _ _ _)
In automate/model.scm:
    119:2  1 (raise-automate-error _ _ . _)
In ice-9/boot-9.scm:
  1705:22  0 (raise-exception _ #:continuable? _)

shepherd client all status: the Shepherd has no service ghost: ghost, status, (error (version 0) service-not-found ghost)

Goblins exception:
In message to #<local-object ^shepherd-client>:
  (load "/tmp/guix-build-guile-automate-0.0.0-dev.drv-0/automate-tests-OBbrB1/automate-bridge-rjG7im/store/x.scm")
ice-9/boot-9.scm:1705:22: In procedure raise-exception:
ERROR:
  1. &automate-error:
      kind: not-permitted
      irritants: ("web")
  2. &message: "this shepherd client does not offer loading"
  3. &irritants: ("web")
In goblins/core.scm:
   1074:7  3 (syscaller-$ _ #<local-object ^shepherd-client> (load "/tmp/guix-build-guile-automate-0.0.0-dev.drv-0/automate-tests-OBbrB1/automate-bridge-rjG7im/store/x.scm"))
In automate/shepherd/bridge.scm:
    253:6  2 (load "/tmp/guix-build-guile-automate-0.0.0-dev.drv-0/automate-tests-OBbrB1/automate-bridge-rjG7im/store/x.scm")
In automate/model.scm:
    119:2  1 (raise-automate-error _ _ . _)
In ice-9/boot-9.scm:
  1705:22  0 (raise-exception _ #:continuable? _)

shepherd client web load: this shepherd client does not offer loading: "web"

Goblins exception:
In message to #<local-object ^shepherd-client>:
  (load "/etc/shepherd.scm")
ice-9/boot-9.scm:1705:22: In procedure raise-exception:
ERROR:
  1. &automate-error:
      kind: not-permitted
      irritants: ("/etc/shepherd.scm" "/tmp/guix-build-guile-automate-0.0.0-dev.drv-0/automate-tests-OBbrB1/automate-bridge-rjG7im/store")
  2. &message: "a shepherd client loads files in the store alone"
  3. &irritants: ("/etc/shepherd.scm" "/tmp/guix-build-guile-automate-0.0.0-dev.drv-0/automate-tests-OBbrB1/automate-bridge-rjG7im/store")
all: load root ("/tmp/guix-build-guile-automate-0.0.0-dev.drv-0/automate-tests-OBbrB1/automate-bridge-rjG7im/store/services.scm")
all: shepherd: loaded
daemon: load root ("/tmp/guix-build-guile-automate-0.0.0-dev.drv-0/automate-tests-OBbrB1/automate-bridge-rjG7im/services/web-daemon.scm")
daemon: shepherd: loaded
daemon: status web-daemon
daemon: start web-daemon
daemon: status web-daemon
daemon: status web-daemon
daemon: load root ("/tmp/guix-build-guile-automate-0.0.0-dev.drv-0/automate-tests-OBbrB1/automate-bridge-rjG7im/services/web-daemon.scm")
daemon: shepherd: loaded
daemon: status web-daemon
daemon: load root ("/tmp/guix-build-guile-automate-0.0.0-dev.drv-0/automate-tests-OBbrB1/automate-bridge-rjG7im/services/web-daemon.scm")
daemon: shepherd: loaded
daemon: status web-daemon
daemon: load root ("/tmp/guix-build-guile-automate-0.0.0-dev.drv-0/automate-tests-OBbrB1/automate-bridge-rjG7im/services/web-daemon.scm")
daemon: shepherd: loaded
daemon: status web-daemon
In goblins/core.scm:
   1074:7  3 (syscaller-$ _ #<local-object ^shepherd-client> (load "/etc/shepherd.scm"))
In automate/shepherd/bridge.scm:
    205:4  2 (load "/etc/shepherd.scm")
In automate/model.scm:
    119:2  1 (raise-automate-error _ _ . _)
In ice-9/boot-9.scm:
  1705:22  0 (raise-exception _ #:continuable? _)

shepherd client all load: a shepherd client loads files in the store alone: "/etc/shepherd.scm", "/tmp/guix-build-guile-automate-0.0.0-dev.drv-0/automate-tests-OBbrB1/automate-bridge-rjG7im/store"

Goblins exception:
In message to #<local-object ^shepherd-client>:
  (register nginx "/gnu/store/x" #f)
ice-9/boot-9.scm:1705:22: In procedure raise-exception:
ERROR:
  1. &automate-error:
      kind: not-permitted
      irritants: ("daemon" nginx)
  2. &message: "this shepherd client does not reach that service"
  3. &irritants: ("daemon" nginx)
In goblins/core.scm:
   1074:7  3 (syscaller-$ _ #<local-object ^shepherd-client> (register nginx "/gnu/store/x" #f))
In automate/shepherd/bridge.scm:
    227:6  2 (register nginx "/gnu/store/x" #f)
In automate/model.scm:
    119:2  1 (raise-automate-error _ _ . _)
In ice-9/boot-9.scm:
  1705:22  0 (raise-exception _ #:continuable? _)

shepherd client daemon register: this shepherd client does not reach that service: "daemon", nginx

Goblins exception:
In message to #<local-object ^shepherd-client>:
  (register web-daemon "/gnu/store/x" #f)
ice-9/boot-9.scm:1705:22: In procedure raise-exception:
ERROR:
  1. &automate-error:
      kind: not-permitted
      irritants: ("all" register)
  2. &message: "this shepherd client does not offer that action"
  3. &irritants: ("all" register)
daemon: unload root ("web-daemon")
In goblins/core.scm:
   1074:7  3 (syscaller-$ _ #<local-object ^shepherd-client> (register web-daemon "/gnu/store/x" #f))
In automate/shepherd/bridge.scm:
    223:6  2 (register web-daemon "/gnu/store/x" #f)
In automate/model.scm:
    119:2  1 (raise-automate-error _ _ . _)
In ice-9/boot-9.scm:
  1705:22  0 (raise-exception _ #:continuable? _)

shepherd client all register: this shepherd client does not offer that action: "all", register

Goblins exception:
In message to #<local-object ^shepherd-client>:
  (stop nginx)
ice-9/boot-9.scm:1705:22: In procedure raise-exception:
ERROR:
  1. &automate-error:
      kind: not-permitted
      irritants: ("web" stop)
  2. &message: "this shepherd client does not offer that action"
  3. &irritants: ("web" stop)
web: restart nginx
web: shepherd: restart nginx
web: status nginx
stopping
In goblins/core.scm:
   1074:7  3 (syscaller-$ _ #<local-object ^shepherd-client> (stop nginx))
In automate/shepherd/bridge.scm:
    223:6  2 (stop nginx)
In automate/model.scm:
    119:2  1 (raise-automate-error _ _ . _)
In ice-9/boot-9.scm:
  1705:22  0 (raise-exception _ #:continuable? _)

shepherd client web stop: this shepherd client does not offer that action: "web", stop
44 passed, 0 failed
== source.scm
;;; compiling /tmp/guix-build-guile-automate-0.0.0-dev.drv-0/source/tests/source.scm
;;; compiled /tmp/guix-build-guile-automate-0.0.0-dev.drv-0/source/.cache/guile/ccache/3.0-LE-8-4.7/tmp/guix-build-guile-automate-0.0.0-dev.drv-0/source/tests/source.scm.go
In execvp of git: No such file or directory
  git is not installed, so the resolving tests are skipped
20 passed, 0 failed
== step-scheduling.scm
;;; compiling /tmp/guix-build-guile-automate-0.0.0-dev.drv-0/source/tests/step-scheduling.scm
;;; compiled /tmp/guix-build-guile-automate-0.0.0-dev.drv-0/source/.cache/guile/ccache/3.0-LE-8-4.7/tmp/guix-build-guile-automate-0.0.0-dev.drv-0/source/tests/step-scheduling.scm.go
45 passed, 0 failed
== uploader.scm
;;; compiling /tmp/guix-build-guile-automate-0.0.0-dev.drv-0/source/tests/uploader.scm
;;; compiled /tmp/guix-build-guile-automate-0.0.0-dev.drv-0/source/.cache/guile/ccache/3.0-LE-8-4.7/tmp/guix-build-guile-automate-0.0.0-dev.drv-0/source/tests/uploader.scm.go
2026-10-15 12:24:51 (with-exception-handler) INFO: POST /output/run-1/build 200 1ms
2026-10-15 12:24:51 (with-exception-handler) INFO: POST /output/run-1/build 200 0ms
2026-10-15 12:24:52 (with-exception-handler) INFO: POST /output/run-2/zz-tail 200 3ms
2026-10-15 12:24:52 (with-exception-handler) INFO: POST /output/run-2/a-last 200 0ms
2026-10-15 12:24:52 (with-exception-handler) INFO: POST /output/run-3/timed 200 3ms
2026-10-15 12:24:52 (with-exception-handler) INFO: POST /output/run-3/untimed 200 0ms
2026-10-15 12:24:52 (with-exception-handler) INFO: POST /output/run-3/timed 200 1ms
15 passed, 0 failed
error: in phase 'check': uncaught exception:
%exception #<&invoke-error program: "guile" arguments: ("-L" "." "tests/run.scm") exit-status: 1 term-signal: #f stop-signal: #f> 
phase `check' failed after 255.1 seconds
sh: warning: setlocale: LC_ALL: cannot change locale (C.UTF-8): No such file or directory
command "guile" "-L" "." "tests/run.scm" failed with status 1
build process 4 exited with status 256
builder for `/gnu/store/26blv1dslzrfzk6k1mm3qfxm8zwbg6cx-guile-automate-0.0.0-dev.drv' failed with exit code 1
build of /gnu/store/26blv1dslzrfzk6k1mm3qfxm8zwbg6cx-guile-automate-0.0.0-dev.drv failed
Could not find build log for '/gnu/store/26blv1dslzrfzk6k1mm3qfxm8zwbg6cx-guile-automate-0.0.0-dev.drv'.
guix build: error: build of `/gnu/store/26blv1dslzrfzk6k1mm3qfxm8zwbg6cx-guile-automate-0.0.0-dev.drv' failed
error: the package did not build, or the channel has no package of that name; Guix's messages are in the step's log
  kind: build-failed
  irritants: "guile-automate" "/home/chris/pipeline-shepherd/state/work/automate-pipelines/automate-7Ldcck/automate-work-s15JIE/workspace/channel"
backtrace:
  automate/pipeline/step.scm:676:62 (_)
  automate/helpers/guix.scm:263:17 (build-channel-package)
  automate/helpers/guix.scm:228:6 (build-in-channel)