84c406a76dcf627f / check errored
- Started
- Duration
- 3m 15s
Defined at .automate/pipelines.scm:117
Making check in . make[1]: Entering directory '/home/chris/pipeline-shepherd/state/work/automate-pipelines/automate-tbdYWg/automate-work-OGHqtJ/workspace/source' make tests/support.go tests/pumphouse/support.go tests/attach.scm.go tests/authority.scm.go tests/check.scm.go tests/contain.scm.go tests/errors.scm.go tests/events.scm.go tests/files.scm.go tests/forgejo.scm.go tests/http.scm.go tests/layout.scm.go tests/masking.scm.go tests/metrics.scm.go tests/pages.scm.go tests/model.scm.go tests/output-marks.scm.go tests/notify.scm.go tests/pipeline.scm.go tests/pipeline-shepherd.scm.go tests/processes.scm.go tests/pumphouse.scm.go tests/pumphouse-draining.scm.go tests/pumphouse-lost.scm.go tests/pumphouse-replay.scm.go tests/pumphouse-restart.scm.go tests/pumphouse-shepherd.scm.go tests/pumphouse-stopping.scm.go tests/pumphouse-timers.scm.go tests/reconnect.scm.go tests/records.scm.go tests/relay.scm.go tests/run-query.scm.go tests/shepherd-bridge.scm.go tests/repl.scm.go tests/scope.scm.go tests/source.scm.go tests/step-scheduling.scm.go tests/uploader.scm.go make[2]: Entering directory '/home/chris/pipeline-shepherd/state/work/automate-pipelines/automate-tbdYWg/automate-work-OGHqtJ/workspace/source' ./pre-inst-env /gnu/store/wavrmrs065ikbava5mmvql3l8y4gp6ms-profile/bin/guild compile -W1 -Wunbound-variable -Warity-mismatch -Wformat -Wunused-module -Wshadowed-toplevel -o "tests/support.go" "tests/support.scm" ./pre-inst-env /gnu/store/wavrmrs065ikbava5mmvql3l8y4gp6ms-profile/bin/guild compile -W1 -Wunbound-variable -Warity-mismatch -Wformat -Wunused-module -Wshadowed-toplevel -o "tests/pumphouse/support.go" "tests/pumphouse/support.scm" ;;; note: auto-compilation is enabled, set GUILE_AUTO_COMPILE=0 ;;; or pass the --no-auto-compile argument to disable. ;;; compiling /gnu/store/wavrmrs065ikbava5mmvql3l8y4gp6ms-profile/bin/guild ;;; compiled /tmp/cache/guile/ccache/3.0-LE-8-4.7/gnu/store/k7vkw9x3wl3lni6a0i2w8xz2z8ylrqyz-guile-3.0.11/bin/guild.go wrote `tests/support.go' ;;; note: auto-compilation is enabled, set GUILE_AUTO_COMPILE=0 ;;; or pass the --no-auto-compile argument to disable. ;;; compiling /gnu/store/wavrmrs065ikbava5mmvql3l8y4gp6ms-profile/bin/guild ;;; compiled /tmp/cache/guile/ccache/3.0-LE-8-4.7/gnu/store/k7vkw9x3wl3lni6a0i2w8xz2z8ylrqyz-guile-3.0.11/bin/guild.go wrote `tests/pumphouse/support.go' ./pre-inst-env /gnu/store/wavrmrs065ikbava5mmvql3l8y4gp6ms-profile/bin/guild compile -O1 -W1 -Wunbound-variable -Warity-mismatch -Wformat -Wshadowed-toplevel -o "tests/attach.scm.go" "tests/attach.scm" ./pre-inst-env /gnu/store/wavrmrs065ikbava5mmvql3l8y4gp6ms-profile/bin/guild compile -O1 -W1 -Wunbound-variable -Warity-mismatch -Wformat -Wshadowed-toplevel -o "tests/authority.scm.go" "tests/authority.scm" wrote `tests/authority.scm.go' ./pre-inst-env /gnu/store/wavrmrs065ikbava5mmvql3l8y4gp6ms-profile/bin/guild compile -O1 -W1 -Wunbound-variable -Warity-mismatch -Wformat -Wshadowed-toplevel -o "tests/check.scm.go" "tests/check.scm" wrote `tests/attach.scm.go' ./pre-inst-env /gnu/store/wavrmrs065ikbava5mmvql3l8y4gp6ms-profile/bin/guild compile -O1 -W1 -Wunbound-variable -Warity-mismatch -Wformat -Wshadowed-toplevel -o "tests/contain.scm.go" "tests/contain.scm" wrote `tests/contain.scm.go' ./pre-inst-env /gnu/store/wavrmrs065ikbava5mmvql3l8y4gp6ms-profile/bin/guild compile -O1 -W1 -Wunbound-variable -Warity-mismatch -Wformat -Wshadowed-toplevel -o "tests/errors.scm.go" "tests/errors.scm" wrote `tests/errors.scm.go' ./pre-inst-env /gnu/store/wavrmrs065ikbava5mmvql3l8y4gp6ms-profile/bin/guild compile -O1 -W1 -Wunbound-variable -Warity-mismatch -Wformat -Wshadowed-toplevel -o "tests/events.scm.go" "tests/events.scm" wrote `tests/events.scm.go' ./pre-inst-env /gnu/store/wavrmrs065ikbava5mmvql3l8y4gp6ms-profile/bin/guild compile -O1 -W1 -Wunbound-variable -Warity-mismatch -Wformat -Wshadowed-toplevel -o "tests/files.scm.go" "tests/files.scm" wrote `tests/files.scm.go' ./pre-inst-env /gnu/store/wavrmrs065ikbava5mmvql3l8y4gp6ms-profile/bin/guild compile -O1 -W1 -Wunbound-variable -Warity-mismatch -Wformat -Wshadowed-toplevel -o "tests/forgejo.scm.go" "tests/forgejo.scm" wrote `tests/forgejo.scm.go' ./pre-inst-env /gnu/store/wavrmrs065ikbava5mmvql3l8y4gp6ms-profile/bin/guild compile -O1 -W1 -Wunbound-variable -Warity-mismatch -Wformat -Wshadowed-toplevel -o "tests/http.scm.go" "tests/http.scm" wrote `tests/check.scm.go' wrote `tests/http.scm.go' ./pre-inst-env /gnu/store/wavrmrs065ikbava5mmvql3l8y4gp6ms-profile/bin/guild compile -O1 -W1 -Wunbound-variable -Warity-mismatch -Wformat -Wshadowed-toplevel -o "tests/layout.scm.go" "tests/layout.scm" ./pre-inst-env /gnu/store/wavrmrs065ikbava5mmvql3l8y4gp6ms-profile/bin/guild compile -O1 -W1 -Wunbound-variable -Warity-mismatch -Wformat -Wshadowed-toplevel -o "tests/masking.scm.go" "tests/masking.scm" wrote `tests/masking.scm.go' ./pre-inst-env /gnu/store/wavrmrs065ikbava5mmvql3l8y4gp6ms-profile/bin/guild compile -O1 -W1 -Wunbound-variable -Warity-mismatch -Wformat -Wshadowed-toplevel -o "tests/metrics.scm.go" "tests/metrics.scm" wrote `tests/layout.scm.go' ./pre-inst-env /gnu/store/wavrmrs065ikbava5mmvql3l8y4gp6ms-profile/bin/guild compile -O1 -W1 -Wunbound-variable -Warity-mismatch -Wformat -Wshadowed-toplevel -o "tests/pages.scm.go" "tests/pages.scm" wrote `tests/metrics.scm.go' ./pre-inst-env /gnu/store/wavrmrs065ikbava5mmvql3l8y4gp6ms-profile/bin/guild compile -O1 -W1 -Wunbound-variable -Warity-mismatch -Wformat -Wshadowed-toplevel -o "tests/model.scm.go" "tests/model.scm" wrote `tests/pages.scm.go' ./pre-inst-env /gnu/store/wavrmrs065ikbava5mmvql3l8y4gp6ms-profile/bin/guild compile -O1 -W1 -Wunbound-variable -Warity-mismatch -Wformat -Wshadowed-toplevel -o "tests/output-marks.scm.go" "tests/output-marks.scm" wrote `tests/model.scm.go' ./pre-inst-env /gnu/store/wavrmrs065ikbava5mmvql3l8y4gp6ms-profile/bin/guild compile -O1 -W1 -Wunbound-variable -Warity-mismatch -Wformat -Wshadowed-toplevel -o "tests/notify.scm.go" "tests/notify.scm" wrote `tests/output-marks.scm.go' ./pre-inst-env /gnu/store/wavrmrs065ikbava5mmvql3l8y4gp6ms-profile/bin/guild compile -O1 -W1 -Wunbound-variable -Warity-mismatch -Wformat -Wshadowed-toplevel -o "tests/pipeline.scm.go" "tests/pipeline.scm" wrote `tests/notify.scm.go' ./pre-inst-env /gnu/store/wavrmrs065ikbava5mmvql3l8y4gp6ms-profile/bin/guild compile -O1 -W1 -Wunbound-variable -Warity-mismatch -Wformat -Wshadowed-toplevel -o "tests/pipeline-shepherd.scm.go" "tests/pipeline-shepherd.scm" wrote `tests/pipeline-shepherd.scm.go' ./pre-inst-env /gnu/store/wavrmrs065ikbava5mmvql3l8y4gp6ms-profile/bin/guild compile -O1 -W1 -Wunbound-variable -Warity-mismatch -Wformat -Wshadowed-toplevel -o "tests/processes.scm.go" "tests/processes.scm" wrote `tests/processes.scm.go' ./pre-inst-env /gnu/store/wavrmrs065ikbava5mmvql3l8y4gp6ms-profile/bin/guild compile -O1 -W1 -Wunbound-variable -Warity-mismatch -Wformat -Wshadowed-toplevel -o "tests/pumphouse.scm.go" "tests/pumphouse.scm" wrote `tests/pipeline.scm.go' ./pre-inst-env /gnu/store/wavrmrs065ikbava5mmvql3l8y4gp6ms-profile/bin/guild compile -O1 -W1 -Wunbound-variable -Warity-mismatch -Wformat -Wshadowed-toplevel -o "tests/pumphouse-draining.scm.go" "tests/pumphouse-draining.scm" wrote `tests/pumphouse.scm.go' ./pre-inst-env /gnu/store/wavrmrs065ikbava5mmvql3l8y4gp6ms-profile/bin/guild compile -O1 -W1 -Wunbound-variable -Warity-mismatch -Wformat -Wshadowed-toplevel -o "tests/pumphouse-lost.scm.go" "tests/pumphouse-lost.scm" wrote `tests/pumphouse-draining.scm.go' ./pre-inst-env /gnu/store/wavrmrs065ikbava5mmvql3l8y4gp6ms-profile/bin/guild compile -O1 -W1 -Wunbound-variable -Warity-mismatch -Wformat -Wshadowed-toplevel -o "tests/pumphouse-replay.scm.go" "tests/pumphouse-replay.scm" wrote `tests/pumphouse-lost.scm.go' ./pre-inst-env /gnu/store/wavrmrs065ikbava5mmvql3l8y4gp6ms-profile/bin/guild compile -O1 -W1 -Wunbound-variable -Warity-mismatch -Wformat -Wshadowed-toplevel -o "tests/pumphouse-restart.scm.go" "tests/pumphouse-restart.scm" wrote `tests/pumphouse-replay.scm.go' ./pre-inst-env /gnu/store/wavrmrs065ikbava5mmvql3l8y4gp6ms-profile/bin/guild compile -O1 -W1 -Wunbound-variable -Warity-mismatch -Wformat -Wshadowed-toplevel -o "tests/pumphouse-shepherd.scm.go" "tests/pumphouse-shepherd.scm" wrote `tests/pumphouse-restart.scm.go' ./pre-inst-env /gnu/store/wavrmrs065ikbava5mmvql3l8y4gp6ms-profile/bin/guild compile -O1 -W1 -Wunbound-variable -Warity-mismatch -Wformat -Wshadowed-toplevel -o "tests/pumphouse-stopping.scm.go" "tests/pumphouse-stopping.scm" wrote `tests/pumphouse-shepherd.scm.go' ./pre-inst-env /gnu/store/wavrmrs065ikbava5mmvql3l8y4gp6ms-profile/bin/guild compile -O1 -W1 -Wunbound-variable -Warity-mismatch -Wformat -Wshadowed-toplevel -o "tests/pumphouse-timers.scm.go" "tests/pumphouse-timers.scm" wrote `tests/pumphouse-stopping.scm.go' ./pre-inst-env /gnu/store/wavrmrs065ikbava5mmvql3l8y4gp6ms-profile/bin/guild compile -O1 -W1 -Wunbound-variable -Warity-mismatch -Wformat -Wshadowed-toplevel -o "tests/reconnect.scm.go" "tests/reconnect.scm" wrote `tests/pumphouse-timers.scm.go' ./pre-inst-env /gnu/store/wavrmrs065ikbava5mmvql3l8y4gp6ms-profile/bin/guild compile -O1 -W1 -Wunbound-variable -Warity-mismatch -Wformat -Wshadowed-toplevel -o "tests/records.scm.go" "tests/records.scm" wrote `tests/reconnect.scm.go' ./pre-inst-env /gnu/store/wavrmrs065ikbava5mmvql3l8y4gp6ms-profile/bin/guild compile -O1 -W1 -Wunbound-variable -Warity-mismatch -Wformat -Wshadowed-toplevel -o "tests/relay.scm.go" "tests/relay.scm" wrote `tests/relay.scm.go' ./pre-inst-env /gnu/store/wavrmrs065ikbava5mmvql3l8y4gp6ms-profile/bin/guild compile -O1 -W1 -Wunbound-variable -Warity-mismatch -Wformat -Wshadowed-toplevel -o "tests/run-query.scm.go" "tests/run-query.scm" wrote `tests/records.scm.go' ./pre-inst-env /gnu/store/wavrmrs065ikbava5mmvql3l8y4gp6ms-profile/bin/guild compile -O1 -W1 -Wunbound-variable -Warity-mismatch -Wformat -Wshadowed-toplevel -o "tests/shepherd-bridge.scm.go" "tests/shepherd-bridge.scm" wrote `tests/run-query.scm.go' ./pre-inst-env /gnu/store/wavrmrs065ikbava5mmvql3l8y4gp6ms-profile/bin/guild compile -O1 -W1 -Wunbound-variable -Warity-mismatch -Wformat -Wshadowed-toplevel -o "tests/repl.scm.go" "tests/repl.scm" wrote `tests/repl.scm.go' ./pre-inst-env /gnu/store/wavrmrs065ikbava5mmvql3l8y4gp6ms-profile/bin/guild compile -O1 -W1 -Wunbound-variable -Warity-mismatch -Wformat -Wshadowed-toplevel -o "tests/scope.scm.go" "tests/scope.scm" wrote `tests/shepherd-bridge.scm.go' ./pre-inst-env /gnu/store/wavrmrs065ikbava5mmvql3l8y4gp6ms-profile/bin/guild compile -O1 -W1 -Wunbound-variable -Warity-mismatch -Wformat -Wshadowed-toplevel -o "tests/source.scm.go" "tests/source.scm" wrote `tests/scope.scm.go' ./pre-inst-env /gnu/store/wavrmrs065ikbava5mmvql3l8y4gp6ms-profile/bin/guild compile -O1 -W1 -Wunbound-variable -Warity-mismatch -Wformat -Wshadowed-toplevel -o "tests/step-scheduling.scm.go" "tests/step-scheduling.scm" wrote `tests/source.scm.go' ./pre-inst-env /gnu/store/wavrmrs065ikbava5mmvql3l8y4gp6ms-profile/bin/guild compile -O1 -W1 -Wunbound-variable -Warity-mismatch -Wformat -Wshadowed-toplevel -o "tests/uploader.scm.go" "tests/uploader.scm" wrote `tests/step-scheduling.scm.go' wrote `tests/uploader.scm.go' make[2]: Leaving directory '/home/chris/pipeline-shepherd/state/work/automate-pipelines/automate-tbdYWg/automate-work-OGHqtJ/workspace/source' make check-TESTS make[2]: Entering directory '/home/chris/pipeline-shepherd/state/work/automate-pipelines/automate-tbdYWg/automate-work-OGHqtJ/workspace/source' make[3]: Entering directory '/home/chris/pipeline-shepherd/state/work/automate-pipelines/automate-tbdYWg/automate-work-OGHqtJ/workspace/source' PASS: tests/authority.scm PASS: tests/check.scm PASS: tests/attach.scm PASS: tests/errors.scm PASS: tests/events.scm PASS: tests/files.scm PASS: tests/forgejo.scm PASS: tests/http.scm PASS: tests/layout.scm PASS: tests/masking.scm PASS: tests/metrics.scm PASS: tests/pages.scm PASS: tests/contain.scm PASS: tests/output-marks.scm PASS: tests/notify.scm PASS: tests/model.scm PASS: tests/pipeline-shepherd.scm PASS: tests/processes.scm PASS: tests/pipeline.scm PASS: tests/pumphouse-draining.scm FAIL: tests/pumphouse.scm PASS: tests/pumphouse-lost.scm PASS: tests/pumphouse-replay.scm PASS: tests/pumphouse-restart.scm PASS: tests/pumphouse-shepherd.scm PASS: tests/pumphouse-stopping.scm PASS: tests/pumphouse-timers.scm PASS: tests/records.scm PASS: tests/reconnect.scm PASS: tests/run-query.scm PASS: tests/relay.scm PASS: tests/repl.scm PASS: tests/scope.scm PASS: tests/source.scm PASS: tests/shepherd-bridge.scm PASS: tests/step-scheduling.scm PASS: tests/uploader.scm ================================================ guile-automate 0.0.0-dev: ./test-suite.log ================================================ # TOTAL: 37 # PASS: 36 # SKIP: 0 # XFAIL: 0 # FAIL: 1 # XPASS: 0 # ERROR: 0 System information (uname -a): Linux 6.18.13-gnu #1 SMP PREEMPT_DYNAMIC 1 x86_64 .. contents:: :depth: 2 FAIL: tests/pumphouse ===================== http on port 43455 pumphouse listening on /tmp/automate-tests-xhAoLj/automate-pumphouse-djL4Bo/socket admin: /tmp/automate-tests-xhAoLj/automate-pumphouse-djL4Bo/admin remote admin: /tmp/automate-tests-xhAoLj/automate-pumphouse-djL4Bo/remote-admin attached to the pumphouse of /tmp/automate-tests-xhAoLj/automate-pumphouse-djL4Bo/any Goblins exception: In message to #<local-object fulfilled-handler>: (((pipeline . tests/sum) (outcome . succeeded) (instance . "mago"))) ice-9/boot-9.scm:1705:22: In procedure raise-exception: ERROR: 1. &automate-error: kind: invalid-request irritants: ("1fd5e0a64be58b9f" tests/sum) 2. &message: "the run is of another pipeline" 3. &irritants: ("1fd5e0a64be58b9f" tests/sum) warning: mutating the process environment while multiple threads are running; further behavior unspecified. In goblins/core.scm: 1074:7 3 (syscaller-$ _ #<local-object fulfilled-handler> (((pipeline . tests/sum) (outcome . succeeded) (instance . "mago")))) 2038:14 2 (_ . _) In automate/model.scm: 119:2 1 (raise-automate-error _ _ . _) In ice-9/boot-9.scm: 1705:22 0 (raise-exception _ #:continuable? _) admin run: the run is of another pipeline: "1fd5e0a64be58b9f", tests/sum Goblins exception: In message to #<local-object ^pipeline-endpoint>: (run (run-request (id . "1a2175e64c839bd6") (parameters) (cause . #f) (ancestors))) ice-9/boot-9.scm:1705:22: In procedure raise-exception: ERROR: 1. &automate-error: kind: missing-parameter irritants: (n) 2. &message: "run request lacks a parameter" 3. &irritants: (n) warning: mutating the process environment while multiple threads are running; further behavior unspecified. In goblins/core.scm: 1074:7 4 (syscaller-$ _ #<local-object ^pipeline-endpoint> (run (run-request (id . "1a2175e64c839bd6") (parameters) (cause . #f) (ancestors)))) In automate/pipeline/daemon.scm: 491:7 3 (run (run-request (id . "1a2175e64c839bd6") (parameters) (cause . #f) (ancestors))) In srfi/srfi-1.scm: 750:9 2 (for-each #<procedure 7f4ffc4590a0 at automate/pipeline.scm:1103:12 (entry)> ((param (name n)))) In automate/model.scm: 119:2 1 (raise-automate-error _ _ . _) In ice-9/boot-9.scm: 1705:22 0 (raise-exception _ #:continuable? _) tests/sum run: run request lacks a parameter: n admin run: run request lacks a parameter: n Goblins exception: In message to #<local-object ^call-with-vat>: ice-9/boot-9.scm:1705:22: In procedure raise-exception: ERROR: 1. &automate-error: kind: no-unix-socket irritants: ("/tmp/automate-tests-xhAoLj/automate-pumphouse-djL4Bo/no-socket") 2. &message: "no pumphouse socket here; --unix-socket names another" 3. &irritants: ("/tmp/automate-tests-xhAoLj/automate-pumphouse-djL4Bo/no-socket") 2026-10-14 19:05:42 INFO: dropping a connection that failed to hand shake: #<&compound-exception components: (#<&error> #<&irritants irritants: (#<gnutls-error-enum The TLS connection was non-properly terminated.> handshake)> #<&exception-with-kind-and-args kind: gnutls-error args: (#<gnutls-error-enum The TLS connection was non-properly terminated.> handshake)>)> 2026-10-14 19:05:42 INFO: dropping a connection that failed to hand shake: #<&compound-exception components: (#<&external-error> #<&origin origin: "fport_write"> #<&message message: "~A"> #<&irritants irritants: ("Broken pipe")> #<&exception-with-kind-and-args kind: system-error args: ("fport_write" "~A" ("Broken pipe") (32))>)> 2026-10-14 19:05:42 INFO: dropping a connection that failed to hand shake: #<&compound-exception components: (#<&error> #<&irritants irritants: (#<gnutls-error-enum The TLS connection was non-properly terminated.> handshake)> #<&exception-with-kind-and-args kind: gnutls-error args: (#<gnutls-error-enum The TLS connection was non-properly terminated.> handshake)>)> Goblins exception: In message to #<local-object ^scoped-registrar>: (register tests/nap "mago" "/tmp/automate-tests-xhAoLj/automate-def-2cuPxN" (structure (version 3) (name tests/nap) (steps ((step (name nap) (label #f) (group #f) (timeout #f) (error-permitted #f) (outputs (value)) (inputs ())))) (resources ()) (params ()) (outputs ()) (web-ui-options ())) #<remote-object> "ocapn://3nxhzbbmsuv3xxhqie2olymsc4hkiyrcyyvfd4txxvyoytewrbrq.tcp-tls/s/q0xca9pXF743xqUJ4WBw0XJ7h_Ui3bGIIXdppsQGWBk?" ()) ice-9/boot-9.scm:1705:22: In procedure raise-exception: ERROR: 1. &automate-error: kind: not-permitted irritants: (tests/nap (tests/only tests/scoped/)) 2. &message: "this registration does not cover the pipeline" 3. &irritants: (tests/nap (tests/only tests/scoped/)) In goblins/core.scm: 1074:7 3 (syscaller-$ _ #<local-object ^scoped-registrar> (register tests/nap "mago" "/tmp/automate-tests-xhAoLj/automate-def-2cuPxN" (structure (version 3) (name tests/nap) (steps ((step (name nap) (label #f) (group #f) (timeout #f) (error-permitted #f) (outputs (value)) (inputs ())))) (resources ()) (params ()) (outputs ()) (web-ui-options ())) #<remote-object> "ocapn://3nxhzbbmsuv3xxhqie2olymsc4hkiyrcyyvfd4txxvyoytewrbrq.tcp-tls/s/q0xca9pXF743xqUJ4WBw0XJ7h_Ui3bGIIXdppsQGWBk?" ())) In automate/pumphouse.scm: 531:6 2 (register tests/nap "mago" "/tmp/automate-tests-xhAoLj/automate-def-2cuPxN" (structure (version 3) (name tests/nap) (steps ((step (name nap) (label #f) (group #f) (timeout #f) (error-permitted #f) (outputs (value)) (inputs ())))) (resources ()) (params ()) (outputs ()) (web-ui-options ())) #<remote-object> "ocapn://3nxhzbbmsuv3xxhqie2olymsc4hkiyrcyyvfd4txxvyoytewrbrq.tcp-tls/s/q0xca9pXF743xqUJ4WBw0XJ7h_Ui3bGIIXdppsQGWBk?" ()) In automate/model.scm: 119:2 1 (raise-automate-error _ _ . _) In ice-9/boot-9.scm: 1705:22 0 (raise-exception _ #:continuable? _) pumphouse refused tests/nap: Unknown error occurred with remote object attached to the pumphouse Goblins exception: In message to #<local-object ^admin>: (revoke (tests/nowhere) #f) ice-9/boot-9.scm:1705:22: In procedure raise-exception: ERROR: 1. &automate-error: kind: no-registration irritants: ((tests/nowhere) #f) 2. &message: "no registration of this scope" 3. &irritants: ((tests/nowhere) #f) In goblins/core.scm: 1074:7 2 (syscaller-$ _ #<local-object ^admin> (revoke (tests/nowhere) #f)) In automate/model.scm: 119:2 1 (raise-automate-error _ _ . _) In ice-9/boot-9.scm: 1705:22 0 (raise-exception _ #:continuable? _) admin revoke: no registration of this scope: (tests/nowhere), #f Goblins exception: In message to #<local-object fulfilled-handler>: (#f) ice-9/boot-9.scm:1705:22: In procedure raise-exception: ERROR: 1. &automate-error: kind: not-attached irritants: (tests/nowhere #f) 2. &message: "no pipeline process serving the pipeline's definition is attached" 3. &irritants: (tests/nowhere #f) In goblins/core.scm: 1074:7 3 (syscaller-$ _ #<local-object fulfilled-handler> (#f)) 2038:14 2 (_ . _) In automate/model.scm: 119:2 1 (raise-automate-error _ _ . _) In ice-9/boot-9.scm: 1705:22 0 (raise-exception _ #:continuable? _) admin run: no pipeline process serving the pipeline's definition is attached: tests/nowhere, #f 2026-10-14 19:05:49 (with-exception-handler) INFO: POST /output/1f71034bf51051c2/chatty 200 2ms 2026-10-14 19:05:52 (with-exception-handler) INFO: POST /output/963bd23c07086489/chatty 200 14ms run 963bd23c07086489 reported to the pumphouse run succeeded chatty: succeeded Error in IO handling wrapped resource #<input-output: file 99>: #<&compound-exception components: (#<&external-error> #<&origin origin: "fport_read"> #<&message message: "~A"> #<&irritants irritants: ("Connection reset by peer")> #<&exception-with-kind-and-args kind: system-error args: ("fport_read" "~A" ("Connection reset by peer") (104))>)> In ice-9/boot-9.scm: 1778:15 19 (with-exception-handler #<procedure 7f3841fe7f30 at ice-9/boot-9.scm:1882:7 (exn)> _ #:unwind? _ #:unwind-for-type _) In fibers.scm: 164:13 18 (run-fibers _ #:hz _ #:scheduler _ #:parallelism _ #:cpus _ #:install-suspendable-ports? _ #:drain? _) 85:4 17 (%run-fibers _ _ _ _) In fibers/interrupts.scm: 98:4 16 (with-interrupts/thread-cputime _ _ _ _) In fibers/scheduler.scm: 380:26 15 (run-scheduler #<scheduler 7f38413a6620 (remote-peers: (7f38413a6310))> _) In ice-9/boot-9.scm: 1778:15 14 (with-exception-handler #<procedure 7f38413d6150 at ice-9/boot-9.scm:1882:7 (exn)> _ #:unwind? _ #:unwind-for-type _) 1784:12 13 (with-exception-handler _ _ #:unwind? _ #:unwind-for-type _) In fibers/scheduler.scm: 344:10 12 (next-task) In fibers.scm: 179:8 11 (_) In goblins/actor-lib/io.scm: 60:10 10 (_) 85:15 9 (_ _) In ice-9/boot-9.scm: 1784:12 8 (with-exception-handler _ _ #:unwind? _ #:unwind-for-type _) In goblins/actor-lib/io.scm: 70:18 7 (run-and-send) In ice-9/control.scm: 91:24 6 (call-with-escape-continuation _) In goblins/contrib/syrup.scm: 306:7 5 (read-next) In ice-9/suspendable-ports.scm: 558:2 4 (peek-char _) 184:27 3 (fill-input #<input-output: file 99> _ _) 72:4 2 (read-bytes #<input-output: file 99> #vu8(60 49 48 39 111 112 58 100 101 108 105 118 101 114 60 49 49 39 100 101 115 99 58 101 120 112 111 114 116 50 43 62 91 53 39 101 118 101 110 116 49 54 34 57 54 51 98 100 50 51 99 48 55 48 56 54 52 56 57 54 43 91 54 39 101 120 105 116 101 100 54 39 99 104 97 116 116 121 48 43 93 93 49 49 43 60 49 56 39 100 101 115 99 58 105 109 112 111 114 116 45 111 98 106 101 99 116 49 50 43 62 62 60 49 48 39 111 112 58 100 101 108 105 118 101 114 60 49 …) …) In unknown file: 1 (port-read #<input-output: file 99> #vu8(60 49 48 39 111 112 58 100 101 108 105 118 101 114 60 49 49 39 100 101 115 99 58 101 120 112 111 114 116 50 43 62 91 53 39 101 118 101 110 116 49 54 34 57 54 51 98 100 50 51 99 48 55 48 56 54 52 56 57 54 43 91 54 39 101 120 105 116 101 100 54 39 99 104 97 116 116 121 48 43 93 93 49 49 43 60 49 56 39 100 101 115 99 58 105 109 112 111 114 116 45 111 98 106 101 99 116 49 50 43 62 62 60 49 48 39 111 112 58 100 101 108 105 118 101 114 60 49 …) …) In ice-9/boot-9.scm: 1705:22 0 (raise-exception _ #:continuable? _) Uncaught exception in task: In fibers.scm: 179:8 12 (_) In goblins/actor-lib/io.scm: 60:10 11 (_) 85:15 10 (_ _) In ice-9/boot-9.scm: 1784:12 9 (with-exception-handler _ _ #:unwind? _ #:unwind-for-type _) In goblins/actor-lib/io.scm: 70:18 8 (run-and-send) In ice-9/control.scm: 91:24 7 (call-with-escape-continuation _) In goblins/contrib/syrup.scm: 306:7 6 (read-next) In ice-9/suspendable-ports.scm: 558:2 5 (peek-char _) 184:27 4 (fill-input #<input-output: file 99> _ _) 72:4 3 (read-bytes #<input-output: file 99> #vu8(60 49 48 39 111 112 58 100 101 108 105 118 101 114 60 49 49 39 100 101 115 99 58 101 120 112 111 114 116 50 43 62 91 53 39 101 118 101 110 116 49 54 34 57 54 51 98 100 50 51 99 48 55 48 56 54 52 56 57 54 43 91 54 39 101 120 105 116 101 100 54 39 99 104 97 116 116 121 48 43 93 93 49 49 43 60 49 56 39 100 101 115 99 58 105 109 112 111 114 116 45 111 98 106 101 99 116 49 50 43 62 62 60 49 48 39 111 112 58 100 101 108 105 118 101 114 60 49 …) …) In unknown file: 2 (port-read #<input-output: file 99> #vu8(60 49 48 39 111 112 58 100 101 108 105 118 101 114 60 49 49 39 100 101 115 99 58 101 120 112 111 114 116 50 43 62 91 53 39 101 118 101 110 116 49 54 34 57 54 51 98 100 50 51 99 48 55 48 56 54 52 56 57 54 43 91 54 39 101 120 105 116 101 100 54 39 99 104 97 116 116 121 48 43 93 93 49 49 43 60 49 56 39 100 101 115 99 58 105 109 112 111 114 116 45 111 98 106 101 99 116 49 50 43 62 62 60 49 48 39 111 112 58 100 101 108 105 118 101 114 60 49 …) …) In ice-9/boot-9.scm: 1706:22 1 (raise-exception _ #:continuable? _) 1705:22 0 (raise-exception _ #:continuable? _) ice-9/boot-9.scm:1705:22: In procedure raise-exception: ERROR: 1. &non-continuable Error in IO handling wrapped resource #<input-output: file 99>: #<&compound-exception components: (#<&external-error> #<&origin origin: "fport_write"> #<&message message: "~A"> #<&irritants irritants: ("Broken pipe")> #<&exception-with-kind-and-args kind: system-error args: ("fport_write" "~A" ("Broken pipe") (32))>)> In ice-9/boot-9.scm: 1778:15 15 (with-exception-handler #<procedure 7f3841fe7f30 at ice-9/boot-9.scm:1882:7 (exn)> _ #:unwind? _ #:unwind-for-type _) In fibers.scm: 164:13 14 (run-fibers _ #:hz _ #:scheduler _ #:parallelism _ #:cpus _ #:install-suspendable-ports? _ #:drain? _) 85:4 13 (%run-fibers _ _ _ _) In fibers/interrupts.scm: 98:4 12 (with-interrupts/thread-cputime _ _ _ _) In fibers/scheduler.scm: 380:26 11 (run-scheduler #<scheduler 7f38413a6620 (remote-peers: (7f38413a6310))> _) In ice-9/boot-9.scm: 1778:15 10 (with-exception-handler #<procedure 7f384096cb10 at ice-9/boot-9.scm:1882:7 (exn)> _ #:unwind? _ #:unwind-for-type _) 1784:12 9 (with-exception-handler _ _ #:unwind? _ #:unwind-for-type _) In fibers/scheduler.scm: 344:10 8 (next-task) In fibers.scm: 179:8 7 (_) In goblins/actor-lib/io.scm: 60:10 6 (_) 85:15 5 (_ _) In ice-9/boot-9.scm: 1784:12 4 (with-exception-handler _ _ #:unwind? _ #:unwind-for-type _) In goblins/actor-lib/io.scm: 70:18 3 (run-and-send) In ice-9/suspendable-ports.scm: 83:4 2 (write-bytes #<input-output: file 99> #vu8(60 49 51 39 111 112 58 103 99 45 101 120 112 111 114 116 115 91 57 43 93 91 49 43 93 62 111 114 116 49 51 43 62 91 55 39 102 117 108 102 105 108 108 50 39 111 107 93 102 102 62 39 117 114 108 50 53 34 104 116 116 112 58 47 47 91 58 58 49 93 58 52 51 52 53 53 47 111 117 116 112 117 116 62 60 52 39 112 97 105 114 53 39 116 111 107 101 110 51 50 34 53 57 102 51 100 57 100 48 55 102 53 55 53 99 49 102 54 49 53 101 98 99 51 99 55 54 57 97 …) …) In unknown file: 1 (port-write #<input-output: file 99> #vu8(60 49 51 39 111 112 58 103 99 45 101 120 112 111 114 116 115 91 57 43 93 91 49 43 93 62 111 114 116 49 51 43 62 91 55 39 102 117 108 102 105 108 108 50 39 111 107 93 102 102 62 39 117 114 108 50 53 34 104 116 116 112 58 47 47 91 58 58 49 93 58 52 51 52 53 53 47 111 117 116 112 117 116 62 60 52 39 112 97 105 114 53 39 116 111 107 101 110 51 50 34 53 57 102 51 100 57 100 48 55 102 53 55 53 99 49 102 54 49 53 101 98 99 51 99 55 54 57 97 # …) …) In ice-9/boot-9.scm: 1705:22 0 (raise-exception _ #:continuable? _) Uncaught exception in task: In fibers.scm: 179:8 8 (_) In goblins/actor-lib/io.scm: 60:10 7 (_) 85:15 6 (_ _) In ice-9/boot-9.scm: 1784:12 5 (with-exception-handler _ _ #:unwind? _ #:unwind-for-type _) In goblins/actor-lib/io.scm: 70:18 4 (run-and-send) In ice-9/suspendable-ports.scm: 83:4 3 (write-bytes #<input-output: file 99> #vu8(60 49 51 39 111 112 58 103 99 45 101 120 112 111 114 116 115 91 57 43 93 91 49 43 93 62 111 114 116 49 51 43 62 91 55 39 102 117 108 102 105 108 108 50 39 111 107 93 102 102 62 39 117 114 108 50 53 34 104 116 116 112 58 47 47 91 58 58 49 93 58 52 51 52 53 53 47 111 117 116 112 117 116 62 60 52 39 112 97 105 114 53 39 116 111 107 101 110 51 50 34 53 57 102 51 100 57 100 48 55 102 53 55 53 99 49 102 54 49 53 101 98 99 51 99 55 54 57 97 …) …) In unknown file: 2 (port-write #<input-output: file 99> #vu8(60 49 51 39 111 112 58 103 99 45 101 120 112 111 114 116 115 91 57 43 93 91 49 43 93 62 111 114 116 49 51 43 62 91 55 39 102 117 108 102 105 108 108 50 39 111 107 93 102 102 62 39 117 114 108 50 53 34 104 116 116 112 58 47 47 91 58 58 49 93 58 52 51 52 53 53 47 111 117 116 112 117 116 62 60 52 39 112 97 105 114 53 39 116 111 107 101 110 51 50 34 53 57 102 51 100 57 100 48 55 102 53 55 53 99 49 102 54 49 53 101 98 99 51 99 55 54 57 97 # …) …) In ice-9/boot-9.scm: 1706:22 1 (raise-exception _ #:continuable? _) 1705:22 0 (raise-exception _ #:continuable? _) ice-9/boot-9.scm:1705:22: In procedure raise-exception: ERROR: 1. &non-continuable 2026-10-14 19:05:54 (with-exception-handler) INFO: GET /events/runs/b85e093cf2c0419c 200 186ms 2026-10-14 19:05:55 (with-exception-handler) INFO: GET /events/runs/nothing 404 1ms 2026-10-14 19:05:55 (with-exception-handler) INFO: GET /health 200 9ms 2026-10-14 19:05:55 (with-exception-handler) INFO: GET / 200 57ms 2026-10-14 19:05:55 (with-exception-handler) INFO: GET /runs/1f71034bf51051c2 200 6ms 2026-10-14 19:05:55 (with-exception-handler) INFO: GET /runs/1f71034bf51051c2/steps/chatty 200 4ms GET /events/pumphouse: error replying to client 2026-10-14 19:05:55 (with-exception-handler) INFO: GET /events/pumphouse 200 incomplete 2026-10-14 19:05:56 (with-exception-handler) INFO: POST /output/704359454cd91769/after 200 23ms lost the pumphouse; reconnecting attached to the pumphouse of /tmp/automate-tests-xhAoLj/automate-pumphouse-djL4Bo/any lost the pumphouse; reconnecting attached to the pumphouse of /tmp/automate-tests-xhAoLj/automate-pumphouse-djL4Bo/any 2026-10-14 19:06:05 (with-exception-handler) INFO: POST /output/c2e3fdce56b85464/look 200 53ms lost the pumphouse; reconnecting lost the pumphouse; reconnecting 2026-10-14 19:06:11 (with-exception-handler) INFO: POST /output/8cf25089324c8430/look 200 494ms Goblins exception: In message to #<local-object ^scoped-registrar>: (register tests/only "mago" "/tmp/automate-tests-xhAoLj/automate-def-5iL50Y" (structure (version 3) (name tests/only) (steps ((step (name quick) (label #f) (group #f) (timeout #f) (error-permitted #f) (outputs (value)) (inputs ())))) (resources ()) (params ()) (outputs ()) (web-ui-options ())) #<remote-object> "ocapn://bqlyvtlku3gymum5mouleg57bfz7k4hiuchsq3uts3e4kvwpcdta.tcp-tls/s/RFHraGrg2xNXeRxmtYIXNKxznUFwPJpngvFEzc4oHos?" ()) ice-9/boot-9.scm:1705:22: In procedure raise-exception: ERROR: 1. &automate-error: kind: revoked irritants: ((tests/only tests/scoped/)) 2. &message: "this registration was revoked" 3. &irritants: ((tests/only tests/scoped/)) In goblins/core.scm: 1074:7 3 (syscaller-$ _ #<local-object ^scoped-registrar> (register tests/only "mago" "/tmp/automate-tests-xhAoLj/automate-def-5iL50Y" (structure (version 3) (name tests/only) (steps ((step (name quick) (label #f) (group #f) (timeout #f) (error-permitted #f) (outputs (value)) (inputs ())))) (resources ()) (params ()) (outputs ()) (web-ui-options ())) #<remote-object> "ocapn://bqlyvtlku3gymum5mouleg57bfz7k4hiuchsq3uts3e4kvwpcdta.tcp-tls/s/RFHraGrg2xNXeRxmtYIXNKxznUFwPJpngvFEzc4oHos?" ())) In automate/pumphouse.scm: 529:6 2 (register tests/only "mago" "/tmp/automate-tests-xhAoLj/automate-def-5iL50Y" (structure (version 3) (name tests/only) (steps ((step (name quick) (label #f) (group #f) (timeout #f) (error-permitted #f) (outputs (value)) (inputs ())))) (resources ()) (params ()) (outputs ()) (web-ui-options ())) #<remote-object> "ocapn://bqlyvtlku3gymum5mouleg57bfz7k4hiuchsq3uts3e4kvwpcdta.tcp-tls/s/RFHraGrg2xNXeRxmtYIXNKxznUFwPJpngvFEzc4oHos?" ()) In automate/model.scm: 119:2 1 (raise-automate-error _ _ . _) In ice-9/boot-9.scm: 1705:22 0 (raise-exception _ #:continuable? _) pumphouse refused tests/only: Unknown error occurred with remote object Goblins exception: In message to #<local-object ^scoped-registrar>: (register tests/scoped/one "mago" "/tmp/automate-tests-xhAoLj/automate-def-BuZBXR" (structure (version 3) (name tests/scoped/one) (steps ((step (name quick) (label #f) (group #f) (timeout #f) (error-permitted #f) (outputs (value)) (inputs ())))) (resources ()) (params ()) (outputs ()) (web-ui-options ())) #<remote-object> "ocapn://bqlyvtlku3gymum5mouleg57bfz7k4hiuchsq3uts3e4kvwpcdta.tcp-tls/s/6kAXLMmtJVSeimhsXZsUmlq9F54SCWRWsSJlur3Q1r0?" ()) ice-9/boot-9.scm:1705:22: In procedure raise-exception: ERROR: 1. &automate-error: kind: revoked irritants: ((tests/only tests/scoped/)) 2. &message: "this registration was revoked" 3. &irritants: ((tests/only tests/scoped/)) In goblins/core.scm: 1074:7 3 (syscaller-$ _ #<local-object ^scoped-registrar> (register tests/scoped/one "mago" "/tmp/automate-tests-xhAoLj/automate-def-BuZBXR" (structure (version 3) (name tests/scoped/one) (steps ((step (name quick) (label #f) (group #f) (timeout #f) (error-permitted #f) (outputs (value)) (inputs ())))) (resources ()) (params ()) (outputs ()) (web-ui-options ())) #<remote-object> "ocapn://bqlyvtlku3gymum5mouleg57bfz7k4hiuchsq3uts3e4kvwpcdta.tcp-tls/s/6kAXLMmtJVSeimhsXZsUmlq9F54SCWRWsSJ…" …)) In automate/pumphouse.scm: 529:6 2 (register tests/scoped/one "mago" "/tmp/automate-tests-xhAoLj/automate-def-BuZBXR" (structure (version 3) (name tests/scoped/one) (steps ((step (name quick) (label #f) (group #f) (timeout #f) (error-permitted #f) (outputs (value)) (inputs ())))) (resources ()) (params ()) (outputs ()) (web-ui-options ())) #<remote-object> "ocapn://bqlyvtlku3gymum5mouleg57bfz7k4hiuchsq3uts3e4kvwpcdta.tcp-tls/s/6kAXLMmtJVSeimhsXZsUmlq9F54SCWRWsSJlur3Q1r0?" ()) In automate/model.scm: 119:2 1 (raise-automate-error _ _ . _) In ice-9/boot-9.scm: 1705:22 0 (raise-exception _ #:continuable? _) attached to the pumphouse of /tmp/automate-tests-xhAoLj/automate-pumphouse-djL4Bo/any pumphouse refused tests/scoped/one: Unknown error occurred with remote object Goblins exception: In message to #<local-object ^scoped-registrar>: (register tests/nap "mago" "/tmp/automate-tests-xhAoLj/automate-def-2cuPxN" (structure (version 3) (name tests/nap) (steps ((step (name nap) (label #f) (group #f) (timeout #f) (error-permitted #f) (outputs (value)) (inputs ())))) (resources ()) (params ()) (outputs ()) (web-ui-options ())) #<remote-object> "ocapn://bqlyvtlku3gymum5mouleg57bfz7k4hiuchsq3uts3e4kvwpcdta.tcp-tls/s/PvFT3R-xdLZ8HP6vGZwhd622Z4anZKJtmcX0swXAXpY?" ()) ice-9/boot-9.scm:1705:22: In procedure raise-exception: ERROR: 1. &automate-error: kind: revoked irritants: ((tests/only tests/scoped/)) 2. &message: "this registration was revoked" 3. &irritants: ((tests/only tests/scoped/)) In goblins/core.scm: 1074:7 3 (syscaller-$ _ #<local-object ^scoped-registrar> (register tests/nap "mago" "/tmp/automate-tests-xhAoLj/automate-def-2cuPxN" (structure (version 3) (name tests/nap) (steps ((step (name nap) (label #f) (group #f) (timeout #f) (error-permitted #f) (outputs (value)) (inputs ())))) (resources ()) (params ()) (outputs ()) (web-ui-options ())) #<remote-object> "ocapn://bqlyvtlku3gymum5mouleg57bfz7k4hiuchsq3uts3e4kvwpcdta.tcp-tls/s/PvFT3R-xdLZ8HP6vGZwhd622Z4anZKJtmcX0swXAXpY?" ())) In automate/pumphouse.scm: 529:6 2 (register tests/nap "mago" "/tmp/automate-tests-xhAoLj/automate-def-2cuPxN" (structure (version 3) (name tests/nap) (steps ((step (name nap) (label #f) (group #f) (timeout #f) (error-permitted #f) (outputs (value)) (inputs ())))) (resources ()) (params ()) (outputs ()) (web-ui-options ())) #<remote-object> "ocapn://bqlyvtlku3gymum5mouleg57bfz7k4hiuchsq3uts3e4kvwpcdta.tcp-tls/s/PvFT3R-xdLZ8HP6vGZwhd622Z4anZKJtmcX0swXAXpY?" ()) In automate/model.scm: 119:2 1 (raise-automate-error _ _ . _) In ice-9/boot-9.scm: 1705:22 0 (raise-exception _ #:continuable? _) pumphouse refused tests/nap: Unknown error occurred with remote object 2026-10-14 19:06:13 (with-exception-handler) INFO: POST /webhook 202 190ms 2026-10-14 19:06:13 (with-exception-handler) INFO: POST /output/8cf25089324c8430/change 200 59ms Goblins exception: In message to #<local-object ^scoped-registrar>: (register tests/only "mago" "/tmp/automate-tests-xhAoLj/automate-def-5iL50Y" (structure (version 3) (name tests/only) (steps ((step (name quick) (label #f) (group #f) (timeout #f) (error-permitted #f) (outputs (value)) (inputs ())))) (resources ()) (params ()) (outputs ()) (web-ui-options ())) #<remote-object> "ocapn://dfrbttbfz2try5iypewf7vi5q75hbktwshu2pyu3z4fbc3ljffuq.tcp-tls/s/_FvdKg4BfBjUm18pYGLYENG3kr7_LajPeWF4RUcvYcM?" ()) ice-9/boot-9.scm:1705:22: In procedure raise-exception: ERROR: 1. &automate-error: kind: revoked irritants: ((tests/only tests/scoped/)) 2. &message: "this registration was revoked" 3. &irritants: ((tests/only tests/scoped/)) In goblins/core.scm: 1074:7 3 (syscaller-$ _ #<local-object ^scoped-registrar> (register tests/only "mago" "/tmp/automate-tests-xhAoLj/automate-def-5iL50Y" (structure (version 3) (name tests/only) (steps ((step (name quick) (label #f) (group #f) (timeout #f) (error-permitted #f) (outputs (value)) (inputs ())))) (resources ()) (params ()) (outputs ()) (web-ui-options ())) #<remote-object> "ocapn://dfrbttbfz2try5iypewf7vi5q75hbktwshu2pyu3z4fbc3ljffuq.tcp-tls/s/_FvdKg4BfBjUm18pYGLYENG3kr7_LajPeWF4RUcvYcM?" ())) In automate/pumphouse.scm: 529:6 2 (register tests/only "mago" "/tmp/automate-tests-xhAoLj/automate-def-5iL50Y" (structure (version 3) (name tests/only) (steps ((step (name quick) (label #f) (group #f) (timeout #f) (error-permitted #f) (outputs (value)) (inputs ())))) (resources ()) (params ()) (outputs ()) (web-ui-options ())) #<remote-object> "ocapn://dfrbttbfz2try5iypewf7vi5q75hbktwshu2pyu3z4fbc3ljffuq.tcp-tls/s/_FvdKg4BfBjUm18pYGLYENG3kr7_LajPeWF4RUcvYcM?" ()) In automate/model.scm: 119:2 1 (raise-automate-error _ _ . _) In ice-9/boot-9.scm: 1705:22 0 (raise-exception _ #:continuable? _) pumphouse refused tests/only: Unknown error occurred with remote object Goblins exception: In message to #<local-object ^scoped-registrar>: (register tests/scoped/one "mago" "/tmp/automate-tests-xhAoLj/automate-def-BuZBXR" (structure (version 3) (name tests/scoped/one) (steps ((step (name quick) (label #f) (group #f) (timeout #f) (error-permitted #f) (outputs (value)) (inputs ())))) (resources ()) (params ()) (outputs ()) (web-ui-options ())) #<remote-object> "ocapn://dfrbttbfz2try5iypewf7vi5q75hbktwshu2pyu3z4fbc3ljffuq.tcp-tls/s/jGg6zJfuimxhiJtcbQpeLVMnCWX3qanG6mD1b12MeTg?" ()) ice-9/boot-9.scm:1705:22: In procedure raise-exception: ERROR: 1. &automate-error: kind: revoked irritants: ((tests/only tests/scoped/)) 2. &message: "this registration was revoked" 3. &irritants: ((tests/only tests/scoped/)) In goblins/core.scm: 1074:7 3 (syscaller-$ _ #<local-object ^scoped-registrar> (register tests/scoped/one "mago" "/tmp/automate-tests-xhAoLj/automate-def-BuZBXR" (structure (version 3) (name tests/scoped/one) (steps ((step (name quick) (label #f) (group #f) (timeout #f) (error-permitted #f) (outputs (value)) (inputs ())))) (resources ()) (params ()) (outputs ()) (web-ui-options ())) #<remote-object> "ocapn://dfrbttbfz2try5iypewf7vi5q75hbktwshu2pyu3z4fbc3ljffuq.tcp-tls/s/jGg6zJfuimxhiJtcbQpeLVMnCWX3qanG6mD…" …)) In automate/pumphouse.scm: 529:6 2 (register tests/scoped/one "mago" "/tmp/automate-tests-xhAoLj/automate-def-BuZBXR" (structure (version 3) (name tests/scoped/one) (steps ((step (name quick) (label #f) (group #f) (timeout #f) (error-permitted #f) (outputs (value)) (inputs ())))) (resources ()) (params ()) (outputs ()) (web-ui-options ())) #<remote-object> "ocapn://dfrbttbfz2try5iypewf7vi5q75hbktwshu2pyu3z4fbc3ljffuq.tcp-tls/s/jGg6zJfuimxhiJtcbQpeLVMnCWX3qanG6mD1b12MeTg?" ()) In automate/model.scm: 119:2 1 (raise-automate-error _ _ . _) In ice-9/boot-9.scm: 1705:22 0 (raise-exception _ #:continuable? _) lost the pumphouse; reconnecting pumphouse refused tests/scoped/one: Unknown error occurred with remote object Goblins exception: In message to #<local-object ^scoped-registrar>: (register tests/nap "mago" "/tmp/automate-tests-xhAoLj/automate-def-2cuPxN" (structure (version 3) (name tests/nap) (steps ((step (name nap) (label #f) (group #f) (timeout #f) (error-permitted #f) (outputs (value)) (inputs ())))) (resources ()) (params ()) (outputs ()) (web-ui-options ())) #<remote-object> "ocapn://dfrbttbfz2try5iypewf7vi5q75hbktwshu2pyu3z4fbc3ljffuq.tcp-tls/s/DGfq6ub0sMc6FCWWhYBzk5xi3jueM3dN2VwmRH16V4A?" ()) ice-9/boot-9.scm:1705:22: In procedure raise-exception: ERROR: 1. &automate-error: kind: revoked irritants: ((tests/only tests/scoped/)) 2. &message: "this registration was revoked" 3. &irritants: ((tests/only tests/scoped/)) In goblins/core.scm: 1074:7 3 (syscaller-$ _ #<local-object ^scoped-registrar> (register tests/nap "mago" "/tmp/automate-tests-xhAoLj/automate-def-2cuPxN" (structure (version 3) (name tests/nap) (steps ((step (name nap) (label #f) (group #f) (timeout #f) (error-permitted #f) (outputs (value)) (inputs ())))) (resources ()) (params ()) (outputs ()) (web-ui-options ())) #<remote-object> "ocapn://dfrbttbfz2try5iypewf7vi5q75hbktwshu2pyu3z4fbc3ljffuq.tcp-tls/s/DGfq6ub0sMc6FCWWhYBzk5xi3jueM3dN2VwmRH16V4A?" ())) In automate/pumphouse.scm: 529:6 2 (register tests/nap "mago" "/tmp/automate-tests-xhAoLj/automate-def-2cuPxN" (structure (version 3) (name tests/nap) (steps ((step (name nap) (label #f) (group #f) (timeout #f) (error-permitted #f) (outputs (value)) (inputs ())))) (resources ()) (params ()) (outputs ()) (web-ui-options ())) #<remote-object> "ocapn://dfrbttbfz2try5iypewf7vi5q75hbktwshu2pyu3z4fbc3ljffuq.tcp-tls/s/DGfq6ub0sMc6FCWWhYBzk5xi3jueM3dN2VwmRH16V4A?" ()) In automate/model.scm: 119:2 1 (raise-automate-error _ _ . _) In ice-9/boot-9.scm: 1705:22 0 (raise-exception _ #:continuable? _) pumphouse refused tests/nap: Unknown error occurred with remote object 2026-10-14 19:06:14 (with-exception-handler) INFO: POST /webhook 202 6ms 2026-10-14 19:06:14 (with-exception-handler) INFO: POST /hooks/other 202 122ms 2026-10-14 19:06:14 (with-exception-handler) INFO: POST /hooks/other 403 0ms 2026-10-14 19:06:14 (with-exception-handler) INFO: POST /webhook 403 0ms Goblins exception: In message to #<local-object ^scoped-registrar>: (register tests/only "mago" "/tmp/automate-tests-xhAoLj/automate-def-5iL50Y" (structure (version 3) (name tests/only) (steps ((step (name quick) (label #f) (group #f) (timeout #f) (error-permitted #f) (outputs (value)) (inputs ())))) (resources ()) (params ()) (outputs ()) (web-ui-options ())) #<remote-object> "ocapn://jus2o54cxlq7lup4vrruwayinedmjz7vwamwygifffwqoqohjcvq.tcp-tls/s/okrjy9MERa-ONwo8yF9EpPZI48ZxKNrD95TkjoBaLXM?" ()) ice-9/boot-9.scm:1705:22: In procedure raise-exception: ERROR: 1. &automate-error: kind: revoked irritants: ((tests/only tests/scoped/)) 2. &message: "this registration was revoked" 3. &irritants: ((tests/only tests/scoped/)) In goblins/core.scm: 1074:7 3 (syscaller-$ _ #<local-object ^scoped-registrar> (register tests/only "mago" "/tmp/automate-tests-xhAoLj/automate-def-5iL50Y" (structure (version 3) (name tests/only) (steps ((step (name quick) (label #f) (group #f) (timeout #f) (error-permitted #f) (outputs (value)) (inputs ())))) (resources ()) (params ()) (outputs ()) (web-ui-options ())) #<remote-object> "ocapn://jus2o54cxlq7lup4vrruwayinedmjz7vwamwygifffwqoqohjcvq.tcp-tls/s/okrjy9MERa-ONwo8yF9EpPZI48ZxKNrD95TkjoBaLXM?" ())) In automate/pumphouse.scm: 529:6 2 (register tests/only "mago" "/tmp/automate-tests-xhAoLj/automate-def-5iL50Y" (structure (version 3) (name tests/only) (steps ((step (name quick) (label #f) (group #f) (timeout #f) (error-permitted #f) (outputs (value)) (inputs ())))) (resources ()) (params ()) (outputs ()) (web-ui-options ())) #<remote-object> "ocapn://jus2o54cxlq7lup4vrruwayinedmjz7vwamwygifffwqoqohjcvq.tcp-tls/s/okrjy9MERa-ONwo8yF9EpPZI48ZxKNrD95TkjoBaLXM?" ()) In automate/model.scm: 119:2 1 (raise-automate-error _ _ . _) In ice-9/boot-9.scm: 1705:22 0 (raise-exception _ #:continuable? _) attached to the pumphouse of /tmp/automate-tests-xhAoLj/automate-pumphouse-djL4Bo/any pumphouse refused tests/only: Unknown error occurred with remote object Goblins exception: In message to #<local-object ^scoped-registrar>: (register tests/scoped/one "mago" "/tmp/automate-tests-xhAoLj/automate-def-BuZBXR" (structure (version 3) (name tests/scoped/one) (steps ((step (name quick) (label #f) (group #f) (timeout #f) (error-permitted #f) (outputs (value)) (inputs ())))) (resources ()) (params ()) (outputs ()) (web-ui-options ())) #<remote-object> "ocapn://jus2o54cxlq7lup4vrruwayinedmjz7vwamwygifffwqoqohjcvq.tcp-tls/s/A-OdkA0RO3L1UUVOwBqJhsq8GxvZXKBZODk7_ZqKAcc?" ()) ice-9/boot-9.scm:1705:22: In procedure raise-exception: ERROR: 1. &automate-error: kind: revoked irritants: ((tests/only tests/scoped/)) 2. &message: "this registration was revoked" 3. &irritants: ((tests/only tests/scoped/)) In goblins/core.scm: 1074:7 3 (syscaller-$ _ #<local-object ^scoped-registrar> (register tests/scoped/one "mago" "/tmp/automate-tests-xhAoLj/automate-def-BuZBXR" (structure (version 3) (name tests/scoped/one) (steps ((step (name quick) (label #f) (group #f) (timeout #f) (error-permitted #f) (outputs (value)) (inputs ())))) (resources ()) (params ()) (outputs ()) (web-ui-options ())) #<remote-object> "ocapn://jus2o54cxlq7lup4vrruwayinedmjz7vwamwygifffwqoqohjcvq.tcp-tls/s/A-OdkA0RO3L1UUVOwBqJhsq8GxvZXKBZODk…" …)) In automate/pumphouse.scm: 529:6 2 (register tests/scoped/one "mago" "/tmp/automate-tests-xhAoLj/automate-def-BuZBXR" (structure (version 3) (name tests/scoped/one) (steps ((step (name quick) (label #f) (group #f) (timeout #f) (error-permitted #f) (outputs (value)) (inputs ())))) (resources ()) (params ()) (outputs ()) (web-ui-options ())) #<remote-object> "ocapn://jus2o54cxlq7lup4vrruwayinedmjz7vwamwygifffwqoqohjcvq.tcp-tls/s/A-OdkA0RO3L1UUVOwBqJhsq8GxvZXKBZODk7_ZqKAcc?" ()) In automate/model.scm: 119:2 1 (raise-automate-error _ _ . _) In ice-9/boot-9.scm: 1705:22 0 (raise-exception _ #:continuable? _) pumphouse refused tests/scoped/one: Unknown error occurred with remote object Goblins exception: In message to #<local-object ^scoped-registrar>: (register tests/nap "mago" "/tmp/automate-tests-xhAoLj/automate-def-2cuPxN" (structure (version 3) (name tests/nap) (steps ((step (name nap) (label #f) (group #f) (timeout #f) (error-permitted #f) (outputs (value)) (inputs ())))) (resources ()) (params ()) (outputs ()) (web-ui-options ())) #<remote-object> "ocapn://jus2o54cxlq7lup4vrruwayinedmjz7vwamwygifffwqoqohjcvq.tcp-tls/s/1X2xP9pK5BEDsm3vT7d1XexkYah7eGXPKRz7LSD9Mpg?" ()) ice-9/boot-9.scm:1705:22: In procedure raise-exception: ERROR: 1. &automate-error: kind: revoked irritants: ((tests/only tests/scoped/)) 2. &message: "this registration was revoked" 3. &irritants: ((tests/only tests/scoped/)) In goblins/core.scm: 1074:7 3 (syscaller-$ _ #<local-object ^scoped-registrar> (register tests/nap "mago" "/tmp/automate-tests-xhAoLj/automate-def-2cuPxN" (structure (version 3) (name tests/nap) (steps ((step (name nap) (label #f) (group #f) (timeout #f) (error-permitted #f) (outputs (value)) (inputs ())))) (resources ()) (params ()) (outputs ()) (web-ui-options ())) #<remote-object> "ocapn://jus2o54cxlq7lup4vrruwayinedmjz7vwamwygifffwqoqohjcvq.tcp-tls/s/1X2xP9pK5BEDsm3vT7d1XexkYah7eGXPKRz7LSD9Mpg?" ())) In automate/pumphouse.scm: 529:6 2 (register tests/nap "mago" "/tmp/automate-tests-xhAoLj/automate-def-2cuPxN" (structure (version 3) (name tests/nap) (steps ((step (name nap) (label #f) (group #f) (timeout #f) (error-permitted #f) (outputs (value)) (inputs ())))) (resources ()) (params ()) (outputs ()) (web-ui-options ())) #<remote-object> "ocapn://jus2o54cxlq7lup4vrruwayinedmjz7vwamwygifffwqoqohjcvq.tcp-tls/s/1X2xP9pK5BEDsm3vT7d1XexkYah7eGXPKRz7LSD9Mpg?" ()) In automate/model.scm: 119:2 1 (raise-automate-error _ _ . _) In ice-9/boot-9.scm: 1705:22 0 (raise-exception _ #:continuable? _) pumphouse refused tests/nap: Unknown error occurred with remote object Goblins exception: In message to #<local-object ^scoped-registrar>: (register tests/only "mago" "/tmp/automate-tests-xhAoLj/automate-def-5iL50Y" (structure (version 3) (name tests/only) (steps ((step (name quick) (label #f) (group #f) (timeout #f) (error-permitted #f) (outputs (value)) (inputs ())))) (resources ()) (params ()) (outputs ()) (web-ui-options ())) #<remote-object> "ocapn://bwgiv6drtzu4cqn5sapidgqq2s4o2rckvhi2fvh6n4jh2r224czq.tcp-tls/s/fKFGsrPs4A1ynkjJlfpR4iNI9SRNK0crj3hU5FYKlLI?" ()) ice-9/boot-9.scm:1705:22: In procedure raise-exception: ERROR: 1. &automate-error: kind: revoked irritants: ((tests/only tests/scoped/)) 2. &message: "this registration was revoked" 3. &irritants: ((tests/only tests/scoped/)) In goblins/core.scm: 1074:7 3 (syscaller-$ _ #<local-object ^scoped-registrar> (register tests/only "mago" "/tmp/automate-tests-xhAoLj/automate-def-5iL50Y" (structure (version 3) (name tests/only) (steps ((step (name quick) (label #f) (group #f) (timeout #f) (error-permitted #f) (outputs (value)) (inputs ())))) (resources ()) (params ()) (outputs ()) (web-ui-options ())) #<remote-object> "ocapn://bwgiv6drtzu4cqn5sapidgqq2s4o2rckvhi2fvh6n4jh2r224czq.tcp-tls/s/fKFGsrPs4A1ynkjJlfpR4iNI9SRNK0crj3hU5FYKlLI?" ())) In automate/pumphouse.scm: 529:6 2 (register tests/only "mago" "/tmp/automate-tests-xhAoLj/automate-def-5iL50Y" (structure (version 3) (name tests/only) (steps ((step (name quick) (label #f) (group #f) (timeout #f) (error-permitted #f) (outputs (value)) (inputs ())))) (resources ()) (params ()) (outputs ()) (web-ui-options ())) #<remote-object> "ocapn://bwgiv6drtzu4cqn5sapidgqq2s4o2rckvhi2fvh6n4jh2r224czq.tcp-tls/s/fKFGsrPs4A1ynkjJlfpR4iNI9SRNK0crj3hU5FYKlLI?" ()) In automate/model.scm: 119:2 1 (raise-automate-error _ _ . _) In ice-9/boot-9.scm: 1705:22 0 (raise-exception _ #:continuable? _) pumphouse refused tests/only: Unknown error occurred with remote object Goblins exception: In message to #<local-object ^scoped-registrar>: (register tests/scoped/one "mago" "/tmp/automate-tests-xhAoLj/automate-def-BuZBXR" (structure (version 3) (name tests/scoped/one) (steps ((step (name quick) (label #f) (group #f) (timeout #f) (error-permitted #f) (outputs (value)) (inputs ())))) (resources ()) (params ()) (outputs ()) (web-ui-options ())) #<remote-object> "ocapn://bwgiv6drtzu4cqn5sapidgqq2s4o2rckvhi2fvh6n4jh2r224czq.tcp-tls/s/2gCtttGcCYOHZ3inln_kBWVlyL6tn8ZMZNwuwZr2yNE?" ()) ice-9/boot-9.scm:1705:22: In procedure raise-exception: ERROR: 1. &automate-error: kind: revoked irritants: ((tests/only tests/scoped/)) 2. &message: "this registration was revoked" 3. &irritants: ((tests/only tests/scoped/)) In goblins/core.scm: 1074:7 3 (syscaller-$ _ #<local-object ^scoped-registrar> (register tests/scoped/one "mago" "/tmp/automate-tests-xhAoLj/automate-def-BuZBXR" (structure (version 3) (name tests/scoped/one) (steps ((step (name quick) (label #f) (group #f) (timeout #f) (error-permitted #f) (outputs (value)) (inputs ())))) (resources ()) (params ()) (outputs ()) (web-ui-options ())) #<remote-object> "ocapn://bwgiv6drtzu4cqn5sapidgqq2s4o2rckvhi2fvh6n4jh2r224czq.tcp-tls/s/2gCtttGcCYOHZ3inln_kBWVlyL6tn8ZMZNw…" …)) In automate/pumphouse.scm: 529:6 2 (register tests/scoped/one "mago" "/tmp/automate-tests-xhAoLj/automate-def-BuZBXR" (structure (version 3) (name tests/scoped/one) (steps ((step (name quick) (label #f) (group #f) (timeout #f) (error-permitted #f) (outputs (value)) (inputs ())))) (resources ()) (params ()) (outputs ()) (web-ui-options ())) #<remote-object> "ocapn://bwgiv6drtzu4cqn5sapidgqq2s4o2rckvhi2fvh6n4jh2r224czq.tcp-tls/s/2gCtttGcCYOHZ3inln_kBWVlyL6tn8ZMZNwuwZr2yNE?" ()) In automate/model.scm: 119:2 1 (raise-automate-error _ _ . _) In ice-9/boot-9.scm: 1705:22 0 (raise-exception _ #:continuable? _) pumphouse refused tests/scoped/one: Unknown error occurred with remote object lost the pumphouse; reconnecting Goblins exception: In message to #<local-object ^scoped-registrar>: (register tests/nap "mago" "/tmp/automate-tests-xhAoLj/automate-def-2cuPxN" (structure (version 3) (name tests/nap) (steps ((step (name nap) (label #f) (group #f) (timeout #f) (error-permitted #f) (outputs (value)) (inputs ())))) (resources ()) (params ()) (outputs ()) (web-ui-options ())) #<remote-object> "ocapn://bwgiv6drtzu4cqn5sapidgqq2s4o2rckvhi2fvh6n4jh2r224czq.tcp-tls/s/TmTpeOgF30LiIu8GWgVT9JRqgBvekYxjzDVEfQ_BId4?" ()) ice-9/boot-9.scm:1705:22: In procedure raise-exception: ERROR: 1. &automate-error: kind: revoked irritants: ((tests/only tests/scoped/)) 2. &message: "this registration was revoked" 3. &irritants: ((tests/only tests/scoped/)) In goblins/core.scm: 1074:7 3 (syscaller-$ _ #<local-object ^scoped-registrar> (register tests/nap "mago" "/tmp/automate-tests-xhAoLj/automate-def-2cuPxN" (structure (version 3) (name tests/nap) (steps ((step (name nap) (label #f) (group #f) (timeout #f) (error-permitted #f) (outputs (value)) (inputs ())))) (resources ()) (params ()) (outputs ()) (web-ui-options ())) #<remote-object> "ocapn://bwgiv6drtzu4cqn5sapidgqq2s4o2rckvhi2fvh6n4jh2r224czq.tcp-tls/s/TmTpeOgF30LiIu8GWgVT9JRqgBvekYxjzDVEfQ_BId4?" ())) In automate/pumphouse.scm: 529:6 2 (register tests/nap "mago" "/tmp/automate-tests-xhAoLj/automate-def-2cuPxN" (structure (version 3) (name tests/nap) (steps ((step (name nap) (label #f) (group #f) (timeout #f) (error-permitted #f) (outputs (value)) (inputs ())))) (resources ()) (params ()) (outputs ()) (web-ui-options ())) #<remote-object> "ocapn://bwgiv6drtzu4cqn5sapidgqq2s4o2rckvhi2fvh6n4jh2r224czq.tcp-tls/s/TmTpeOgF30LiIu8GWgVT9JRqgBvekYxjzDVEfQ_BId4?" ()) In automate/model.scm: 119:2 1 (raise-automate-error _ _ . _) In ice-9/boot-9.scm: 1705:22 0 (raise-exception _ #:continuable? _) pumphouse refused tests/nap: Unknown error occurred with remote object 2026-10-14 19:06:21 (with-exception-handler) INFO: POST /output/92395c6149c6c8b4/stop 200 61ms 2026-10-14 19:06:21 (with-exception-handler) INFO: POST /output/92395c6149c6c8b4/stop-self 200 322ms attached to the pumphouse of /tmp/automate-tests-xhAoLj/automate-pumphouse-djL4Bo/any Goblins exception: In message to #<local-object ^scoped-registrar>: (register tests/only "mago" "/tmp/automate-tests-xhAoLj/automate-def-5iL50Y" (structure (version 3) (name tests/only) (steps ((step (name quick) (label #f) (group #f) (timeout #f) (error-permitted #f) (outputs (value)) (inputs ())))) (resources ()) (params ()) (outputs ()) (web-ui-options ())) #<remote-object> "ocapn://naqb6frekv3vgciyzlzcvojogk4tqyxoh2i5biqff56qrlkkvfwa.tcp-tls/s/WeJGk6bjPfe_nQ85Ef3NwFAXvNqNZi3NFyDUGZX1DR8?" ()) ice-9/boot-9.scm:1705:22: In procedure raise-exception: ERROR: 1. &automate-error: kind: revoked irritants: ((tests/only tests/scoped/)) 2. &message: "this registration was revoked" 3. &irritants: ((tests/only tests/scoped/)) In goblins/core.scm: 1074:7 3 (syscaller-$ _ #<local-object ^scoped-registrar> (register tests/only "mago" "/tmp/automate-tests-xhAoLj/automate-def-5iL50Y" (structure (version 3) (name tests/only) (steps ((step (name quick) (label #f) (group #f) (timeout #f) (error-permitted #f) (outputs (value)) (inputs ())))) (resources ()) (params ()) (outputs ()) (web-ui-options ())) #<remote-object> "ocapn://naqb6frekv3vgciyzlzcvojogk4tqyxoh2i5biqff56qrlkkvfwa.tcp-tls/s/WeJGk6bjPfe_nQ85Ef3NwFAXvNqNZi3NFyDUGZX1DR8?" ())) In automate/pumphouse.scm: 529:6 2 (register tests/only "mago" "/tmp/automate-tests-xhAoLj/automate-def-5iL50Y" (structure (version 3) (name tests/only) (steps ((step (name quick) (label #f) (group #f) (timeout #f) (error-permitted #f) (outputs (value)) (inputs ())))) (resources ()) (params ()) (outputs ()) (web-ui-options ())) #<remote-object> "ocapn://naqb6frekv3vgciyzlzcvojogk4tqyxoh2i5biqff56qrlkkvfwa.tcp-tls/s/WeJGk6bjPfe_nQ85Ef3NwFAXvNqNZi3NFyDUGZX1DR8?" ()) In automate/model.scm: 119:2 1 (raise-automate-error _ _ . _) In ice-9/boot-9.scm: 1705:22 0 (raise-exception _ #:continuable? _) pumphouse refused tests/only: Unknown error occurred with remote object Goblins exception: In message to #<local-object ^scoped-registrar>: (register tests/scoped/one "mago" "/tmp/automate-tests-xhAoLj/automate-def-BuZBXR" (structure (version 3) (name tests/scoped/one) (steps ((step (name quick) (label #f) (group #f) (timeout #f) (error-permitted #f) (outputs (value)) (inputs ())))) (resources ()) (params ()) (outputs ()) (web-ui-options ())) #<remote-object> "ocapn://naqb6frekv3vgciyzlzcvojogk4tqyxoh2i5biqff56qrlkkvfwa.tcp-tls/s/iRH3T2MoROerYn9kEpk1PUENzExiV2ugVegEFExCmho?" ()) ice-9/boot-9.scm:1705:22: In procedure raise-exception: ERROR: 1. &automate-error: kind: revoked irritants: ((tests/only tests/scoped/)) 2. &message: "this registration was revoked" 3. &irritants: ((tests/only tests/scoped/)) In goblins/core.scm: 1074:7 3 (syscaller-$ _ #<local-object ^scoped-registrar> (register tests/scoped/one "mago" "/tmp/automate-tests-xhAoLj/automate-def-BuZBXR" (structure (version 3) (name tests/scoped/one) (steps ((step (name quick) (label #f) (group #f) (timeout #f) (error-permitted #f) (outputs (value)) (inputs ())))) (resources ()) (params ()) (outputs ()) (web-ui-options ())) #<remote-object> "ocapn://naqb6frekv3vgciyzlzcvojogk4tqyxoh2i5biqff56qrlkkvfwa.tcp-tls/s/iRH3T2MoROerYn9kEpk1PUENzExiV2ugVeg…" …)) In automate/pumphouse.scm: 529:6 2 (register tests/scoped/one "mago" "/tmp/automate-tests-xhAoLj/automate-def-BuZBXR" (structure (version 3) (name tests/scoped/one) (steps ((step (name quick) (label #f) (group #f) (timeout #f) (error-permitted #f) (outputs (value)) (inputs ())))) (resources ()) (params ()) (outputs ()) (web-ui-options ())) #<remote-object> "ocapn://naqb6frekv3vgciyzlzcvojogk4tqyxoh2i5biqff56qrlkkvfwa.tcp-tls/s/iRH3T2MoROerYn9kEpk1PUENzExiV2ugVegEFExCmho?" ()) In automate/model.scm: 119:2 1 (raise-automate-error _ _ . _) In ice-9/boot-9.scm: 1705:22 0 (raise-exception _ #:continuable? _) pumphouse refused tests/scoped/one: Unknown error occurred with remote object Goblins exception: In message to #<local-object ^scoped-registrar>: (register tests/nap "mago" "/tmp/automate-tests-xhAoLj/automate-def-2cuPxN" (structure (version 3) (name tests/nap) (steps ((step (name nap) (label #f) (group #f) (timeout #f) (error-permitted #f) (outputs (value)) (inputs ())))) (resources ()) (params ()) (outputs ()) (web-ui-options ())) #<remote-object> "ocapn://naqb6frekv3vgciyzlzcvojogk4tqyxoh2i5biqff56qrlkkvfwa.tcp-tls/s/x6V-dx_1s8Wq7SXzBQjIUEkblVtjH_N-ySEqQHV4VuY?" ()) ice-9/boot-9.scm:1705:22: In procedure raise-exception: ERROR: 1. &automate-error: kind: revoked irritants: ((tests/only tests/scoped/)) 2. &message: "this registration was revoked" 3. &irritants: ((tests/only tests/scoped/)) In goblins/core.scm: 1074:7 3 (syscaller-$ _ #<local-object ^scoped-registrar> (register tests/nap "mago" "/tmp/automate-tests-xhAoLj/automate-def-2cuPxN" (structure (version 3) (name tests/nap) (steps ((step (name nap) (label #f) (group #f) (timeout #f) (error-permitted #f) (outputs (value)) (inputs ())))) (resources ()) (params ()) (outputs ()) (web-ui-options ())) #<remote-object> "ocapn://naqb6frekv3vgciyzlzcvojogk4tqyxoh2i5biqff56qrlkkvfwa.tcp-tls/s/x6V-dx_1s8Wq7SXzBQjIUEkblVtjH_N-ySEqQHV4VuY?" ())) In automate/pumphouse.scm: 529:6 2 (register tests/nap "mago" "/tmp/automate-tests-xhAoLj/automate-def-2cuPxN" (structure (version 3) (name tests/nap) (steps ((step (name nap) (label #f) (group #f) (timeout #f) (error-permitted #f) (outputs (value)) (inputs ())))) (resources ()) (params ()) (outputs ()) (web-ui-options ())) #<remote-object> "ocapn://naqb6frekv3vgciyzlzcvojogk4tqyxoh2i5biqff56qrlkkvfwa.tcp-tls/s/x6V-dx_1s8Wq7SXzBQjIUEkblVtjH_N-ySEqQHV4VuY?" ()) In automate/model.scm: 119:2 1 (raise-automate-error _ _ . _) In ice-9/boot-9.scm: 1705:22 0 (raise-exception _ #:continuable? _) pumphouse refused tests/nap: Unknown error occurred with remote object lost the pumphouse; reconnecting Goblins exception: In message to #<local-object ^scoped-registrar>: (register tests/only "mago" "/tmp/automate-tests-xhAoLj/automate-def-5iL50Y" (structure (version 3) (name tests/only) (steps ((step (name quick) (label #f) (group #f) (timeout #f) (error-permitted #f) (outputs (value)) (inputs ())))) (resources ()) (params ()) (outputs ()) (web-ui-options ())) #<remote-object> "ocapn://f6joi2j2yoyaidp2twk2fqmmpyetalmxevfafibzzykcrsow6kbq.tcp-tls/s/S-ECa_rK2ixxE9jUjNV6X0KbJRbwSlzj_bExiJykZvQ?" ()) ice-9/boot-9.scm:1705:22: In procedure raise-exception: ERROR: 1. &automate-error: kind: revoked irritants: ((tests/only tests/scoped/)) 2. &message: "this registration was revoked" 3. &irritants: ((tests/only tests/scoped/)) In goblins/core.scm: 1074:7 3 (syscaller-$ _ #<local-object ^scoped-registrar> (register tests/only "mago" "/tmp/automate-tests-xhAoLj/automate-def-5iL50Y" (structure (version 3) (name tests/only) (steps ((step (name quick) (label #f) (group #f) (timeout #f) (error-permitted #f) (outputs (value)) (inputs ())))) (resources ()) (params ()) (outputs ()) (web-ui-options ())) #<remote-object> "ocapn://f6joi2j2yoyaidp2twk2fqmmpyetalmxevfafibzzykcrsow6kbq.tcp-tls/s/S-ECa_rK2ixxE9jUjNV6X0KbJRbwSlzj_bExiJykZvQ?" ())) In automate/pumphouse.scm: 529:6 2 (register tests/only "mago" "/tmp/automate-tests-xhAoLj/automate-def-5iL50Y" (structure (version 3) (name tests/only) (steps ((step (name quick) (label #f) (group #f) (timeout #f) (error-permitted #f) (outputs (value)) (inputs ())))) (resources ()) (params ()) (outputs ()) (web-ui-options ())) #<remote-object> "ocapn://f6joi2j2yoyaidp2twk2fqmmpyetalmxevfafibzzykcrsow6kbq.tcp-tls/s/S-ECa_rK2ixxE9jUjNV6X0KbJRbwSlzj_bExiJykZvQ?" ()) In automate/model.scm: 119:2 1 (raise-automate-error _ _ . _) In ice-9/boot-9.scm: 1705:22 0 (raise-exception _ #:continuable? _) pumphouse refused tests/only: Unknown error occurred with remote object Goblins exception: In message to #<local-object ^scoped-registrar>: (register tests/scoped/one "mago" "/tmp/automate-tests-xhAoLj/automate-def-BuZBXR" (structure (version 3) (name tests/scoped/one) (steps ((step (name quick) (label #f) (group #f) (timeout #f) (error-permitted #f) (outputs (value)) (inputs ())))) (resources ()) (params ()) (outputs ()) (web-ui-options ())) #<remote-object> "ocapn://f6joi2j2yoyaidp2twk2fqmmpyetalmxevfafibzzykcrsow6kbq.tcp-tls/s/q64I6E0WlT2aioP7jw9aM1J8DA5ZRmNnECZTWYXilHY?" ()) ice-9/boot-9.scm:1705:22: In procedure raise-exception: ERROR: 1. &automate-error: kind: revoked irritants: ((tests/only tests/scoped/)) 2. &message: "this registration was revoked" 3. &irritants: ((tests/only tests/scoped/)) In goblins/core.scm: 1074:7 3 (syscaller-$ _ #<local-object ^scoped-registrar> (register tests/scoped/one "mago" "/tmp/automate-tests-xhAoLj/automate-def-BuZBXR" (structure (version 3) (name tests/scoped/one) (steps ((step (name quick) (label #f) (group #f) (timeout #f) (error-permitted #f) (outputs (value)) (inputs ())))) (resources ()) (params ()) (outputs ()) (web-ui-options ())) #<remote-object> "ocapn://f6joi2j2yoyaidp2twk2fqmmpyetalmxevfafibzzykcrsow6kbq.tcp-tls/s/q64I6E0WlT2aioP7jw9aM1J8DA5ZRmNnECZ…" …)) In automate/pumphouse.scm: 529:6 2 (register tests/scoped/one "mago" "/tmp/automate-tests-xhAoLj/automate-def-BuZBXR" (structure (version 3) (name tests/scoped/one) (steps ((step (name quick) (label #f) (group #f) (timeout #f) (error-permitted #f) (outputs (value)) (inputs ())))) (resources ()) (params ()) (outputs ()) (web-ui-options ())) #<remote-object> "ocapn://f6joi2j2yoyaidp2twk2fqmmpyetalmxevfafibzzykcrsow6kbq.tcp-tls/s/q64I6E0WlT2aioP7jw9aM1J8DA5ZRmNnECZTWYXilHY?" ()) In automate/model.scm: 119:2 1 (raise-automate-error _ _ . _) In ice-9/boot-9.scm: 1705:22 0 (raise-exception _ #:continuable? _) pumphouse refused tests/scoped/one: Unknown error occurred with remote object Goblins exception: In message to #<local-object ^scoped-registrar>: (register tests/nap "mago" "/tmp/automate-tests-xhAoLj/automate-def-2cuPxN" (structure (version 3) (name tests/nap) (steps ((step (name nap) (label #f) (group #f) (timeout #f) (error-permitted #f) (outputs (value)) (inputs ())))) (resources ()) (params ()) (outputs ()) (web-ui-options ())) #<remote-object> "ocapn://f6joi2j2yoyaidp2twk2fqmmpyetalmxevfafibzzykcrsow6kbq.tcp-tls/s/qiEwl7MEqKLsrbpxpH3OzmntGVInA7Z7f5gJSQG2vnE?" ()) ice-9/boot-9.scm:1705:22: In procedure raise-exception: ERROR: 1. &automate-error: kind: revoked irritants: ((tests/only tests/scoped/)) 2. &message: "this registration was revoked" 3. &irritants: ((tests/only tests/scoped/)) In goblins/core.scm: 1074:7 3 (syscaller-$ _ #<local-object ^scoped-registrar> (register tests/nap "mago" "/tmp/automate-tests-xhAoLj/automate-def-2cuPxN" (structure (version 3) (name tests/nap) (steps ((step (name nap) (label #f) (group #f) (timeout #f) (error-permitted #f) (outputs (value)) (inputs ())))) (resources ()) (params ()) (outputs ()) (web-ui-options ())) #<remote-object> "ocapn://f6joi2j2yoyaidp2twk2fqmmpyetalmxevfafibzzykcrsow6kbq.tcp-tls/s/qiEwl7MEqKLsrbpxpH3OzmntGVInA7Z7f5gJSQG2vnE?" ())) In automate/pumphouse.scm: 529:6 2 (register tests/nap "mago" "/tmp/automate-tests-xhAoLj/automate-def-2cuPxN" (structure (version 3) (name tests/nap) (steps ((step (name nap) (label #f) (group #f) (timeout #f) (error-permitted #f) (outputs (value)) (inputs ())))) (resources ()) (params ()) (outputs ()) (web-ui-options ())) #<remote-object> "ocapn://f6joi2j2yoyaidp2twk2fqmmpyetalmxevfafibzzykcrsow6kbq.tcp-tls/s/qiEwl7MEqKLsrbpxpH3OzmntGVInA7Z7f5gJSQG2vnE?" ()) In automate/model.scm: 119:2 1 (raise-automate-error _ _ . _) In ice-9/boot-9.scm: 1705:22 0 (raise-exception _ #:continuable? _) pumphouse refused tests/nap: Unknown error occurred with remote object GET /events/output/1f71034bf51051c2/chatty: error replying to client 2026-10-14 19:06:25 (with-exception-handler) INFO: GET /events/output/1f71034bf51051c2/chatty 200 incomplete attached to the pumphouse of /tmp/automate-tests-xhAoLj/automate-pumphouse-djL4Bo/any Goblins exception: In message to #<local-object ^scoped-registrar>: (register tests/only "mago" "/tmp/automate-tests-xhAoLj/automate-def-5iL50Y" (structure (version 3) (name tests/only) (steps ((step (name quick) (label #f) (group #f) (timeout #f) (error-permitted #f) (outputs (value)) (inputs ())))) (resources ()) (params ()) (outputs ()) (web-ui-options ())) #<remote-object> "ocapn://ze5w22tmrhso2d37hgttqhkfbbsjj22sahyvgs65atmedhk4gu6q.tcp-tls/s/34DDRb3DxRTYWTfvgcQQ09pvtIFis51xUK-v8OM9ysk?" ()) ice-9/boot-9.scm:1705:22: In procedure raise-exception: ERROR: 1. &automate-error: kind: revoked irritants: ((tests/only tests/scoped/)) 2. &message: "this registration was revoked" 3. &irritants: ((tests/only tests/scoped/)) In goblins/core.scm: 1074:7 3 (syscaller-$ _ #<local-object ^scoped-registrar> (register tests/only "mago" "/tmp/automate-tests-xhAoLj/automate-def-5iL50Y" (structure (version 3) (name tests/only) (steps ((step (name quick) (label #f) (group #f) (timeout #f) (error-permitted #f) (outputs (value)) (inputs ())))) (resources ()) (params ()) (outputs ()) (web-ui-options ())) #<remote-object> "ocapn://ze5w22tmrhso2d37hgttqhkfbbsjj22sahyvgs65atmedhk4gu6q.tcp-tls/s/34DDRb3DxRTYWTfvgcQQ09pvtIFis51xUK-v8OM9ysk?" ())) In automate/pumphouse.scm: 529:6 2 (register tests/only "mago" "/tmp/automate-tests-xhAoLj/automate-def-5iL50Y" (structure (version 3) (name tests/only) (steps ((step (name quick) (label #f) (group #f) (timeout #f) (error-permitted #f) (outputs (value)) (inputs ())))) (resources ()) (params ()) (outputs ()) (web-ui-options ())) #<remote-object> "ocapn://ze5w22tmrhso2d37hgttqhkfbbsjj22sahyvgs65atmedhk4gu6q.tcp-tls/s/34DDRb3DxRTYWTfvgcQQ09pvtIFis51xUK-v8OM9ysk?" ()) In automate/model.scm: 119:2 1 (raise-automate-error _ _ . _) In ice-9/boot-9.scm: 1705:22 0 (raise-exception _ #:continuable? _) pumphouse refused tests/only: Unknown error occurred with remote object Goblins exception: In message to #<local-object ^scoped-registrar>: (register tests/scoped/one "mago" "/tmp/automate-tests-xhAoLj/automate-def-BuZBXR" (structure (version 3) (name tests/scoped/one) (steps ((step (name quick) (label #f) (group #f) (timeout #f) (error-permitted #f) (outputs (value)) (inputs ())))) (resources ()) (params ()) (outputs ()) (web-ui-options ())) #<remote-object> "ocapn://ze5w22tmrhso2d37hgttqhkfbbsjj22sahyvgs65atmedhk4gu6q.tcp-tls/s/I0p4YhARHp1wtIAQyoAtGzPC4ChhRn6H1e4bV6vMJRo?" ()) ice-9/boot-9.scm:1705:22: In procedure raise-exception: ERROR: 1. &automate-error: kind: revoked irritants: ((tests/only tests/scoped/)) 2. &message: "this registration was revoked" 3. &irritants: ((tests/only tests/scoped/)) In goblins/core.scm: 1074:7 3 (syscaller-$ _ #<local-object ^scoped-registrar> (register tests/scoped/one "mago" "/tmp/automate-tests-xhAoLj/automate-def-BuZBXR" (structure (version 3) (name tests/scoped/one) (steps ((step (name quick) (label #f) (group #f) (timeout #f) (error-permitted #f) (outputs (value)) (inputs ())))) (resources ()) (params ()) (outputs ()) (web-ui-options ())) #<remote-object> "ocapn://ze5w22tmrhso2d37hgttqhkfbbsjj22sahyvgs65atmedhk4gu6q.tcp-tls/s/I0p4YhARHp1wtIAQyoAtGzPC4ChhRn6H1e4…" …)) In automate/pumphouse.scm: 529:6 2 (register tests/scoped/one "mago" "/tmp/automate-tests-xhAoLj/automate-def-BuZBXR" (structure (version 3) (name tests/scoped/one) (steps ((step (name quick) (label #f) (group #f) (timeout #f) (error-permitted #f) (outputs (value)) (inputs ())))) (resources ()) (params ()) (outputs ()) (web-ui-options ())) #<remote-object> "ocapn://ze5w22tmrhso2d37hgttqhkfbbsjj22sahyvgs65atmedhk4gu6q.tcp-tls/s/I0p4YhARHp1wtIAQyoAtGzPC4ChhRn6H1e4bV6vMJRo?" ()) In automate/model.scm: 119:2 1 (raise-automate-error _ _ . _) In ice-9/boot-9.scm: 1705:22 0 (raise-exception _ #:continuable? _) pumphouse refused tests/scoped/one: Unknown error occurred with remote object Goblins exception: In message to #<local-object ^scoped-registrar>: (register tests/nap "mago" "/tmp/automate-tests-xhAoLj/automate-def-2cuPxN" (structure (version 3) (name tests/nap) (steps ((step (name nap) (label #f) (group #f) (timeout #f) (error-permitted #f) (outputs (value)) (inputs ())))) (resources ()) (params ()) (outputs ()) (web-ui-options ())) #<remote-object> "ocapn://ze5w22tmrhso2d37hgttqhkfbbsjj22sahyvgs65atmedhk4gu6q.tcp-tls/s/eENrTtpChSPC1BV_dziIWWPk3dXoVK8YCksjJZch7Uo?" ()) ice-9/boot-9.scm:1705:22: In procedure raise-exception: ERROR: 1. &automate-error: kind: revoked irritants: ((tests/only tests/scoped/)) 2. &message: "this registration was revoked" 3. &irritants: ((tests/only tests/scoped/)) In goblins/core.scm: 1074:7 3 (syscaller-$ _ #<local-object ^scoped-registrar> (register tests/nap "mago" "/tmp/automate-tests-xhAoLj/automate-def-2cuPxN" (structure (version 3) (name tests/nap) (steps ((step (name nap) (label #f) (group #f) (timeout #f) (error-permitted #f) (outputs (value)) (inputs ())))) (resources ()) (params ()) (outputs ()) (web-ui-options ())) #<remote-object> "ocapn://ze5w22tmrhso2d37hgttqhkfbbsjj22sahyvgs65atmedhk4gu6q.tcp-tls/s/eENrTtpChSPC1BV_dziIWWPk3dXoVK8YCksjJZch7Uo?" ())) In automate/pumphouse.scm: 529:6 2 (register tests/nap "mago" "/tmp/automate-tests-xhAoLj/automate-def-2cuPxN" (structure (version 3) (name tests/nap) (steps ((step (name nap) (label #f) (group #f) (timeout #f) (error-permitted #f) (outputs (value)) (inputs ())))) (resources ()) (params ()) (outputs ()) (web-ui-options ())) #<remote-object> "ocapn://ze5w22tmrhso2d37hgttqhkfbbsjj22sahyvgs65atmedhk4gu6q.tcp-tls/s/eENrTtpChSPC1BV_dziIWWPk3dXoVK8YCksjJZch7Uo?" ()) In automate/model.scm: 119:2 1 (raise-automate-error _ _ . _) In ice-9/boot-9.scm: 1705:22 0 (raise-exception _ #:continuable? _) pumphouse refused tests/nap: Unknown error occurred with remote object Goblins exception: In message to #<local-object ^scoped-registrar>: (register tests/only "mago" "/tmp/automate-tests-xhAoLj/automate-def-5iL50Y" (structure (version 3) (name tests/only) (steps ((step (name quick) (label #f) (group #f) (timeout #f) (error-permitted #f) (outputs (value)) (inputs ())))) (resources ()) (params ()) (outputs ()) (web-ui-options ())) #<remote-object> "ocapn://4wyk7iwknnsgw3vs5nke5ughcysvnfy5t6hmccst4gmpi7jus62q.tcp-tls/s/WspiKYeBZy7nJeeVWT5XU9I503iS42K-J7hV2R9kf7s?" ()) ice-9/boot-9.scm:1705:22: In procedure raise-exception: ERROR: 1. &automate-error: kind: revoked irritants: ((tests/only tests/scoped/)) 2. &message: "this registration was revoked" 3. &irritants: ((tests/only tests/scoped/)) In goblins/core.scm: 1074:7 3 (syscaller-$ _ #<local-object ^scoped-registrar> (register tests/only "mago" "/tmp/automate-tests-xhAoLj/automate-def-5iL50Y" (structure (version 3) (name tests/only) (steps ((step (name quick) (label #f) (group #f) (timeout #f) (error-permitted #f) (outputs (value)) (inputs ())))) (resources ()) (params ()) (outputs ()) (web-ui-options ())) #<remote-object> "ocapn://4wyk7iwknnsgw3vs5nke5ughcysvnfy5t6hmccst4gmpi7jus62q.tcp-tls/s/WspiKYeBZy7nJeeVWT5XU9I503iS42K-J7hV2R9kf7s?" ())) In automate/pumphouse.scm: 529:6 2 (register tests/only "mago" "/tmp/automate-tests-xhAoLj/automate-def-5iL50Y" (structure (version 3) (name tests/only) (steps ((step (name quick) (label #f) (group #f) (timeout #f) (error-permitted #f) (outputs (value)) (inputs ())))) (resources ()) (params ()) (outputs ()) (web-ui-options ())) #<remote-object> "ocapn://4wyk7iwknnsgw3vs5nke5ughcysvnfy5t6hmccst4gmpi7jus62q.tcp-tls/s/WspiKYeBZy7nJeeVWT5XU9I503iS42K-J7hV2R9kf7s?" ()) In automate/model.scm: 119:2 1 (raise-automate-error _ _ . _) In ice-9/boot-9.scm: 1705:22 0 (raise-exception _ #:continuable? _) pumphouse refused tests/only: Unknown error occurred with remote object Goblins exception: In message to #<local-object ^scoped-registrar>: (register tests/scoped/one "mago" "/tmp/automate-tests-xhAoLj/automate-def-BuZBXR" (structure (version 3) (name tests/scoped/one) (steps ((step (name quick) (label #f) (group #f) (timeout #f) (error-permitted #f) (outputs (value)) (inputs ())))) (resources ()) (params ()) (outputs ()) (web-ui-options ())) #<remote-object> "ocapn://4wyk7iwknnsgw3vs5nke5ughcysvnfy5t6hmccst4gmpi7jus62q.tcp-tls/s/tsazvHb2aYde0A1824F6Q_R5YCDIQIa6wXxdfVDWfz8?" ()) ice-9/boot-9.scm:1705:22: In procedure raise-exception: ERROR: 1. &automate-error: kind: revoked irritants: ((tests/only tests/scoped/)) 2. &message: "this registration was revoked" 3. &irritants: ((tests/only tests/scoped/)) In goblins/core.scm: 1074:7 3 (syscaller-$ _ #<local-object ^scoped-registrar> (register tests/scoped/one "mago" "/tmp/automate-tests-xhAoLj/automate-def-BuZBXR" (structure (version 3) (name tests/scoped/one) (steps ((step (name quick) (label #f) (group #f) (timeout #f) (error-permitted #f) (outputs (value)) (inputs ())))) (resources ()) (params ()) (outputs ()) (web-ui-options ())) #<remote-object> "ocapn://4wyk7iwknnsgw3vs5nke5ughcysvnfy5t6hmccst4gmpi7jus62q.tcp-tls/s/tsazvHb2aYde0A1824F6Q_R5YCDIQIa6wXx…" …)) In automate/pumphouse.scm: 529:6 2 (register tests/scoped/one "mago" "/tmp/automate-tests-xhAoLj/automate-def-BuZBXR" (structure (version 3) (name tests/scoped/one) (steps ((step (name quick) (label #f) (group #f) (timeout #f) (error-permitted #f) (outputs (value)) (inputs ())))) (resources ()) (params ()) (outputs ()) (web-ui-options ())) #<remote-object> "ocapn://4wyk7iwknnsgw3vs5nke5ughcysvnfy5t6hmccst4gmpi7jus62q.tcp-tls/s/tsazvHb2aYde0A1824F6Q_R5YCDIQIa6wXxdfVDWfz8?" ()) In automate/model.scm: 119:2 1 (raise-automate-error _ _ . _) In ice-9/boot-9.scm: 1705:22 0 (raise-exception _ #:continuable? _) pumphouse refused tests/scoped/one: Unknown error occurred with remote object Goblins exception: In message to #<local-object ^scoped-registrar>: (register tests/nap "mago" "/tmp/automate-tests-xhAoLj/automate-def-2cuPxN" (structure (version 3) (name tests/nap) (steps ((step (name nap) (label #f) (group #f) (timeout #f) (error-permitted #f) (outputs (value)) (inputs ())))) (resources ()) (params ()) (outputs ()) (web-ui-options ())) #<remote-object> "ocapn://4wyk7iwknnsgw3vs5nke5ughcysvnfy5t6hmccst4gmpi7jus62q.tcp-tls/s/gatDXbX-OShx5B2hxObcN5O9HuJd0RCCvYNuXhb0YYg?" ()) ice-9/boot-9.scm:1705:22: In procedure raise-exception: ERROR: 1. &automate-error: kind: revoked irritants: ((tests/only tests/scoped/)) 2. &message: "this registration was revoked" 3. &irritants: ((tests/only tests/scoped/)) In goblins/core.scm: 1074:7 3 (syscaller-$ _ #<local-object ^scoped-registrar> (register tests/nap "mago" "/tmp/automate-tests-xhAoLj/automate-def-2cuPxN" (structure (version 3) (name tests/nap) (steps ((step (name nap) (label #f) (group #f) (timeout #f) (error-permitted #f) (outputs (value)) (inputs ())))) (resources ()) (params ()) (outputs ()) (web-ui-options ())) #<remote-object> "ocapn://4wyk7iwknnsgw3vs5nke5ughcysvnfy5t6hmccst4gmpi7jus62q.tcp-tls/s/gatDXbX-OShx5B2hxObcN5O9HuJd0RCCvYNuXhb0YYg?" ())) In automate/pumphouse.scm: 529:6 2 (register tests/nap "mago" "/tmp/automate-tests-xhAoLj/automate-def-2cuPxN" (structure (version 3) (name tests/nap) (steps ((step (name nap) (label #f) (group #f) (timeout #f) (error-permitted #f) (outputs (value)) (inputs ())))) (resources ()) (params ()) (outputs ()) (web-ui-options ())) #<remote-object> "ocapn://4wyk7iwknnsgw3vs5nke5ughcysvnfy5t6hmccst4gmpi7jus62q.tcp-tls/s/gatDXbX-OShx5B2hxObcN5O9HuJd0RCCvYNuXhb0YYg?" ()) In automate/model.scm: 119:2 1 (raise-automate-error _ _ . _) In ice-9/boot-9.scm: 1705:22 0 (raise-exception _ #:continuable? _) pumphouse refused tests/nap: Unknown error occurred with remote object Goblins exception: In message to #<local-object ^scoped-registrar>: (register tests/only "mago" "/tmp/automate-tests-xhAoLj/automate-def-5iL50Y" (structure (version 3) (name tests/only) (steps ((step (name quick) (label #f) (group #f) (timeout #f) (error-permitted #f) (outputs (value)) (inputs ())))) (resources ()) (params ()) (outputs ()) (web-ui-options ())) #<remote-object> "ocapn://gpzciempzjg6e5if7mbesrjohmn6j4gpfpa7fds2nli6lxvqiqhq.tcp-tls/s/9MtndPrQd9YWJvScYIZkON_Ba5vI2p94yRw24Q5LaR4?" ()) ice-9/boot-9.scm:1705:22: In procedure raise-exception: ERROR: 1. &automate-error: kind: revoked irritants: ((tests/only tests/scoped/)) 2. &message: "this registration was revoked" 3. &irritants: ((tests/only tests/scoped/)) In goblins/core.scm: 1074:7 3 (syscaller-$ _ #<local-object ^scoped-registrar> (register tests/only "mago" "/tmp/automate-tests-xhAoLj/automate-def-5iL50Y" (structure (version 3) (name tests/only) (steps ((step (name quick) (label #f) (group #f) (timeout #f) (error-permitted #f) (outputs (value)) (inputs ())))) (resources ()) (params ()) (outputs ()) (web-ui-options ())) #<remote-object> "ocapn://gpzciempzjg6e5if7mbesrjohmn6j4gpfpa7fds2nli6lxvqiqhq.tcp-tls/s/9MtndPrQd9YWJvScYIZkON_Ba5vI2p94yRw24Q5LaR4?" ())) In automate/pumphouse.scm: 529:6 2 (register tests/only "mago" "/tmp/automate-tests-xhAoLj/automate-def-5iL50Y" (structure (version 3) (name tests/only) (steps ((step (name quick) (label #f) (group #f) (timeout #f) (error-permitted #f) (outputs (value)) (inputs ())))) (resources ()) (params ()) (outputs ()) (web-ui-options ())) #<remote-object> "ocapn://gpzciempzjg6e5if7mbesrjohmn6j4gpfpa7fds2nli6lxvqiqhq.tcp-tls/s/9MtndPrQd9YWJvScYIZkON_Ba5vI2p94yRw24Q5LaR4?" ()) In automate/model.scm: 119:2 1 (raise-automate-error _ _ . _) In ice-9/boot-9.scm: 1705:22 0 (raise-exception _ #:continuable? _) pumphouse refused tests/only: Unknown error occurred with remote object Goblins exception: In message to #<local-object ^scoped-registrar>: (register tests/scoped/one "mago" "/tmp/automate-tests-xhAoLj/automate-def-BuZBXR" (structure (version 3) (name tests/scoped/one) (steps ((step (name quick) (label #f) (group #f) (timeout #f) (error-permitted #f) (outputs (value)) (inputs ())))) (resources ()) (params ()) (outputs ()) (web-ui-options ())) #<remote-object> "ocapn://gpzciempzjg6e5if7mbesrjohmn6j4gpfpa7fds2nli6lxvqiqhq.tcp-tls/s/HiO6tavJHJ60k1c-bAKZ9k9_EnAD_loIe1lBkwBTsg0?" ()) ice-9/boot-9.scm:1705:22: In procedure raise-exception: ERROR: 1. &automate-error: kind: revoked irritants: ((tests/only tests/scoped/)) 2. &message: "this registration was revoked" 3. &irritants: ((tests/only tests/scoped/)) In goblins/core.scm: 1074:7 3 (syscaller-$ _ #<local-object ^scoped-registrar> (register tests/scoped/one "mago" "/tmp/automate-tests-xhAoLj/automate-def-BuZBXR" (structure (version 3) (name tests/scoped/one) (steps ((step (name quick) (label #f) (group #f) (timeout #f) (error-permitted #f) (outputs (value)) (inputs ())))) (resources ()) (params ()) (outputs ()) (web-ui-options ())) #<remote-object> "ocapn://gpzciempzjg6e5if7mbesrjohmn6j4gpfpa7fds2nli6lxvqiqhq.tcp-tls/s/HiO6tavJHJ60k1c-bAKZ9k9_EnAD_loIe1l…" …)) In automate/pumphouse.scm: 529:6 2 (register tests/scoped/one "mago" "/tmp/automate-tests-xhAoLj/automate-def-BuZBXR" (structure (version 3) (name tests/scoped/one) (steps ((step (name quick) (label #f) (group #f) (timeout #f) (error-permitted #f) (outputs (value)) (inputs ())))) (resources ()) (params ()) (outputs ()) (web-ui-options ())) #<remote-object> "ocapn://gpzciempzjg6e5if7mbesrjohmn6j4gpfpa7fds2nli6lxvqiqhq.tcp-tls/s/HiO6tavJHJ60k1c-bAKZ9k9_EnAD_loIe1lBkwBTsg0?" ()) In automate/model.scm: 119:2 1 (raise-automate-error _ _ . _) In ice-9/boot-9.scm: 1705:22 0 (raise-exception _ #:continuable? _) pumphouse refused tests/scoped/one: Unknown error occurred with remote object Goblins exception: In message to #<local-object ^scoped-registrar>: (register tests/nap "mago" "/tmp/automate-tests-xhAoLj/automate-def-2cuPxN" (structure (version 3) (name tests/nap) (steps ((step (name nap) (label #f) (group #f) (timeout #f) (error-permitted #f) (outputs (value)) (inputs ())))) (resources ()) (params ()) (outputs ()) (web-ui-options ())) #<remote-object> "ocapn://gpzciempzjg6e5if7mbesrjohmn6j4gpfpa7fds2nli6lxvqiqhq.tcp-tls/s/JjCTG_NDc3duvDnSHhBb91CtAdjsLvDiAZRGKMOaUEo?" ()) ice-9/boot-9.scm:1705:22: In procedure raise-exception: ERROR: 1. &automate-error: kind: revoked irritants: ((tests/only tests/scoped/)) 2. &message: "this registration was revoked" 3. &irritants: ((tests/only tests/scoped/)) In goblins/core.scm: 1074:7 3 (syscaller-$ _ #<local-object ^scoped-registrar> (register tests/nap "mago" "/tmp/automate-tests-xhAoLj/automate-def-2cuPxN" (structure (version 3) (name tests/nap) (steps ((step (name nap) (label #f) (group #f) (timeout #f) (error-permitted #f) (outputs (value)) (inputs ())))) (resources ()) (params ()) (outputs ()) (web-ui-options ())) #<remote-object> "ocapn://gpzciempzjg6e5if7mbesrjohmn6j4gpfpa7fds2nli6lxvqiqhq.tcp-tls/s/JjCTG_NDc3duvDnSHhBb91CtAdjsLvDiAZRGKMOaUEo?" ())) In automate/pumphouse.scm: 529:6 2 (register tests/nap "mago" "/tmp/automate-tests-xhAoLj/automate-def-2cuPxN" (structure (version 3) (name tests/nap) (steps ((step (name nap) (label #f) (group #f) (timeout #f) (error-permitted #f) (outputs (value)) (inputs ())))) (resources ()) (params ()) (outputs ()) (web-ui-options ())) #<remote-object> "ocapn://gpzciempzjg6e5if7mbesrjohmn6j4gpfpa7fds2nli6lxvqiqhq.tcp-tls/s/JjCTG_NDc3duvDnSHhBb91CtAdjsLvDiAZRGKMOaUEo?" ()) In automate/model.scm: 119:2 1 (raise-automate-error _ _ . _) In ice-9/boot-9.scm: 1705:22 0 (raise-exception _ #:continuable? _) pumphouse refused tests/nap: Unknown error occurred with remote object Goblins exception: In message to #<local-object ^scoped-registrar>: (register tests/only "mago" "/tmp/automate-tests-xhAoLj/automate-def-5iL50Y" (structure (version 3) (name tests/only) (steps ((step (name quick) (label #f) (group #f) (timeout #f) (error-permitted #f) (outputs (value)) (inputs ())))) (resources ()) (params ()) (outputs ()) (web-ui-options ())) #<remote-object> "ocapn://s6h7kpbwzrwbbge75gxh2fe6xgqsvcrhwagmvz4hwi7ziroexjdq.tcp-tls/s/pO58mcli8xwRKU4umOrfjUb4GPbm9hnVoAn-vOKDv9A?" ()) ice-9/boot-9.scm:1705:22: In procedure raise-exception: ERROR: 1. &automate-error: kind: revoked irritants: ((tests/only tests/scoped/)) 2. &message: "this registration was revoked" 3. &irritants: ((tests/only tests/scoped/)) In goblins/core.scm: 1074:7 3 (syscaller-$ _ #<local-object ^scoped-registrar> (register tests/only "mago" "/tmp/automate-tests-xhAoLj/automate-def-5iL50Y" (structure (version 3) (name tests/only) (steps ((step (name quick) (label #f) (group #f) (timeout #f) (error-permitted #f) (outputs (value)) (inputs ())))) (resources ()) (params ()) (outputs ()) (web-ui-options ())) #<remote-object> "ocapn://s6h7kpbwzrwbbge75gxh2fe6xgqsvcrhwagmvz4hwi7ziroexjdq.tcp-tls/s/pO58mcli8xwRKU4umOrfjUb4GPbm9hnVoAn-vOKDv9A?" ())) In automate/pumphouse.scm: 529:6 2 (register tests/only "mago" "/tmp/automate-tests-xhAoLj/automate-def-5iL50Y" (structure (version 3) (name tests/only) (steps ((step (name quick) (label #f) (group #f) (timeout #f) (error-permitted #f) (outputs (value)) (inputs ())))) (resources ()) (params ()) (outputs ()) (web-ui-options ())) #<remote-object> "ocapn://s6h7kpbwzrwbbge75gxh2fe6xgqsvcrhwagmvz4hwi7ziroexjdq.tcp-tls/s/pO58mcli8xwRKU4umOrfjUb4GPbm9hnVoAn-vOKDv9A?" ()) In automate/model.scm: 119:2 1 (raise-automate-error _ _ . _) In ice-9/boot-9.scm: 1705:22 0 (raise-exception _ #:continuable? _) pumphouse refused tests/only: Unknown error occurred with remote object Goblins exception: In message to #<local-object ^scoped-registrar>: (register tests/scoped/one "mago" "/tmp/automate-tests-xhAoLj/automate-def-BuZBXR" (structure (version 3) (name tests/scoped/one) (steps ((step (name quick) (label #f) (group #f) (timeout #f) (error-permitted #f) (outputs (value)) (inputs ())))) (resources ()) (params ()) (outputs ()) (web-ui-options ())) #<remote-object> "ocapn://s6h7kpbwzrwbbge75gxh2fe6xgqsvcrhwagmvz4hwi7ziroexjdq.tcp-tls/s/MGLqTn2qdSUT0Z0nH5paXEERDtdziiQ2v5gcUipb2Ao?" ()) ice-9/boot-9.scm:1705:22: In procedure raise-exception: ERROR: 1. &automate-error: kind: revoked irritants: ((tests/only tests/scoped/)) 2. &message: "this registration was revoked" 3. &irritants: ((tests/only tests/scoped/)) In goblins/core.scm: 1074:7 3 (syscaller-$ _ #<local-object ^scoped-registrar> (register tests/scoped/one "mago" "/tmp/automate-tests-xhAoLj/automate-def-BuZBXR" (structure (version 3) (name tests/scoped/one) (steps ((step (name quick) (label #f) (group #f) (timeout #f) (error-permitted #f) (outputs (value)) (inputs ())))) (resources ()) (params ()) (outputs ()) (web-ui-options ())) #<remote-object> "ocapn://s6h7kpbwzrwbbge75gxh2fe6xgqsvcrhwagmvz4hwi7ziroexjdq.tcp-tls/s/MGLqTn2qdSUT0Z0nH5paXEERDtdziiQ2v5g…" …)) In automate/pumphouse.scm: 529:6 2 (register tests/scoped/one "mago" "/tmp/automate-tests-xhAoLj/automate-def-BuZBXR" (structure (version 3) (name tests/scoped/one) (steps ((step (name quick) (label #f) (group #f) (timeout #f) (error-permitted #f) (outputs (value)) (inputs ())))) (resources ()) (params ()) (outputs ()) (web-ui-options ())) #<remote-object> "ocapn://s6h7kpbwzrwbbge75gxh2fe6xgqsvcrhwagmvz4hwi7ziroexjdq.tcp-tls/s/MGLqTn2qdSUT0Z0nH5paXEERDtdziiQ2v5gcUipb2Ao?" ()) In automate/model.scm: 119:2 1 (raise-automate-error _ _ . _) In ice-9/boot-9.scm: 1705:22 0 (raise-exception _ #:continuable? _) pumphouse refused tests/scoped/one: Unknown error occurred with remote object Goblins exception: In message to #<local-object ^scoped-registrar>: (register tests/nap "mago" "/tmp/automate-tests-xhAoLj/automate-def-2cuPxN" (structure (version 3) (name tests/nap) (steps ((step (name nap) (label #f) (group #f) (timeout #f) (error-permitted #f) (outputs (value)) (inputs ())))) (resources ()) (params ()) (outputs ()) (web-ui-options ())) #<remote-object> "ocapn://s6h7kpbwzrwbbge75gxh2fe6xgqsvcrhwagmvz4hwi7ziroexjdq.tcp-tls/s/neExfX2dlA5r72M8fJHtub2sfC2SmR4nW5xb7OVX_Mc?" ()) ice-9/boot-9.scm:1705:22: In procedure raise-exception: ERROR: 1. &automate-error: kind: revoked irritants: ((tests/only tests/scoped/)) 2. &message: "this registration was revoked" 3. &irritants: ((tests/only tests/scoped/)) In goblins/core.scm: 1074:7 3 (syscaller-$ _ #<local-object ^scoped-registrar> (register tests/nap "mago" "/tmp/automate-tests-xhAoLj/automate-def-2cuPxN" (structure (version 3) (name tests/nap) (steps ((step (name nap) (label #f) (group #f) (timeout #f) (error-permitted #f) (outputs (value)) (inputs ())))) (resources ()) (params ()) (outputs ()) (web-ui-options ())) #<remote-object> "ocapn://s6h7kpbwzrwbbge75gxh2fe6xgqsvcrhwagmvz4hwi7ziroexjdq.tcp-tls/s/neExfX2dlA5r72M8fJHtub2sfC2SmR4nW5xb7OVX_Mc?" ())) In automate/pumphouse.scm: 529:6 2 (register tests/nap "mago" "/tmp/automate-tests-xhAoLj/automate-def-2cuPxN" (structure (version 3) (name tests/nap) (steps ((step (name nap) (label #f) (group #f) (timeout #f) (error-permitted #f) (outputs (value)) (inputs ())))) (resources ()) (params ()) (outputs ()) (web-ui-options ())) #<remote-object> "ocapn://s6h7kpbwzrwbbge75gxh2fe6xgqsvcrhwagmvz4hwi7ziroexjdq.tcp-tls/s/neExfX2dlA5r72M8fJHtub2sfC2SmR4nW5xb7OVX_Mc?" ()) In automate/model.scm: 119:2 1 (raise-automate-error _ _ . _) In ice-9/boot-9.scm: 1705:22 0 (raise-exception _ #:continuable? _) pumphouse refused tests/nap: Unknown error occurred with remote object Goblins exception: In message to #<local-object ^scoped-registrar>: (register tests/only "mago" "/tmp/automate-tests-xhAoLj/automate-def-5iL50Y" (structure (version 3) (name tests/only) (steps ((step (name quick) (label #f) (group #f) (timeout #f) (error-permitted #f) (outputs (value)) (inputs ())))) (resources ()) (params ()) (outputs ()) (web-ui-options ())) #<remote-object> "ocapn://sioyd4krldq3gobf4u4htz4u6vahlymcwwfro2ikrul4edkqxoyq.tcp-tls/s/pPFiCIwxqyk9SN1DeJzZINJZ9vGAJA6Ozv01QmbfAMs?" ()) ice-9/boot-9.scm:1705:22: In procedure raise-exception: ERROR: 1. &automate-error: kind: revoked irritants: ((tests/only tests/scoped/)) 2. &message: "this registration was revoked" 3. &irritants: ((tests/only tests/scoped/)) In goblins/core.scm: 1074:7 3 (syscaller-$ _ #<local-object ^scoped-registrar> (register tests/only "mago" "/tmp/automate-tests-xhAoLj/automate-def-5iL50Y" (structure (version 3) (name tests/only) (steps ((step (name quick) (label #f) (group #f) (timeout #f) (error-permitted #f) (outputs (value)) (inputs ())))) (resources ()) (params ()) (outputs ()) (web-ui-options ())) #<remote-object> "ocapn://sioyd4krldq3gobf4u4htz4u6vahlymcwwfro2ikrul4edkqxoyq.tcp-tls/s/pPFiCIwxqyk9SN1DeJzZINJZ9vGAJA6Ozv01QmbfAMs?" ())) In automate/pumphouse.scm: 529:6 2 (register tests/only "mago" "/tmp/automate-tests-xhAoLj/automate-def-5iL50Y" (structure (version 3) (name tests/only) (steps ((step (name quick) (label #f) (group #f) (timeout #f) (error-permitted #f) (outputs (value)) (inputs ())))) (resources ()) (params ()) (outputs ()) (web-ui-options ())) #<remote-object> "ocapn://sioyd4krldq3gobf4u4htz4u6vahlymcwwfro2ikrul4edkqxoyq.tcp-tls/s/pPFiCIwxqyk9SN1DeJzZINJZ9vGAJA6Ozv01QmbfAMs?" ()) In automate/model.scm: 119:2 1 (raise-automate-error _ _ . _) In ice-9/boot-9.scm: 1705:22 0 (raise-exception _ #:continuable? _) pumphouse refused tests/only: Unknown error occurred with remote object Goblins exception: In message to #<local-object ^scoped-registrar>: (register tests/scoped/one "mago" "/tmp/automate-tests-xhAoLj/automate-def-BuZBXR" (structure (version 3) (name tests/scoped/one) (steps ((step (name quick) (label #f) (group #f) (timeout #f) (error-permitted #f) (outputs (value)) (inputs ())))) (resources ()) (params ()) (outputs ()) (web-ui-options ())) #<remote-object> "ocapn://sioyd4krldq3gobf4u4htz4u6vahlymcwwfro2ikrul4edkqxoyq.tcp-tls/s/-lKctVMOchHveIuCDbDK2nMc_3C0tOqeAtlNzsFhS8g?" ()) ice-9/boot-9.scm:1705:22: In procedure raise-exception: ERROR: 1. &automate-error: kind: revoked irritants: ((tests/only tests/scoped/)) 2. &message: "this registration was revoked" 3. &irritants: ((tests/only tests/scoped/)) In goblins/core.scm: 1074:7 3 (syscaller-$ _ #<local-object ^scoped-registrar> (register tests/scoped/one "mago" "/tmp/automate-tests-xhAoLj/automate-def-BuZBXR" (structure (version 3) (name tests/scoped/one) (steps ((step (name quick) (label #f) (group #f) (timeout #f) (error-permitted #f) (outputs (value)) (inputs ())))) (resources ()) (params ()) (outputs ()) (web-ui-options ())) #<remote-object> "ocapn://sioyd4krldq3gobf4u4htz4u6vahlymcwwfro2ikrul4edkqxoyq.tcp-tls/s/-lKctVMOchHveIuCDbDK2nMc_3C0tOqeAtl…" …)) In automate/pumphouse.scm: 529:6 2 (register tests/scoped/one "mago" "/tmp/automate-tests-xhAoLj/automate-def-BuZBXR" (structure (version 3) (name tests/scoped/one) (steps ((step (name quick) (label #f) (group #f) (timeout #f) (error-permitted #f) (outputs (value)) (inputs ())))) (resources ()) (params ()) (outputs ()) (web-ui-options ())) #<remote-object> "ocapn://sioyd4krldq3gobf4u4htz4u6vahlymcwwfro2ikrul4edkqxoyq.tcp-tls/s/-lKctVMOchHveIuCDbDK2nMc_3C0tOqeAtlNzsFhS8g?" ()) In automate/model.scm: 119:2 1 (raise-automate-error _ _ . _) In ice-9/boot-9.scm: 1705:22 0 (raise-exception _ #:continuable? _) pumphouse refused tests/scoped/one: Unknown error occurred with remote object Goblins exception: In message to #<local-object ^scoped-registrar>: (register tests/nap "mago" "/tmp/automate-tests-xhAoLj/automate-def-2cuPxN" (structure (version 3) (name tests/nap) (steps ((step (name nap) (label #f) (group #f) (timeout #f) (error-permitted #f) (outputs (value)) (inputs ())))) (resources ()) (params ()) (outputs ()) (web-ui-options ())) #<remote-object> "ocapn://sioyd4krldq3gobf4u4htz4u6vahlymcwwfro2ikrul4edkqxoyq.tcp-tls/s/C4viV_4lqFrzab9h2UyGQdVCKjo2n_nB2NkN5geQc2o?" ()) ice-9/boot-9.scm:1705:22: In procedure raise-exception: ERROR: 1. &automate-error: kind: revoked irritants: ((tests/only tests/scoped/)) 2. &message: "this registration was revoked" 3. &irritants: ((tests/only tests/scoped/)) In goblins/core.scm: 1074:7 3 (syscaller-$ _ #<local-object ^scoped-registrar> (register tests/nap "mago" "/tmp/automate-tests-xhAoLj/automate-def-2cuPxN" (structure (version 3) (name tests/nap) (steps ((step (name nap) (label #f) (group #f) (timeout #f) (error-permitted #f) (outputs (value)) (inputs ())))) (resources ()) (params ()) (outputs ()) (web-ui-options ())) #<remote-object> "ocapn://sioyd4krldq3gobf4u4htz4u6vahlymcwwfro2ikrul4edkqxoyq.tcp-tls/s/C4viV_4lqFrzab9h2UyGQdVCKjo2n_nB2NkN5geQc2o?" ())) In automate/pumphouse.scm: 529:6 2 (register tests/nap "mago" "/tmp/automate-tests-xhAoLj/automate-def-2cuPxN" (structure (version 3) (name tests/nap) (steps ((step (name nap) (label #f) (group #f) (timeout #f) (error-permitted #f) (outputs (value)) (inputs ())))) (resources ()) (params ()) (outputs ()) (web-ui-options ())) #<remote-object> "ocapn://sioyd4krldq3gobf4u4htz4u6vahlymcwwfro2ikrul4edkqxoyq.tcp-tls/s/C4viV_4lqFrzab9h2UyGQdVCKjo2n_nB2NkN5geQc2o?" ()) In automate/model.scm: 119:2 1 (raise-automate-error _ _ . _) In ice-9/boot-9.scm: 1705:22 0 (raise-exception _ #:continuable? _) pumphouse refused tests/nap: Unknown error occurred with remote object Goblins exception: In message to #<local-object ^scoped-registrar>: (register tests/only "mago" "/tmp/automate-tests-xhAoLj/automate-def-5iL50Y" (structure (version 3) (name tests/only) (steps ((step (name quick) (label #f) (group #f) (timeout #f) (error-permitted #f) (outputs (value)) (inputs ())))) (resources ()) (params ()) (outputs ()) (web-ui-options ())) #<remote-object> "ocapn://nwlt3snyyhbsbaaewco5gsgolf5fblxkuiacybvkenx4hn6m4uga.tcp-tls/s/cTvnf1kz8JGtGfsevtMPZ52GkFDSDfLJ6smtgL5AAMM?" ()) ice-9/boot-9.scm:1705:22: In procedure raise-exception: ERROR: 1. &automate-error: kind: revoked irritants: ((tests/only tests/scoped/)) 2. &message: "this registration was revoked" 3. &irritants: ((tests/only tests/scoped/)) In goblins/core.scm: 1074:7 3 (syscaller-$ _ #<local-object ^scoped-registrar> (register tests/only "mago" "/tmp/automate-tests-xhAoLj/automate-def-5iL50Y" (structure (version 3) (name tests/only) (steps ((step (name quick) (label #f) (group #f) (timeout #f) (error-permitted #f) (outputs (value)) (inputs ())))) (resources ()) (params ()) (outputs ()) (web-ui-options ())) #<remote-object> "ocapn://nwlt3snyyhbsbaaewco5gsgolf5fblxkuiacybvkenx4hn6m4uga.tcp-tls/s/cTvnf1kz8JGtGfsevtMPZ52GkFDSDfLJ6smtgL5AAMM?" ())) In automate/pumphouse.scm: 529:6 2 (register tests/only "mago" "/tmp/automate-tests-xhAoLj/automate-def-5iL50Y" (structure (version 3) (name tests/only) (steps ((step (name quick) (label #f) (group #f) (timeout #f) (error-permitted #f) (outputs (value)) (inputs ())))) (resources ()) (params ()) (outputs ()) (web-ui-options ())) #<remote-object> "ocapn://nwlt3snyyhbsbaaewco5gsgolf5fblxkuiacybvkenx4hn6m4uga.tcp-tls/s/cTvnf1kz8JGtGfsevtMPZ52GkFDSDfLJ6smtgL5AAMM?" ()) In automate/model.scm: 119:2 1 (raise-automate-error _ _ . _) In ice-9/boot-9.scm: 1705:22 0 (raise-exception _ #:continuable? _) pumphouse refused tests/only: Unknown error occurred with remote object Goblins exception: In message to #<local-object ^scoped-registrar>: (register tests/scoped/one "mago" "/tmp/automate-tests-xhAoLj/automate-def-BuZBXR" (structure (version 3) (name tests/scoped/one) (steps ((step (name quick) (label #f) (group #f) (timeout #f) (error-permitted #f) (outputs (value)) (inputs ())))) (resources ()) (params ()) (outputs ()) (web-ui-options ())) #<remote-object> "ocapn://nwlt3snyyhbsbaaewco5gsgolf5fblxkuiacybvkenx4hn6m4uga.tcp-tls/s/L71RH8Jd1KHqtQ6iHrLWPYNI_3N4d5g8aR0l_GhPCl8?" ()) ice-9/boot-9.scm:1705:22: In procedure raise-exception: ERROR: 1. &automate-error: kind: revoked irritants: ((tests/only tests/scoped/)) 2. &message: "this registration was revoked" 3. &irritants: ((tests/only tests/scoped/)) In goblins/core.scm: 1074:7 3 (syscaller-$ _ #<local-object ^scoped-registrar> (register tests/scoped/one "mago" "/tmp/automate-tests-xhAoLj/automate-def-BuZBXR" (structure (version 3) (name tests/scoped/one) (steps ((step (name quick) (label #f) (group #f) (timeout #f) (error-permitted #f) (outputs (value)) (inputs ())))) (resources ()) (params ()) (outputs ()) (web-ui-options ())) #<remote-object> "ocapn://nwlt3snyyhbsbaaewco5gsgolf5fblxkuiacybvkenx4hn6m4uga.tcp-tls/s/L71RH8Jd1KHqtQ6iHrLWPYNI_3N4d5g8aR0…" …)) In automate/pumphouse.scm: 529:6 2 (register tests/scoped/one "mago" "/tmp/automate-tests-xhAoLj/automate-def-BuZBXR" (structure (version 3) (name tests/scoped/one) (steps ((step (name quick) (label #f) (group #f) (timeout #f) (error-permitted #f) (outputs (value)) (inputs ())))) (resources ()) (params ()) (outputs ()) (web-ui-options ())) #<remote-object> "ocapn://nwlt3snyyhbsbaaewco5gsgolf5fblxkuiacybvkenx4hn6m4uga.tcp-tls/s/L71RH8Jd1KHqtQ6iHrLWPYNI_3N4d5g8aR0l_GhPCl8?" ()) In automate/model.scm: 119:2 1 (raise-automate-error _ _ . _) In ice-9/boot-9.scm: 1705:22 0 (raise-exception _ #:continuable? _) lost the pumphouse; reconnecting pumphouse refused tests/scoped/one: Unknown error occurred with remote object Goblins exception: In message to #<local-object ^scoped-registrar>: (register tests/nap "mago" "/tmp/automate-tests-xhAoLj/automate-def-2cuPxN" (structure (version 3) (name tests/nap) (steps ((step (name nap) (label #f) (group #f) (timeout #f) (error-permitted #f) (outputs (value)) (inputs ())))) (resources ()) (params ()) (outputs ()) (web-ui-options ())) #<remote-object> "ocapn://nwlt3snyyhbsbaaewco5gsgolf5fblxkuiacybvkenx4hn6m4uga.tcp-tls/s/TqyZ1UMuULFm7tneJ_2lVuCFfS1RDClng0HRImN3sqU?" ()) ice-9/boot-9.scm:1705:22: In procedure raise-exception: ERROR: 1. &automate-error: kind: revoked irritants: ((tests/only tests/scoped/)) 2. &message: "this registration was revoked" 3. &irritants: ((tests/only tests/scoped/)) In goblins/core.scm: 1074:7 3 (syscaller-$ _ #<local-object ^scoped-registrar> (register tests/nap "mago" "/tmp/automate-tests-xhAoLj/automate-def-2cuPxN" (structure (version 3) (name tests/nap) (steps ((step (name nap) (label #f) (group #f) (timeout #f) (error-permitted #f) (outputs (value)) (inputs ())))) (resources ()) (params ()) (outputs ()) (web-ui-options ())) #<remote-object> "ocapn://nwlt3snyyhbsbaaewco5gsgolf5fblxkuiacybvkenx4hn6m4uga.tcp-tls/s/TqyZ1UMuULFm7tneJ_2lVuCFfS1RDClng0HRImN3sqU?" ())) In automate/pumphouse.scm: 529:6 2 (register tests/nap "mago" "/tmp/automate-tests-xhAoLj/automate-def-2cuPxN" (structure (version 3) (name tests/nap) (steps ((step (name nap) (label #f) (group #f) (timeout #f) (error-permitted #f) (outputs (value)) (inputs ())))) (resources ()) (params ()) (outputs ()) (web-ui-options ())) #<remote-object> "ocapn://nwlt3snyyhbsbaaewco5gsgolf5fblxkuiacybvkenx4hn6m4uga.tcp-tls/s/TqyZ1UMuULFm7tneJ_2lVuCFfS1RDClng0HRImN3sqU?" ()) In automate/model.scm: 119:2 1 (raise-automate-error _ _ . _) In ice-9/boot-9.scm: 1705:22 0 (raise-exception _ #:continuable? _) pumphouse refused tests/nap: Unknown error occurred with remote object Goblins exception: In message to #<local-object ^scoped-registrar>: (register tests/only "mago" "/tmp/automate-tests-xhAoLj/automate-def-5iL50Y" (structure (version 3) (name tests/only) (steps ((step (name quick) (label #f) (group #f) (timeout #f) (error-permitted #f) (outputs (value)) (inputs ())))) (resources ()) (params ()) (outputs ()) (web-ui-options ())) #<remote-object> "ocapn://tu5wcrchqx7en3roysqu3qm7zuhtlqhkeg7fpxxu4d4hmsr3i3aq.tcp-tls/s/CTeuHmdEpvEFhyRRhrWwvxxYraTRACRr6yQMJnPqR20?" ()) ice-9/boot-9.scm:1705:22: In procedure raise-exception: ERROR: 1. &automate-error: kind: revoked irritants: ((tests/only tests/scoped/)) 2. &message: "this registration was revoked" 3. &irritants: ((tests/only tests/scoped/)) In goblins/core.scm: 1074:7 3 (syscaller-$ _ #<local-object ^scoped-registrar> (register tests/only "mago" "/tmp/automate-tests-xhAoLj/automate-def-5iL50Y" (structure (version 3) (name tests/only) (steps ((step (name quick) (label #f) (group #f) (timeout #f) (error-permitted #f) (outputs (value)) (inputs ())))) (resources ()) (params ()) (outputs ()) (web-ui-options ())) #<remote-object> "ocapn://tu5wcrchqx7en3roysqu3qm7zuhtlqhkeg7fpxxu4d4hmsr3i3aq.tcp-tls/s/CTeuHmdEpvEFhyRRhrWwvxxYraTRACRr6yQMJnPqR20?" ())) In automate/pumphouse.scm: 529:6 2 (register tests/only "mago" "/tmp/automate-tests-xhAoLj/automate-def-5iL50Y" (structure (version 3) (name tests/only) (steps ((step (name quick) (label #f) (group #f) (timeout #f) (error-permitted #f) (outputs (value)) (inputs ())))) (resources ()) (params ()) (outputs ()) (web-ui-options ())) #<remote-object> "ocapn://tu5wcrchqx7en3roysqu3qm7zuhtlqhkeg7fpxxu4d4hmsr3i3aq.tcp-tls/s/CTeuHmdEpvEFhyRRhrWwvxxYraTRACRr6yQMJnPqR20?" ()) In automate/model.scm: 119:2 1 (raise-automate-error _ _ . _) In ice-9/boot-9.scm: 1705:22 0 (raise-exception _ #:continuable? _) pumphouse refused tests/only: Unknown error occurred with remote object Goblins exception: In message to #<local-object ^scoped-registrar>: (register tests/scoped/one "mago" "/tmp/automate-tests-xhAoLj/automate-def-BuZBXR" (structure (version 3) (name tests/scoped/one) (steps ((step (name quick) (label #f) (group #f) (timeout #f) (error-permitted #f) (outputs (value)) (inputs ())))) (resources ()) (params ()) (outputs ()) (web-ui-options ())) #<remote-object> "ocapn://tu5wcrchqx7en3roysqu3qm7zuhtlqhkeg7fpxxu4d4hmsr3i3aq.tcp-tls/s/nDkTcP7gwagEwjA5xoePV8NUl4T13HEj2Fo-xz2E5pY?" ()) ice-9/boot-9.scm:1705:22: In procedure raise-exception: ERROR: 1. &automate-error: kind: revoked irritants: ((tests/only tests/scoped/)) 2. &message: "this registration was revoked" 3. &irritants: ((tests/only tests/scoped/)) In goblins/core.scm: 1074:7 3 (syscaller-$ _ #<local-object ^scoped-registrar> (register tests/scoped/one "mago" "/tmp/automate-tests-xhAoLj/automate-def-BuZBXR" (structure (version 3) (name tests/scoped/one) (steps ((step (name quick) (label #f) (group #f) (timeout #f) (error-permitted #f) (outputs (value)) (inputs ())))) (resources ()) (params ()) (outputs ()) (web-ui-options ())) #<remote-object> "ocapn://tu5wcrchqx7en3roysqu3qm7zuhtlqhkeg7fpxxu4d4hmsr3i3aq.tcp-tls/s/nDkTcP7gwagEwjA5xoePV8NUl4T13HEj2Fo…" …)) In automate/pumphouse.scm: 529:6 2 (register tests/scoped/one "mago" "/tmp/automate-tests-xhAoLj/automate-def-BuZBXR" (structure (version 3) (name tests/scoped/one) (steps ((step (name quick) (label #f) (group #f) (timeout #f) (error-permitted #f) (outputs (value)) (inputs ())))) (resources ()) (params ()) (outputs ()) (web-ui-options ())) #<remote-object> "ocapn://tu5wcrchqx7en3roysqu3qm7zuhtlqhkeg7fpxxu4d4hmsr3i3aq.tcp-tls/s/nDkTcP7gwagEwjA5xoePV8NUl4T13HEj2Fo-xz2E5pY?" ()) In automate/model.scm: 119:2 1 (raise-automate-error _ _ . _) In ice-9/boot-9.scm: 1705:22 0 (raise-exception _ #:continuable? _) pumphouse refused tests/scoped/one: Unknown error occurred with remote object Goblins exception: In message to #<local-object ^scoped-registrar>: (register tests/nap "mago" "/tmp/automate-tests-xhAoLj/automate-def-2cuPxN" (structure (version 3) (name tests/nap) (steps ((step (name nap) (label #f) (group #f) (timeout #f) (error-permitted #f) (outputs (value)) (inputs ())))) (resources ()) (params ()) (outputs ()) (web-ui-options ())) #<remote-object> "ocapn://tu5wcrchqx7en3roysqu3qm7zuhtlqhkeg7fpxxu4d4hmsr3i3aq.tcp-tls/s/FNogNJmGMViSgLmfFunM4bkWYMtvOGGwCqCeUciesh8?" ()) ice-9/boot-9.scm:1705:22: In procedure raise-exception: ERROR: 1. &automate-error: kind: revoked irritants: ((tests/only tests/scoped/)) 2. &message: "this registration was revoked" 3. &irritants: ((tests/only tests/scoped/)) In goblins/core.scm: 1074:7 3 (syscaller-$ _ #<local-object ^scoped-registrar> (register tests/nap "mago" "/tmp/automate-tests-xhAoLj/automate-def-2cuPxN" (structure (version 3) (name tests/nap) (steps ((step (name nap) (label #f) (group #f) (timeout #f) (error-permitted #f) (outputs (value)) (inputs ())))) (resources ()) (params ()) (outputs ()) (web-ui-options ())) #<remote-object> "ocapn://tu5wcrchqx7en3roysqu3qm7zuhtlqhkeg7fpxxu4d4hmsr3i3aq.tcp-tls/s/FNogNJmGMViSgLmfFunM4bkWYMtvOGGwCqCeUciesh8?" ())) In automate/pumphouse.scm: 529:6 2 (register tests/nap "mago" "/tmp/automate-tests-xhAoLj/automate-def-2cuPxN" (structure (version 3) (name tests/nap) (steps ((step (name nap) (label #f) (group #f) (timeout #f) (error-permitted #f) (outputs (value)) (inputs ())))) (resources ()) (params ()) (outputs ()) (web-ui-options ())) #<remote-object> "ocapn://tu5wcrchqx7en3roysqu3qm7zuhtlqhkeg7fpxxu4d4hmsr3i3aq.tcp-tls/s/FNogNJmGMViSgLmfFunM4bkWYMtvOGGwCqCeUciesh8?" ()) In automate/model.scm: 119:2 1 (raise-automate-error _ _ . _) In ice-9/boot-9.scm: 1705:22 0 (raise-exception _ #:continuable? _) pumphouse refused tests/nap: Unknown error occurred with remote object attached to the pumphouse of /tmp/automate-tests-xhAoLj/automate-pumphouse-djL4Bo/any Goblins exception: In message to #<local-object ^scoped-registrar>: (register tests/only "mago" "/tmp/automate-tests-xhAoLj/automate-def-5iL50Y" (structure (version 3) (name tests/only) (steps ((step (name quick) (label #f) (group #f) (timeout #f) (error-permitted #f) (outputs (value)) (inputs ())))) (resources ()) (params ()) (outputs ()) (web-ui-options ())) #<remote-object> "ocapn://cxq32d4jscs2neof65soly3fjvpfimufolxnh6kx2slep6q5ikbq.tcp-tls/s/9XoIs1m0y2UpJMYDoaj1YAUFeJFCsj2bbDTXPwRK8WY?" ()) ice-9/boot-9.scm:1705:22: In procedure raise-exception: ERROR: 1. &automate-error: kind: revoked irritants: ((tests/only tests/scoped/)) 2. &message: "this registration was revoked" 3. &irritants: ((tests/only tests/scoped/)) In goblins/core.scm: 1074:7 3 (syscaller-$ _ #<local-object ^scoped-registrar> (register tests/only "mago" "/tmp/automate-tests-xhAoLj/automate-def-5iL50Y" (structure (version 3) (name tests/only) (steps ((step (name quick) (label #f) (group #f) (timeout #f) (error-permitted #f) (outputs (value)) (inputs ())))) (resources ()) (params ()) (outputs ()) (web-ui-options ())) #<remote-object> "ocapn://cxq32d4jscs2neof65soly3fjvpfimufolxnh6kx2slep6q5ikbq.tcp-tls/s/9XoIs1m0y2UpJMYDoaj1YAUFeJFCsj2bbDTXPwRK8WY?" ())) In automate/pumphouse.scm: 529:6 2 (register tests/only "mago" "/tmp/automate-tests-xhAoLj/automate-def-5iL50Y" (structure (version 3) (name tests/only) (steps ((step (name quick) (label #f) (group #f) (timeout #f) (error-permitted #f) (outputs (value)) (inputs ())))) (resources ()) (params ()) (outputs ()) (web-ui-options ())) #<remote-object> "ocapn://cxq32d4jscs2neof65soly3fjvpfimufolxnh6kx2slep6q5ikbq.tcp-tls/s/9XoIs1m0y2UpJMYDoaj1YAUFeJFCsj2bbDTXPwRK8WY?" ()) In automate/model.scm: 119:2 1 (raise-automate-error _ _ . _) In ice-9/boot-9.scm: 1705:22 0 (raise-exception _ #:continuable? _) pumphouse refused tests/only: Unknown error occurred with remote object Goblins exception: In message to #<local-object ^scoped-registrar>: (register tests/scoped/one "mago" "/tmp/automate-tests-xhAoLj/automate-def-BuZBXR" (structure (version 3) (name tests/scoped/one) (steps ((step (name quick) (label #f) (group #f) (timeout #f) (error-permitted #f) (outputs (value)) (inputs ())))) (resources ()) (params ()) (outputs ()) (web-ui-options ())) #<remote-object> "ocapn://cxq32d4jscs2neof65soly3fjvpfimufolxnh6kx2slep6q5ikbq.tcp-tls/s/AQx8CmiX4dDNFXo4K4CpSHFAQi_LzeNod1p58TzylrA?" ()) ice-9/boot-9.scm:1705:22: In procedure raise-exception: ERROR: 1. &automate-error: kind: revoked irritants: ((tests/only tests/scoped/)) 2. &message: "this registration was revoked" 3. &irritants: ((tests/only tests/scoped/)) In goblins/core.scm: 1074:7 3 (syscaller-$ _ #<local-object ^scoped-registrar> (register tests/scoped/one "mago" "/tmp/automate-tests-xhAoLj/automate-def-BuZBXR" (structure (version 3) (name tests/scoped/one) (steps ((step (name quick) (label #f) (group #f) (timeout #f) (error-permitted #f) (outputs (value)) (inputs ())))) (resources ()) (params ()) (outputs ()) (web-ui-options ())) #<remote-object> "ocapn://cxq32d4jscs2neof65soly3fjvpfimufolxnh6kx2slep6q5ikbq.tcp-tls/s/AQx8CmiX4dDNFXo4K4CpSHFAQi_LzeNod1p…" …)) In automate/pumphouse.scm: 529:6 2 (register tests/scoped/one "mago" "/tmp/automate-tests-xhAoLj/automate-def-BuZBXR" (structure (version 3) (name tests/scoped/one) (steps ((step (name quick) (label #f) (group #f) (timeout #f) (error-permitted #f) (outputs (value)) (inputs ())))) (resources ()) (params ()) (outputs ()) (web-ui-options ())) #<remote-object> "ocapn://cxq32d4jscs2neof65soly3fjvpfimufolxnh6kx2slep6q5ikbq.tcp-tls/s/AQx8CmiX4dDNFXo4K4CpSHFAQi_LzeNod1p58TzylrA?" ()) In automate/model.scm: 119:2 1 (raise-automate-error _ _ . _) In ice-9/boot-9.scm: 1705:22 0 (raise-exception _ #:continuable? _) pumphouse refused tests/scoped/one: Unknown error occurred with remote object Goblins exception: In message to #<local-object ^scoped-registrar>: (register tests/nap "mago" "/tmp/automate-tests-xhAoLj/automate-def-2cuPxN" (structure (version 3) (name tests/nap) (steps ((step (name nap) (label #f) (group #f) (timeout #f) (error-permitted #f) (outputs (value)) (inputs ())))) (resources ()) (params ()) (outputs ()) (web-ui-options ())) #<remote-object> "ocapn://cxq32d4jscs2neof65soly3fjvpfimufolxnh6kx2slep6q5ikbq.tcp-tls/s/NzLDUT8RS3XMtNHPrDMC6yufuFRtWpUTs2C1Ln_Z_1o?" ()) ice-9/boot-9.scm:1705:22: In procedure raise-exception: ERROR: 1. &automate-error: kind: revoked irritants: ((tests/only tests/scoped/)) 2. &message: "this registration was revoked" 3. &irritants: ((tests/only tests/scoped/)) In goblins/core.scm: 1074:7 3 (syscaller-$ _ #<local-object ^scoped-registrar> (register tests/nap "mago" "/tmp/automate-tests-xhAoLj/automate-def-2cuPxN" (structure (version 3) (name tests/nap) (steps ((step (name nap) (label #f) (group #f) (timeout #f) (error-permitted #f) (outputs (value)) (inputs ())))) (resources ()) (params ()) (outputs ()) (web-ui-options ())) #<remote-object> "ocapn://cxq32d4jscs2neof65soly3fjvpfimufolxnh6kx2slep6q5ikbq.tcp-tls/s/NzLDUT8RS3XMtNHPrDMC6yufuFRtWpUTs2C1Ln_Z_1o?" ())) In automate/pumphouse.scm: 529:6 2 (register tests/nap "mago" "/tmp/automate-tests-xhAoLj/automate-def-2cuPxN" (structure (version 3) (name tests/nap) (steps ((step (name nap) (label #f) (group #f) (timeout #f) (error-permitted #f) (outputs (value)) (inputs ())))) (resources ()) (params ()) (outputs ()) (web-ui-options ())) #<remote-object> "ocapn://cxq32d4jscs2neof65soly3fjvpfimufolxnh6kx2slep6q5ikbq.tcp-tls/s/NzLDUT8RS3XMtNHPrDMC6yufuFRtWpUTs2C1Ln_Z_1o?" ()) In automate/model.scm: 119:2 1 (raise-automate-error _ _ . _) In ice-9/boot-9.scm: 1705:22 0 (raise-exception _ #:continuable? _) pumphouse refused tests/nap: Unknown error occurred with remote object Goblins exception: In message to #<local-object ^scoped-registrar>: (register tests/only "mago" "/tmp/automate-tests-xhAoLj/automate-def-5iL50Y" (structure (version 3) (name tests/only) (steps ((step (name quick) (label #f) (group #f) (timeout #f) (error-permitted #f) (outputs (value)) (inputs ())))) (resources ()) (params ()) (outputs ()) (web-ui-options ())) #<remote-object> "ocapn://vmrzwfixcysluny7mp47klgsy445p3dckn4pmqsisjj22dm4qbva.tcp-tls/s/AfTvfDL2WuHkZ6y9Ra2jlszZxCxAc1GojQLpfnJ6amc?" ()) ice-9/boot-9.scm:1705:22: In procedure raise-exception: ERROR: 1. &automate-error: kind: revoked irritants: ((tests/only tests/scoped/)) 2. &message: "this registration was revoked" 3. &irritants: ((tests/only tests/scoped/)) In goblins/core.scm: 1074:7 3 (syscaller-$ _ #<local-object ^scoped-registrar> (register tests/only "mago" "/tmp/automate-tests-xhAoLj/automate-def-5iL50Y" (structure (version 3) (name tests/only) (steps ((step (name quick) (label #f) (group #f) (timeout #f) (error-permitted #f) (outputs (value)) (inputs ())))) (resources ()) (params ()) (outputs ()) (web-ui-options ())) #<remote-object> "ocapn://vmrzwfixcysluny7mp47klgsy445p3dckn4pmqsisjj22dm4qbva.tcp-tls/s/AfTvfDL2WuHkZ6y9Ra2jlszZxCxAc1GojQLpfnJ6amc?" ())) In automate/pumphouse.scm: 529:6 2 (register tests/only "mago" "/tmp/automate-tests-xhAoLj/automate-def-5iL50Y" (structure (version 3) (name tests/only) (steps ((step (name quick) (label #f) (group #f) (timeout #f) (error-permitted #f) (outputs (value)) (inputs ())))) (resources ()) (params ()) (outputs ()) (web-ui-options ())) #<remote-object> "ocapn://vmrzwfixcysluny7mp47klgsy445p3dckn4pmqsisjj22dm4qbva.tcp-tls/s/AfTvfDL2WuHkZ6y9Ra2jlszZxCxAc1GojQLpfnJ6amc?" ()) In automate/model.scm: 119:2 1 (raise-automate-error _ _ . _) In ice-9/boot-9.scm: 1705:22 0 (raise-exception _ #:continuable? _) pumphouse refused tests/only: Unknown error occurred with remote object Goblins exception: In message to #<local-object ^scoped-registrar>: (register tests/scoped/one "mago" "/tmp/automate-tests-xhAoLj/automate-def-BuZBXR" (structure (version 3) (name tests/scoped/one) (steps ((step (name quick) (label #f) (group #f) (timeout #f) (error-permitted #f) (outputs (value)) (inputs ())))) (resources ()) (params ()) (outputs ()) (web-ui-options ())) #<remote-object> "ocapn://vmrzwfixcysluny7mp47klgsy445p3dckn4pmqsisjj22dm4qbva.tcp-tls/s/T7XOoqEXUGRNUdLLY7YkATkzCOIE1xf1wIf6CW09dGk?" ()) ice-9/boot-9.scm:1705:22: In procedure raise-exception: ERROR: 1. &automate-error: kind: revoked irritants: ((tests/only tests/scoped/)) 2. &message: "this registration was revoked" 3. &irritants: ((tests/only tests/scoped/)) In goblins/core.scm: 1074:7 3 (syscaller-$ _ #<local-object ^scoped-registrar> (register tests/scoped/one "mago" "/tmp/automate-tests-xhAoLj/automate-def-BuZBXR" (structure (version 3) (name tests/scoped/one) (steps ((step (name quick) (label #f) (group #f) (timeout #f) (error-permitted #f) (outputs (value)) (inputs ())))) (resources ()) (params ()) (outputs ()) (web-ui-options ())) #<remote-object> "ocapn://vmrzwfixcysluny7mp47klgsy445p3dckn4pmqsisjj22dm4qbva.tcp-tls/s/T7XOoqEXUGRNUdLLY7YkATkzCOIE1xf1wIf…" …)) In automate/pumphouse.scm: 529:6 2 (register tests/scoped/one "mago" "/tmp/automate-tests-xhAoLj/automate-def-BuZBXR" (structure (version 3) (name tests/scoped/one) (steps ((step (name quick) (label #f) (group #f) (timeout #f) (error-permitted #f) (outputs (value)) (inputs ())))) (resources ()) (params ()) (outputs ()) (web-ui-options ())) #<remote-object> "ocapn://vmrzwfixcysluny7mp47klgsy445p3dckn4pmqsisjj22dm4qbva.tcp-tls/s/T7XOoqEXUGRNUdLLY7YkATkzCOIE1xf1wIf6CW09dGk?" ()) In automate/model.scm: 119:2 1 (raise-automate-error _ _ . _) In ice-9/boot-9.scm: 1705:22 0 (raise-exception _ #:continuable? _) pumphouse refused tests/scoped/one: Unknown error occurred with remote object Goblins exception: In message to #<local-object ^scoped-registrar>: (register tests/nap "mago" "/tmp/automate-tests-xhAoLj/automate-def-2cuPxN" (structure (version 3) (name tests/nap) (steps ((step (name nap) (label #f) (group #f) (timeout #f) (error-permitted #f) (outputs (value)) (inputs ())))) (resources ()) (params ()) (outputs ()) (web-ui-options ())) #<remote-object> "ocapn://vmrzwfixcysluny7mp47klgsy445p3dckn4pmqsisjj22dm4qbva.tcp-tls/s/zwxXjUOzqtlfPDbw4bLw96TJQARcEWNavFGnNyoG_Gs?" ()) ice-9/boot-9.scm:1705:22: In procedure raise-exception: ERROR: 1. &automate-error: kind: revoked irritants: ((tests/only tests/scoped/)) 2. &message: "this registration was revoked" 3. &irritants: ((tests/only tests/scoped/)) In goblins/core.scm: 1074:7 3 (syscaller-$ _ #<local-object ^scoped-registrar> (register tests/nap "mago" "/tmp/automate-tests-xhAoLj/automate-def-2cuPxN" (structure (version 3) (name tests/nap) (steps ((step (name nap) (label #f) (group #f) (timeout #f) (error-permitted #f) (outputs (value)) (inputs ())))) (resources ()) (params ()) (outputs ()) (web-ui-options ())) #<remote-object> "ocapn://vmrzwfixcysluny7mp47klgsy445p3dckn4pmqsisjj22dm4qbva.tcp-tls/s/zwxXjUOzqtlfPDbw4bLw96TJQARcEWNavFGnNyoG_Gs?" ())) In automate/pumphouse.scm: 529:6 2 (register tests/nap "mago" "/tmp/automate-tests-xhAoLj/automate-def-2cuPxN" (structure (version 3) (name tests/nap) (steps ((step (name nap) (label #f) (group #f) (timeout #f) (error-permitted #f) (outputs (value)) (inputs ())))) (resources ()) (params ()) (outputs ()) (web-ui-options ())) #<remote-object> "ocapn://vmrzwfixcysluny7mp47klgsy445p3dckn4pmqsisjj22dm4qbva.tcp-tls/s/zwxXjUOzqtlfPDbw4bLw96TJQARcEWNavFGnNyoG_Gs?" ()) In automate/model.scm: 119:2 1 (raise-automate-error _ _ . _) In ice-9/boot-9.scm: 1705:22 0 (raise-exception _ #:continuable? _) pumphouse refused tests/nap: Unknown error occurred with remote object Goblins exception: In message to #<local-object ^scoped-registrar>: (register tests/only "mago" "/tmp/automate-tests-xhAoLj/automate-def-5iL50Y" (structure (version 3) (name tests/only) (steps ((step (name quick) (label #f) (group #f) (timeout #f) (error-permitted #f) (outputs (value)) (inputs ())))) (resources ()) (params ()) (outputs ()) (web-ui-options ())) #<remote-object> "ocapn://ivd6hrxryrhjhtn2j5pwdjs6nvep43etqc2dsvckrmbjnt6ti73q.tcp-tls/s/Ia00-cejLAkQTl5krIbgBhxT0rJDgzgokt070HzNuug?" ()) ice-9/boot-9.scm:1705:22: In procedure raise-exception: ERROR: 1. &automate-error: kind: revoked irritants: ((tests/only tests/scoped/)) 2. &message: "this registration was revoked" 3. &irritants: ((tests/only tests/scoped/)) In goblins/core.scm: 1074:7 3 (syscaller-$ _ #<local-object ^scoped-registrar> (register tests/only "mago" "/tmp/automate-tests-xhAoLj/automate-def-5iL50Y" (structure (version 3) (name tests/only) (steps ((step (name quick) (label #f) (group #f) (timeout #f) (error-permitted #f) (outputs (value)) (inputs ())))) (resources ()) (params ()) (outputs ()) (web-ui-options ())) #<remote-object> "ocapn://ivd6hrxryrhjhtn2j5pwdjs6nvep43etqc2dsvckrmbjnt6ti73q.tcp-tls/s/Ia00-cejLAkQTl5krIbgBhxT0rJDgzgokt070HzNuug?" ())) In automate/pumphouse.scm: 529:6 2 (register tests/only "mago" "/tmp/automate-tests-xhAoLj/automate-def-5iL50Y" (structure (version 3) (name tests/only) (steps ((step (name quick) (label #f) (group #f) (timeout #f) (error-permitted #f) (outputs (value)) (inputs ())))) (resources ()) (params ()) (outputs ()) (web-ui-options ())) #<remote-object> "ocapn://ivd6hrxryrhjhtn2j5pwdjs6nvep43etqc2dsvckrmbjnt6ti73q.tcp-tls/s/Ia00-cejLAkQTl5krIbgBhxT0rJDgzgokt070HzNuug?" ()) In automate/model.scm: 119:2 1 (raise-automate-error _ _ . _) In ice-9/boot-9.scm: 1705:22 0 (raise-exception _ #:continuable? _) pumphouse refused tests/only: Unknown error occurred with remote object Goblins exception: In message to #<local-object ^scoped-registrar>: (register tests/scoped/one "mago" "/tmp/automate-tests-xhAoLj/automate-def-BuZBXR" (structure (version 3) (name tests/scoped/one) (steps ((step (name quick) (label #f) (group #f) (timeout #f) (error-permitted #f) (outputs (value)) (inputs ())))) (resources ()) (params ()) (outputs ()) (web-ui-options ())) #<remote-object> "ocapn://ivd6hrxryrhjhtn2j5pwdjs6nvep43etqc2dsvckrmbjnt6ti73q.tcp-tls/s/8o3xXyfP54q0UwBhytpqAS-Mz4yoiy2b5Gmlg8hvQL0?" ()) ice-9/boot-9.scm:1705:22: In procedure raise-exception: ERROR: 1. &automate-error: kind: revoked irritants: ((tests/only tests/scoped/)) 2. &message: "this registration was revoked" 3. &irritants: ((tests/only tests/scoped/)) In goblins/core.scm: 1074:7 3 (syscaller-$ _ #<local-object ^scoped-registrar> (register tests/scoped/one "mago" "/tmp/automate-tests-xhAoLj/automate-def-BuZBXR" (structure (version 3) (name tests/scoped/one) (steps ((step (name quick) (label #f) (group #f) (timeout #f) (error-permitted #f) (outputs (value)) (inputs ())))) (resources ()) (params ()) (outputs ()) (web-ui-options ())) #<remote-object> "ocapn://ivd6hrxryrhjhtn2j5pwdjs6nvep43etqc2dsvckrmbjnt6ti73q.tcp-tls/s/8o3xXyfP54q0UwBhytpqAS-Mz4yoiy2b5Gm…" …)) In automate/pumphouse.scm: 529:6 2 (register tests/scoped/one "mago" "/tmp/automate-tests-xhAoLj/automate-def-BuZBXR" (structure (version 3) (name tests/scoped/one) (steps ((step (name quick) (label #f) (group #f) (timeout #f) (error-permitted #f) (outputs (value)) (inputs ())))) (resources ()) (params ()) (outputs ()) (web-ui-options ())) #<remote-object> "ocapn://ivd6hrxryrhjhtn2j5pwdjs6nvep43etqc2dsvckrmbjnt6ti73q.tcp-tls/s/8o3xXyfP54q0UwBhytpqAS-Mz4yoiy2b5Gmlg8hvQL0?" ()) In automate/model.scm: 119:2 1 (raise-automate-error _ _ . _) In ice-9/boot-9.scm: 1705:22 0 (raise-exception _ #:continuable? _) pumphouse refused tests/scoped/one: Unknown error occurred with remote object Goblins exception: In message to #<local-object ^scoped-registrar>: (register tests/nap "mago" "/tmp/automate-tests-xhAoLj/automate-def-2cuPxN" (structure (version 3) (name tests/nap) (steps ((step (name nap) (label #f) (group #f) (timeout #f) (error-permitted #f) (outputs (value)) (inputs ())))) (resources ()) (params ()) (outputs ()) (web-ui-options ())) #<remote-object> "ocapn://ivd6hrxryrhjhtn2j5pwdjs6nvep43etqc2dsvckrmbjnt6ti73q.tcp-tls/s/Lwln7nRup_uYWUNC3_UsOD3QB9DVWlXJkEJcpc7aqeM?" ()) ice-9/boot-9.scm:1705:22: In procedure raise-exception: ERROR: 1. &automate-error: kind: revoked irritants: ((tests/only tests/scoped/)) 2. &message: "this registration was revoked" 3. &irritants: ((tests/only tests/scoped/)) In goblins/core.scm: 1074:7 3 (syscaller-$ _ #<local-object ^scoped-registrar> (register tests/nap "mago" "/tmp/automate-tests-xhAoLj/automate-def-2cuPxN" (structure (version 3) (name tests/nap) (steps ((step (name nap) (label #f) (group #f) (timeout #f) (error-permitted #f) (outputs (value)) (inputs ())))) (resources ()) (params ()) (outputs ()) (web-ui-options ())) #<remote-object> "ocapn://ivd6hrxryrhjhtn2j5pwdjs6nvep43etqc2dsvckrmbjnt6ti73q.tcp-tls/s/Lwln7nRup_uYWUNC3_UsOD3QB9DVWlXJkEJcpc7aqeM?" ())) In automate/pumphouse.scm: 529:6 2 (register tests/nap "mago" "/tmp/automate-tests-xhAoLj/automate-def-2cuPxN" (structure (version 3) (name tests/nap) (steps ((step (name nap) (label #f) (group #f) (timeout #f) (error-permitted #f) (outputs (value)) (inputs ())))) (resources ()) (params ()) (outputs ()) (web-ui-options ())) #<remote-object> "ocapn://ivd6hrxryrhjhtn2j5pwdjs6nvep43etqc2dsvckrmbjnt6ti73q.tcp-tls/s/Lwln7nRup_uYWUNC3_UsOD3QB9DVWlXJkEJcpc7aqeM?" ()) In automate/model.scm: 119:2 1 (raise-automate-error _ _ . _) In ice-9/boot-9.scm: 1705:22 0 (raise-exception _ #:continuable? _) pumphouse refused tests/nap: Unknown error occurred with remote object Goblins exception: In message to #<local-object ^scoped-registrar>: (register tests/only "mago" "/tmp/automate-tests-xhAoLj/automate-def-5iL50Y" (structure (version 3) (name tests/only) (steps ((step (name quick) (label #f) (group #f) (timeout #f) (error-permitted #f) (outputs (value)) (inputs ())))) (resources ()) (params ()) (outputs ()) (web-ui-options ())) #<remote-object> "ocapn://67pcdo46pxe5zqroh4iznq5kamskp66y3nukww7tof27g2n7xh5q.tcp-tls/s/BC1S_DxgtqQEyDGLvPEZ0gJTzmkwEBbq6kog82HUKK8?" ()) ice-9/boot-9.scm:1705:22: In procedure raise-exception: ERROR: 1. &automate-error: kind: revoked irritants: ((tests/only tests/scoped/)) 2. &message: "this registration was revoked" 3. &irritants: ((tests/only tests/scoped/)) In goblins/core.scm: 1074:7 3 (syscaller-$ _ #<local-object ^scoped-registrar> (register tests/only "mago" "/tmp/automate-tests-xhAoLj/automate-def-5iL50Y" (structure (version 3) (name tests/only) (steps ((step (name quick) (label #f) (group #f) (timeout #f) (error-permitted #f) (outputs (value)) (inputs ())))) (resources ()) (params ()) (outputs ()) (web-ui-options ())) #<remote-object> "ocapn://67pcdo46pxe5zqroh4iznq5kamskp66y3nukww7tof27g2n7xh5q.tcp-tls/s/BC1S_DxgtqQEyDGLvPEZ0gJTzmkwEBbq6kog82HUKK8?" ())) In automate/pumphouse.scm: 529:6 2 (register tests/only "mago" "/tmp/automate-tests-xhAoLj/automate-def-5iL50Y" (structure (version 3) (name tests/only) (steps ((step (name quick) (label #f) (group #f) (timeout #f) (error-permitted #f) (outputs (value)) (inputs ())))) (resources ()) (params ()) (outputs ()) (web-ui-options ())) #<remote-object> "ocapn://67pcdo46pxe5zqroh4iznq5kamskp66y3nukww7tof27g2n7xh5q.tcp-tls/s/BC1S_DxgtqQEyDGLvPEZ0gJTzmkwEBbq6kog82HUKK8?" ()) In automate/model.scm: 119:2 1 (raise-automate-error _ _ . _) In ice-9/boot-9.scm: 1705:22 0 (raise-exception _ #:continuable? _) pumphouse refused tests/only: Unknown error occurred with remote object Goblins exception: In message to #<local-object ^scoped-registrar>: (register tests/scoped/one "mago" "/tmp/automate-tests-xhAoLj/automate-def-BuZBXR" (structure (version 3) (name tests/scoped/one) (steps ((step (name quick) (label #f) (group #f) (timeout #f) (error-permitted #f) (outputs (value)) (inputs ())))) (resources ()) (params ()) (outputs ()) (web-ui-options ())) #<remote-object> "ocapn://67pcdo46pxe5zqroh4iznq5kamskp66y3nukww7tof27g2n7xh5q.tcp-tls/s/iGdrkAN7qSE1zK5_yfUCdXh7aqlp_8hRYjcnMEj_bUo?" ()) ice-9/boot-9.scm:1705:22: In procedure raise-exception: ERROR: 1. &automate-error: kind: revoked irritants: ((tests/only tests/scoped/)) 2. &message: "this registration was revoked" 3. &irritants: ((tests/only tests/scoped/)) In goblins/core.scm: 1074:7 3 (syscaller-$ _ #<local-object ^scoped-registrar> (register tests/scoped/one "mago" "/tmp/automate-tests-xhAoLj/automate-def-BuZBXR" (structure (version 3) (name tests/scoped/one) (steps ((step (name quick) (label #f) (group #f) (timeout #f) (error-permitted #f) (outputs (value)) (inputs ())))) (resources ()) (params ()) (outputs ()) (web-ui-options ())) #<remote-object> "ocapn://67pcdo46pxe5zqroh4iznq5kamskp66y3nukww7tof27g2n7xh5q.tcp-tls/s/iGdrkAN7qSE1zK5_yfUCdXh7aqlp_8hRYjc…" …)) In automate/pumphouse.scm: 529:6 2 (register tests/scoped/one "mago" "/tmp/automate-tests-xhAoLj/automate-def-BuZBXR" (structure (version 3) (name tests/scoped/one) (steps ((step (name quick) (label #f) (group #f) (timeout #f) (error-permitted #f) (outputs (value)) (inputs ())))) (resources ()) (params ()) (outputs ()) (web-ui-options ())) #<remote-object> "ocapn://67pcdo46pxe5zqroh4iznq5kamskp66y3nukww7tof27g2n7xh5q.tcp-tls/s/iGdrkAN7qSE1zK5_yfUCdXh7aqlp_8hRYjcnMEj_bUo?" ()) In automate/model.scm: 119:2 1 (raise-automate-error _ _ . _) In ice-9/boot-9.scm: 1705:22 0 (raise-exception _ #:continuable? _) pumphouse refused tests/scoped/one: Unknown error occurred with remote object Goblins exception: In message to #<local-object ^scoped-registrar>: (register tests/nap "mago" "/tmp/automate-tests-xhAoLj/automate-def-2cuPxN" (structure (version 3) (name tests/nap) (steps ((step (name nap) (label #f) (group #f) (timeout #f) (error-permitted #f) (outputs (value)) (inputs ())))) (resources ()) (params ()) (outputs ()) (web-ui-options ())) #<remote-object> "ocapn://67pcdo46pxe5zqroh4iznq5kamskp66y3nukww7tof27g2n7xh5q.tcp-tls/s/sEmiTz62OmF8ejUTsj4RmXU_Qz4M2INzpUx0LPP6WQM?" ()) ice-9/boot-9.scm:1705:22: In procedure raise-exception: ERROR: 1. &automate-error: kind: revoked irritants: ((tests/only tests/scoped/)) 2. &message: "this registration was revoked" 3. &irritants: ((tests/only tests/scoped/)) In goblins/core.scm: 1074:7 3 (syscaller-$ _ #<local-object ^scoped-registrar> (register tests/nap "mago" "/tmp/automate-tests-xhAoLj/automate-def-2cuPxN" (structure (version 3) (name tests/nap) (steps ((step (name nap) (label #f) (group #f) (timeout #f) (error-permitted #f) (outputs (value)) (inputs ())))) (resources ()) (params ()) (outputs ()) (web-ui-options ())) #<remote-object> "ocapn://67pcdo46pxe5zqroh4iznq5kamskp66y3nukww7tof27g2n7xh5q.tcp-tls/s/sEmiTz62OmF8ejUTsj4RmXU_Qz4M2INzpUx0LPP6WQM?" ())) In automate/pumphouse.scm: 529:6 2 (register tests/nap "mago" "/tmp/automate-tests-xhAoLj/automate-def-2cuPxN" (structure (version 3) (name tests/nap) (steps ((step (name nap) (label #f) (group #f) (timeout #f) (error-permitted #f) (outputs (value)) (inputs ())))) (resources ()) (params ()) (outputs ()) (web-ui-options ())) #<remote-object> "ocapn://67pcdo46pxe5zqroh4iznq5kamskp66y3nukww7tof27g2n7xh5q.tcp-tls/s/sEmiTz62OmF8ejUTsj4RmXU_Qz4M2INzpUx0LPP6WQM?" ()) In automate/model.scm: 119:2 1 (raise-automate-error _ _ . _) In ice-9/boot-9.scm: 1705:22 0 (raise-exception _ #:continuable? _) pumphouse refused tests/nap: Unknown error occurred with remote object Goblins exception: In message to #<local-object ^scoped-registrar>: (register tests/only "mago" "/tmp/automate-tests-xhAoLj/automate-def-5iL50Y" (structure (version 3) (name tests/only) (steps ((step (name quick) (label #f) (group #f) (timeout #f) (error-permitted #f) (outputs (value)) (inputs ())))) (resources ()) (params ()) (outputs ()) (web-ui-options ())) #<remote-object> "ocapn://rpvc2g4pbzg3fwnsmcibdwi5a7pm6yfgyq2ep5y5g2xw2nxngvtq.tcp-tls/s/UhF8KbDiONa0MKZlwEjdfyApvuFTNyLRdnn47n8eGbQ?" ()) ice-9/boot-9.scm:1705:22: In procedure raise-exception: ERROR: 1. &automate-error: kind: revoked irritants: ((tests/only tests/scoped/)) 2. &message: "this registration was revoked" 3. &irritants: ((tests/only tests/scoped/)) In goblins/core.scm: 1074:7 3 (syscaller-$ _ #<local-object ^scoped-registrar> (register tests/only "mago" "/tmp/automate-tests-xhAoLj/automate-def-5iL50Y" (structure (version 3) (name tests/only) (steps ((step (name quick) (label #f) (group #f) (timeout #f) (error-permitted #f) (outputs (value)) (inputs ())))) (resources ()) (params ()) (outputs ()) (web-ui-options ())) #<remote-object> "ocapn://rpvc2g4pbzg3fwnsmcibdwi5a7pm6yfgyq2ep5y5g2xw2nxngvtq.tcp-tls/s/UhF8KbDiONa0MKZlwEjdfyApvuFTNyLRdnn47n8eGbQ?" ())) In automate/pumphouse.scm: 529:6 2 (register tests/only "mago" "/tmp/automate-tests-xhAoLj/automate-def-5iL50Y" (structure (version 3) (name tests/only) (steps ((step (name quick) (label #f) (group #f) (timeout #f) (error-permitted #f) (outputs (value)) (inputs ())))) (resources ()) (params ()) (outputs ()) (web-ui-options ())) #<remote-object> "ocapn://rpvc2g4pbzg3fwnsmcibdwi5a7pm6yfgyq2ep5y5g2xw2nxngvtq.tcp-tls/s/UhF8KbDiONa0MKZlwEjdfyApvuFTNyLRdnn47n8eGbQ?" ()) In automate/model.scm: 119:2 1 (raise-automate-error _ _ . _) In ice-9/boot-9.scm: 1705:22 0 (raise-exception _ #:continuable? _) pumphouse refused tests/only: Unknown error occurred with remote object Goblins exception: In message to #<local-object ^scoped-registrar>: (register tests/scoped/one "mago" "/tmp/automate-tests-xhAoLj/automate-def-BuZBXR" (structure (version 3) (name tests/scoped/one) (steps ((step (name quick) (label #f) (group #f) (timeout #f) (error-permitted #f) (outputs (value)) (inputs ())))) (resources ()) (params ()) (outputs ()) (web-ui-options ())) #<remote-object> "ocapn://rpvc2g4pbzg3fwnsmcibdwi5a7pm6yfgyq2ep5y5g2xw2nxngvtq.tcp-tls/s/5SZqcwpzcRUVQCCEPdz7qiwjUumqUjxzV01NF9MJtZU?" ()) ice-9/boot-9.scm:1705:22: In procedure raise-exception: ERROR: 1. &automate-error: kind: revoked irritants: ((tests/only tests/scoped/)) 2. &message: "this registration was revoked" 3. &irritants: ((tests/only tests/scoped/)) In goblins/core.scm: 1074:7 3 (syscaller-$ _ #<local-object ^scoped-registrar> (register tests/scoped/one "mago" "/tmp/automate-tests-xhAoLj/automate-def-BuZBXR" (structure (version 3) (name tests/scoped/one) (steps ((step (name quick) (label #f) (group #f) (timeout #f) (error-permitted #f) (outputs (value)) (inputs ())))) (resources ()) (params ()) (outputs ()) (web-ui-options ())) #<remote-object> "ocapn://rpvc2g4pbzg3fwnsmcibdwi5a7pm6yfgyq2ep5y5g2xw2nxngvtq.tcp-tls/s/5SZqcwpzcRUVQCCEPdz7qiwjUumqUjxzV01…" …)) In automate/pumphouse.scm: 529:6 2 (register tests/scoped/one "mago" "/tmp/automate-tests-xhAoLj/automate-def-BuZBXR" (structure (version 3) (name tests/scoped/one) (steps ((step (name quick) (label #f) (group #f) (timeout #f) (error-permitted #f) (outputs (value)) (inputs ())))) (resources ()) (params ()) (outputs ()) (web-ui-options ())) #<remote-object> "ocapn://rpvc2g4pbzg3fwnsmcibdwi5a7pm6yfgyq2ep5y5g2xw2nxngvtq.tcp-tls/s/5SZqcwpzcRUVQCCEPdz7qiwjUumqUjxzV01NF9MJtZU?" ()) In automate/model.scm: 119:2 1 (raise-automate-error _ _ . _) In ice-9/boot-9.scm: 1705:22 0 (raise-exception _ #:continuable? _) pumphouse refused tests/scoped/one: Unknown error occurred with remote object Goblins exception: In message to #<local-object ^scoped-registrar>: (register tests/nap "mago" "/tmp/automate-tests-xhAoLj/automate-def-2cuPxN" (structure (version 3) (name tests/nap) (steps ((step (name nap) (label #f) (group #f) (timeout #f) (error-permitted #f) (outputs (value)) (inputs ())))) (resources ()) (params ()) (outputs ()) (web-ui-options ())) #<remote-object> "ocapn://rpvc2g4pbzg3fwnsmcibdwi5a7pm6yfgyq2ep5y5g2xw2nxngvtq.tcp-tls/s/pJq_HWzjnCoejTzulL8ry2TdcesOUeZhZfoqWvaBOXM?" ()) ice-9/boot-9.scm:1705:22: In procedure raise-exception: ERROR: 1. &automate-error: kind: revoked irritants: ((tests/only tests/scoped/)) 2. &message: "this registration was revoked" 3. &irritants: ((tests/only tests/scoped/)) In goblins/core.scm: 1074:7 3 (syscaller-$ _ #<local-object ^scoped-registrar> (register tests/nap "mago" "/tmp/automate-tests-xhAoLj/automate-def-2cuPxN" (structure (version 3) (name tests/nap) (steps ((step (name nap) (label #f) (group #f) (timeout #f) (error-permitted #f) (outputs (value)) (inputs ())))) (resources ()) (params ()) (outputs ()) (web-ui-options ())) #<remote-object> "ocapn://rpvc2g4pbzg3fwnsmcibdwi5a7pm6yfgyq2ep5y5g2xw2nxngvtq.tcp-tls/s/pJq_HWzjnCoejTzulL8ry2TdcesOUeZhZfoqWvaBOXM?" ())) In automate/pumphouse.scm: 529:6 2 (register tests/nap "mago" "/tmp/automate-tests-xhAoLj/automate-def-2cuPxN" (structure (version 3) (name tests/nap) (steps ((step (name nap) (label #f) (group #f) (timeout #f) (error-permitted #f) (outputs (value)) (inputs ())))) (resources ()) (params ()) (outputs ()) (web-ui-options ())) #<remote-object> "ocapn://rpvc2g4pbzg3fwnsmcibdwi5a7pm6yfgyq2ep5y5g2xw2nxngvtq.tcp-tls/s/pJq_HWzjnCoejTzulL8ry2TdcesOUeZhZfoqWvaBOXM?" ()) In automate/model.scm: 119:2 1 (raise-automate-error _ _ . _) In ice-9/boot-9.scm: 1705:22 0 (raise-exception _ #:continuable? _) pumphouse refused tests/nap: Unknown error occurred with remote object Goblins exception: In message to #<local-object ^scoped-registrar>: (register tests/only "mago" "/tmp/automate-tests-xhAoLj/automate-def-5iL50Y" (structure (version 3) (name tests/only) (steps ((step (name quick) (label #f) (group #f) (timeout #f) (error-permitted #f) (outputs (value)) (inputs ())))) (resources ()) (params ()) (outputs ()) (web-ui-options ())) #<remote-object> "ocapn://ol2jor463luuvupaz2u3vyolweaefxgvpb5hxt6htj3rsxxtrsvq.tcp-tls/s/OTLw7CKoBTxy_AYMOcg-VsCdqe5P_S0SnA0nuRXD4Ng?" ()) ice-9/boot-9.scm:1705:22: In procedure raise-exception: ERROR: 1. &automate-error: kind: revoked irritants: ((tests/only tests/scoped/)) 2. &message: "this registration was revoked" 3. &irritants: ((tests/only tests/scoped/)) In goblins/core.scm: 1074:7 3 (syscaller-$ _ #<local-object ^scoped-registrar> (register tests/only "mago" "/tmp/automate-tests-xhAoLj/automate-def-5iL50Y" (structure (version 3) (name tests/only) (steps ((step (name quick) (label #f) (group #f) (timeout #f) (error-permitted #f) (outputs (value)) (inputs ())))) (resources ()) (params ()) (outputs ()) (web-ui-options ())) #<remote-object> "ocapn://ol2jor463luuvupaz2u3vyolweaefxgvpb5hxt6htj3rsxxtrsvq.tcp-tls/s/OTLw7CKoBTxy_AYMOcg-VsCdqe5P_S0SnA0nuRXD4Ng?" ())) In automate/pumphouse.scm: 529:6 2 (register tests/only "mago" "/tmp/automate-tests-xhAoLj/automate-def-5iL50Y" (structure (version 3) (name tests/only) (steps ((step (name quick) (label #f) (group #f) (timeout #f) (error-permitted #f) (outputs (value)) (inputs ())))) (resources ()) (params ()) (outputs ()) (web-ui-options ())) #<remote-object> "ocapn://ol2jor463luuvupaz2u3vyolweaefxgvpb5hxt6htj3rsxxtrsvq.tcp-tls/s/OTLw7CKoBTxy_AYMOcg-VsCdqe5P_S0SnA0nuRXD4Ng?" ()) In automate/model.scm: 119:2 1 (raise-automate-error _ _ . _) In ice-9/boot-9.scm: 1705:22 0 (raise-exception _ #:continuable? _) pumphouse refused tests/only: Unknown error occurred with remote object Goblins exception: In message to #<local-object ^scoped-registrar>: (register tests/scoped/one "mago" "/tmp/automate-tests-xhAoLj/automate-def-BuZBXR" (structure (version 3) (name tests/scoped/one) (steps ((step (name quick) (label #f) (group #f) (timeout #f) (error-permitted #f) (outputs (value)) (inputs ())))) (resources ()) (params ()) (outputs ()) (web-ui-options ())) #<remote-object> "ocapn://ol2jor463luuvupaz2u3vyolweaefxgvpb5hxt6htj3rsxxtrsvq.tcp-tls/s/nB4QnAU0O3KMVkDfMLbBg82pK8yY0eaCQK3KF72EOVw?" ()) ice-9/boot-9.scm:1705:22: In procedure raise-exception: ERROR: 1. &automate-error: kind: revoked irritants: ((tests/only tests/scoped/)) 2. &message: "this registration was revoked" 3. &irritants: ((tests/only tests/scoped/)) In goblins/core.scm: 1074:7 3 (syscaller-$ _ #<local-object ^scoped-registrar> (register tests/scoped/one "mago" "/tmp/automate-tests-xhAoLj/automate-def-BuZBXR" (structure (version 3) (name tests/scoped/one) (steps ((step (name quick) (label #f) (group #f) (timeout #f) (error-permitted #f) (outputs (value)) (inputs ())))) (resources ()) (params ()) (outputs ()) (web-ui-options ())) #<remote-object> "ocapn://ol2jor463luuvupaz2u3vyolweaefxgvpb5hxt6htj3rsxxtrsvq.tcp-tls/s/nB4QnAU0O3KMVkDfMLbBg82pK8yY0eaCQK3…" …)) In automate/pumphouse.scm: 529:6 2 (register tests/scoped/one "mago" "/tmp/automate-tests-xhAoLj/automate-def-BuZBXR" (structure (version 3) (name tests/scoped/one) (steps ((step (name quick) (label #f) (group #f) (timeout #f) (error-permitted #f) (outputs (value)) (inputs ())))) (resources ()) (params ()) (outputs ()) (web-ui-options ())) #<remote-object> "ocapn://ol2jor463luuvupaz2u3vyolweaefxgvpb5hxt6htj3rsxxtrsvq.tcp-tls/s/nB4QnAU0O3KMVkDfMLbBg82pK8yY0eaCQK3KF72EOVw?" ()) In automate/model.scm: 119:2 1 (raise-automate-error _ _ . _) In ice-9/boot-9.scm: 1705:22 0 (raise-exception _ #:continuable? _) pumphouse refused tests/scoped/one: Unknown error occurred with remote object Goblins exception: In message to #<local-object ^scoped-registrar>: (register tests/nap "mago" "/tmp/automate-tests-xhAoLj/automate-def-2cuPxN" (structure (version 3) (name tests/nap) (steps ((step (name nap) (label #f) (group #f) (timeout #f) (error-permitted #f) (outputs (value)) (inputs ())))) (resources ()) (params ()) (outputs ()) (web-ui-options ())) #<remote-object> "ocapn://ol2jor463luuvupaz2u3vyolweaefxgvpb5hxt6htj3rsxxtrsvq.tcp-tls/s/ujaCV9d6S8_uzo0chNPhWTeKxXOJi83eMBSA1iZMHkU?" ()) ice-9/boot-9.scm:1705:22: In procedure raise-exception: ERROR: 1. &automate-error: kind: revoked irritants: ((tests/only tests/scoped/)) 2. &message: "this registration was revoked" 3. &irritants: ((tests/only tests/scoped/)) In goblins/core.scm: 1074:7 3 (syscaller-$ _ #<local-object ^scoped-registrar> (register tests/nap "mago" "/tmp/automate-tests-xhAoLj/automate-def-2cuPxN" (structure (version 3) (name tests/nap) (steps ((step (name nap) (label #f) (group #f) (timeout #f) (error-permitted #f) (outputs (value)) (inputs ())))) (resources ()) (params ()) (outputs ()) (web-ui-options ())) #<remote-object> "ocapn://ol2jor463luuvupaz2u3vyolweaefxgvpb5hxt6htj3rsxxtrsvq.tcp-tls/s/ujaCV9d6S8_uzo0chNPhWTeKxXOJi83eMBSA1iZMHkU?" ())) In automate/pumphouse.scm: 529:6 2 (register tests/nap "mago" "/tmp/automate-tests-xhAoLj/automate-def-2cuPxN" (structure (version 3) (name tests/nap) (steps ((step (name nap) (label #f) (group #f) (timeout #f) (error-permitted #f) (outputs (value)) (inputs ())))) (resources ()) (params ()) (outputs ()) (web-ui-options ())) #<remote-object> "ocapn://ol2jor463luuvupaz2u3vyolweaefxgvpb5hxt6htj3rsxxtrsvq.tcp-tls/s/ujaCV9d6S8_uzo0chNPhWTeKxXOJi83eMBSA1iZMHkU?" ()) In automate/model.scm: 119:2 1 (raise-automate-error _ _ . _) In ice-9/boot-9.scm: 1705:22 0 (raise-exception _ #:continuable? _) pumphouse refused tests/nap: Unknown error occurred with remote object lost the pumphouse; reconnecting Goblins exception: In message to #<local-object ^scoped-registrar>: (register tests/only "mago" "/tmp/automate-tests-xhAoLj/automate-def-5iL50Y" (structure (version 3) (name tests/only) (steps ((step (name quick) (label #f) (group #f) (timeout #f) (error-permitted #f) (outputs (value)) (inputs ())))) (resources ()) (params ()) (outputs ()) (web-ui-options ())) #<remote-object> "ocapn://hkhrmdbtm5xtpscfvezr3gn3pbvwym2k46hpytr5qyb5nyogmc2q.tcp-tls/s/7oOQPNJkeLtVqZUyeIGz43yLYcqSmMCS3TXigd563w0?" ()) ice-9/boot-9.scm:1705:22: In procedure raise-exception: ERROR: 1. &automate-error: kind: revoked irritants: ((tests/only tests/scoped/)) 2. &message: "this registration was revoked" 3. &irritants: ((tests/only tests/scoped/)) In goblins/core.scm: 1074:7 3 (syscaller-$ _ #<local-object ^scoped-registrar> (register tests/only "mago" "/tmp/automate-tests-xhAoLj/automate-def-5iL50Y" (structure (version 3) (name tests/only) (steps ((step (name quick) (label #f) (group #f) (timeout #f) (error-permitted #f) (outputs (value)) (inputs ())))) (resources ()) (params ()) (outputs ()) (web-ui-options ())) #<remote-object> "ocapn://hkhrmdbtm5xtpscfvezr3gn3pbvwym2k46hpytr5qyb5nyogmc2q.tcp-tls/s/7oOQPNJkeLtVqZUyeIGz43yLYcqSmMCS3TXigd563w0?" ())) In automate/pumphouse.scm: 529:6 2 (register tests/only "mago" "/tmp/automate-tests-xhAoLj/automate-def-5iL50Y" (structure (version 3) (name tests/only) (steps ((step (name quick) (label #f) (group #f) (timeout #f) (error-permitted #f) (outputs (value)) (inputs ())))) (resources ()) (params ()) (outputs ()) (web-ui-options ())) #<remote-object> "ocapn://hkhrmdbtm5xtpscfvezr3gn3pbvwym2k46hpytr5qyb5nyogmc2q.tcp-tls/s/7oOQPNJkeLtVqZUyeIGz43yLYcqSmMCS3TXigd563w0?" ()) In automate/model.scm: 119:2 1 (raise-automate-error _ _ . _) In ice-9/boot-9.scm: 1705:22 0 (raise-exception _ #:continuable? _) pumphouse refused tests/only: Unknown error occurred with remote object Goblins exception: In message to #<local-object ^scoped-registrar>: (register tests/scoped/one "mago" "/tmp/automate-tests-xhAoLj/automate-def-BuZBXR" (structure (version 3) (name tests/scoped/one) (steps ((step (name quick) (label #f) (group #f) (timeout #f) (error-permitted #f) (outputs (value)) (inputs ())))) (resources ()) (params ()) (outputs ()) (web-ui-options ())) #<remote-object> "ocapn://hkhrmdbtm5xtpscfvezr3gn3pbvwym2k46hpytr5qyb5nyogmc2q.tcp-tls/s/hqwgnxcgqnyWY_sIo9fROBKmHmAnE8v-tOKyGnZ_KLU?" ()) ice-9/boot-9.scm:1705:22: In procedure raise-exception: ERROR: 1. &automate-error: kind: revoked irritants: ((tests/only tests/scoped/)) 2. &message: "this registration was revoked" 3. &irritants: ((tests/only tests/scoped/)) In goblins/core.scm: 1074:7 3 (syscaller-$ _ #<local-object ^scoped-registrar> (register tests/scoped/one "mago" "/tmp/automate-tests-xhAoLj/automate-def-BuZBXR" (structure (version 3) (name tests/scoped/one) (steps ((step (name quick) (label #f) (group #f) (timeout #f) (error-permitted #f) (outputs (value)) (inputs ())))) (resources ()) (params ()) (outputs ()) (web-ui-options ())) #<remote-object> "ocapn://hkhrmdbtm5xtpscfvezr3gn3pbvwym2k46hpytr5qyb5nyogmc2q.tcp-tls/s/hqwgnxcgqnyWY_sIo9fROBKmHmAnE8v-tOK…" …)) In automate/pumphouse.scm: 529:6 2 (register tests/scoped/one "mago" "/tmp/automate-tests-xhAoLj/automate-def-BuZBXR" (structure (version 3) (name tests/scoped/one) (steps ((step (name quick) (label #f) (group #f) (timeout #f) (error-permitted #f) (outputs (value)) (inputs ())))) (resources ()) (params ()) (outputs ()) (web-ui-options ())) #<remote-object> "ocapn://hkhrmdbtm5xtpscfvezr3gn3pbvwym2k46hpytr5qyb5nyogmc2q.tcp-tls/s/hqwgnxcgqnyWY_sIo9fROBKmHmAnE8v-tOKyGnZ_KLU?" ()) In automate/model.scm: 119:2 1 (raise-automate-error _ _ . _) In ice-9/boot-9.scm: 1705:22 0 (raise-exception _ #:continuable? _) pumphouse refused tests/scoped/one: Unknown error occurred with remote object Goblins exception: In message to #<local-object ^scoped-registrar>: (register tests/nap "mago" "/tmp/automate-tests-xhAoLj/automate-def-2cuPxN" (structure (version 3) (name tests/nap) (steps ((step (name nap) (label #f) (group #f) (timeout #f) (error-permitted #f) (outputs (value)) (inputs ())))) (resources ()) (params ()) (outputs ()) (web-ui-options ())) #<remote-object> "ocapn://hkhrmdbtm5xtpscfvezr3gn3pbvwym2k46hpytr5qyb5nyogmc2q.tcp-tls/s/PgCDLpL6WULJw79r0hDHTkvnRNKDKqr5oAPWCF-g0Pw?" ()) ice-9/boot-9.scm:1705:22: In procedure raise-exception: ERROR: 1. &automate-error: kind: revoked irritants: ((tests/only tests/scoped/)) 2. &message: "this registration was revoked" 3. &irritants: ((tests/only tests/scoped/)) In goblins/core.scm: 1074:7 3 (syscaller-$ _ #<local-object ^scoped-registrar> (register tests/nap "mago" "/tmp/automate-tests-xhAoLj/automate-def-2cuPxN" (structure (version 3) (name tests/nap) (steps ((step (name nap) (label #f) (group #f) (timeout #f) (error-permitted #f) (outputs (value)) (inputs ())))) (resources ()) (params ()) (outputs ()) (web-ui-options ())) #<remote-object> "ocapn://hkhrmdbtm5xtpscfvezr3gn3pbvwym2k46hpytr5qyb5nyogmc2q.tcp-tls/s/PgCDLpL6WULJw79r0hDHTkvnRNKDKqr5oAPWCF-g0Pw?" ())) In automate/pumphouse.scm: 529:6 2 (register tests/nap "mago" "/tmp/automate-tests-xhAoLj/automate-def-2cuPxN" (structure (version 3) (name tests/nap) (steps ((step (name nap) (label #f) (group #f) (timeout #f) (error-permitted #f) (outputs (value)) (inputs ())))) (resources ()) (params ()) (outputs ()) (web-ui-options ())) #<remote-object> "ocapn://hkhrmdbtm5xtpscfvezr3gn3pbvwym2k46hpytr5qyb5nyogmc2q.tcp-tls/s/PgCDLpL6WULJw79r0hDHTkvnRNKDKqr5oAPWCF-g0Pw?" ()) In automate/model.scm: 119:2 1 (raise-automate-error _ _ . _) In ice-9/boot-9.scm: 1705:22 0 (raise-exception _ #:continuable? _) 2026-10-14 19:06:50 (with-exception-handler) INFO: POST /output/8e61b095e1214afc/stop 200 84ms pumphouse refused tests/nap: Unknown error occurred with remote object 2026-10-14 19:06:50 (with-exception-handler) INFO: POST /output/8e61b095e1214afc/stop-self 200 21ms attached to the pumphouse of /tmp/automate-tests-xhAoLj/automate-pumphouse-djL4Bo/any warning: mutating the process environment while multiple threads are running; further behavior unspecified. In goblins/core.scm: 1074:7 4 (syscaller-$ _ #<local-object ^call-with-vat> ()) In unknown file: 3 (_ #<procedure list _>) In automate/pumphouse/client.scm: 168:7 2 (spawn-pumphouse-netlayer _ "/tmp/automate-tests-xhAoLj/automate-pumphouse-djL4Bo/no-socket") In automate/model.scm: 119:2 1 (raise-automate-error _ _ . _) In ice-9/boot-9.scm: 1705:22 0 (raise-exception _ #:continuable? _) == pumphouse.scm fail: the first run of a parameter value lists no earlier run expected: () actual: #f fail: the next lists the first, with what it answered expected: (("c2e3fdce56b85464" ())) actual: () fail: a value written differently is another value expected: () actual: #f fail: the checks of another value are apart expected: (first #f) actual: #f fail: a step aborts a run of a pipeline its run-control names expected: aborting actual: #f fail: but not its own run expected: not-permitted actual: #f fail: the run it aborted errored expected: errored actual: succeeded fail: and says which run aborted it fail: aborting a finished run answers that it finished expected: finished actual: #f stop 1189: kill #<unspecified>, waitpid (1189 . 9) stop 1093: kill #<unspecified>, waitpid (1093 . 9) stop 1030: kill #<unspecified>, waitpid (1030 . 0) 126 passed, 9 failed FAIL tests/pumphouse.scm (exit status: 1) ============================================================================ Testsuite summary for guile-automate 0.0.0-dev ============================================================================ # TOTAL: 37 # PASS: 36 # SKIP: 0 # XFAIL: 0 # FAIL: 1 # XPASS: 0 # ERROR: 0 ============================================================================ See ./test-suite.log for debugging. ============================================================================ make[3]: *** [Makefile:986: test-suite.log] Error 1 make[3]: Leaving directory '/home/chris/pipeline-shepherd/state/work/automate-pipelines/automate-tbdYWg/automate-work-OGHqtJ/workspace/source' make[2]: *** [Makefile:1121: check-TESTS] Error 2 make[2]: Leaving directory '/home/chris/pipeline-shepherd/state/work/automate-pipelines/automate-tbdYWg/automate-work-OGHqtJ/workspace/source' make[1]: *** [Makefile:1343: check-am] Error 2 make[1]: Leaving directory '/home/chris/pipeline-shepherd/state/work/automate-pipelines/automate-tbdYWg/automate-work-OGHqtJ/workspace/source' make: *** [Makefile:872: check-recursive] Error 1 error: #<&invoke-error program: "/gnu/store/wavrmrs065ikbava5mmvql3l8y4gp6ms-profile/bin/bash" arguments: ("-c" "set -eo pipefail\nexport GUIX_PROFILE=/gnu/store/wavrmrs065ikbava5mmvql3l8y4gp6ms-profile\nsource \"$GUIX_PROFILE/etc/profile\"\ncd /home/chris/pipeline-shepherd/state/work/automate-pipelines/automate-tbdYWg/automate-work-OGHqtJ/workspace/source\nexport XDG_CACHE_HOME=\"$TMPDIR/cache\"\nmake check -j$(nproc) VERBOSE=1") exit-status: 2 term-signal: #f stop-signal: #f> backtrace: automate/pipeline/step.scm:675:62 (_) automate/step-body/check.scm:23:4 (body-thunk) guix/build/utils.scm:822:6 (invoke)