d2091f2cb63e1675 / check errored

Started
Duration
3m 8s

Defined at .automate/pipelines.scm:117

Making check in .
make[1]: Entering directory '/home/chris/pipeline-shepherd/state/work/automate-pipelines/automate-tbdYWg/automate-work-Bdjwb0/workspace/source'
make  tests/support.go tests/pumphouse/support.go tests/attach.scm.go tests/authority.scm.go tests/check.scm.go tests/contain.scm.go tests/dispatch.scm.go tests/errors.scm.go tests/events.scm.go tests/files.scm.go tests/forgejo.scm.go tests/http.scm.go tests/layout.scm.go tests/masking.scm.go tests/metrics.scm.go tests/pages.scm.go tests/model.scm.go tests/output-marks.scm.go tests/notify.scm.go tests/pipeline.scm.go tests/pipeline-shepherd.scm.go tests/processes.scm.go tests/pumphouse.scm.go tests/pumphouse-draining.scm.go tests/pumphouse-lost.scm.go tests/pumphouse-replay.scm.go tests/pumphouse-restart.scm.go tests/pumphouse-shepherd.scm.go tests/pumphouse-stopping.scm.go tests/pumphouse-timers.scm.go tests/reconnect.scm.go tests/records.scm.go tests/relay.scm.go tests/run-query.scm.go tests/shepherd-bridge.scm.go tests/repl.scm.go tests/scope.scm.go tests/source.scm.go tests/step-scheduling.scm.go tests/uploader.scm.go
make[2]: Entering directory '/home/chris/pipeline-shepherd/state/work/automate-pipelines/automate-tbdYWg/automate-work-Bdjwb0/workspace/source'
./pre-inst-env /gnu/store/wavrmrs065ikbava5mmvql3l8y4gp6ms-profile/bin/guild compile  -W1 -Wunbound-variable -Warity-mismatch -Wformat -Wunused-module -Wshadowed-toplevel -o "tests/support.go" "tests/support.scm"
./pre-inst-env /gnu/store/wavrmrs065ikbava5mmvql3l8y4gp6ms-profile/bin/guild compile  -W1 -Wunbound-variable -Warity-mismatch -Wformat -Wunused-module -Wshadowed-toplevel -o "tests/pumphouse/support.go" "tests/pumphouse/support.scm"
wrote `tests/support.go'
;;; note: auto-compilation is enabled, set GUILE_AUTO_COMPILE=0
;;;       or pass the --no-auto-compile argument to disable.
;;; compiling /gnu/store/wavrmrs065ikbava5mmvql3l8y4gp6ms-profile/bin/guild
;;; compiled /tmp/cache/guile/ccache/3.0-LE-8-4.7/gnu/store/k7vkw9x3wl3lni6a0i2w8xz2z8ylrqyz-guile-3.0.11/bin/guild.go
wrote `tests/pumphouse/support.go'
;;; note: auto-compilation is enabled, set GUILE_AUTO_COMPILE=0
;;;       or pass the --no-auto-compile argument to disable.
;;; compiling /gnu/store/wavrmrs065ikbava5mmvql3l8y4gp6ms-profile/bin/guild
;;; compiled /tmp/cache/guile/ccache/3.0-LE-8-4.7/gnu/store/k7vkw9x3wl3lni6a0i2w8xz2z8ylrqyz-guile-3.0.11/bin/guild.go
./pre-inst-env /gnu/store/wavrmrs065ikbava5mmvql3l8y4gp6ms-profile/bin/guild compile  -O1 -W1 -Wunbound-variable -Warity-mismatch -Wformat -Wshadowed-toplevel -o "tests/attach.scm.go" "tests/attach.scm"
./pre-inst-env /gnu/store/wavrmrs065ikbava5mmvql3l8y4gp6ms-profile/bin/guild compile  -O1 -W1 -Wunbound-variable -Warity-mismatch -Wformat -Wshadowed-toplevel -o "tests/authority.scm.go" "tests/authority.scm"
wrote `tests/authority.scm.go'
./pre-inst-env /gnu/store/wavrmrs065ikbava5mmvql3l8y4gp6ms-profile/bin/guild compile  -O1 -W1 -Wunbound-variable -Warity-mismatch -Wformat -Wshadowed-toplevel -o "tests/check.scm.go" "tests/check.scm"
wrote `tests/attach.scm.go'
./pre-inst-env /gnu/store/wavrmrs065ikbava5mmvql3l8y4gp6ms-profile/bin/guild compile  -O1 -W1 -Wunbound-variable -Warity-mismatch -Wformat -Wshadowed-toplevel -o "tests/contain.scm.go" "tests/contain.scm"
wrote `tests/contain.scm.go'
./pre-inst-env /gnu/store/wavrmrs065ikbava5mmvql3l8y4gp6ms-profile/bin/guild compile  -O1 -W1 -Wunbound-variable -Warity-mismatch -Wformat -Wshadowed-toplevel -o "tests/dispatch.scm.go" "tests/dispatch.scm"
wrote `tests/dispatch.scm.go'
./pre-inst-env /gnu/store/wavrmrs065ikbava5mmvql3l8y4gp6ms-profile/bin/guild compile  -O1 -W1 -Wunbound-variable -Warity-mismatch -Wformat -Wshadowed-toplevel -o "tests/errors.scm.go" "tests/errors.scm"
wrote `tests/errors.scm.go'
./pre-inst-env /gnu/store/wavrmrs065ikbava5mmvql3l8y4gp6ms-profile/bin/guild compile  -O1 -W1 -Wunbound-variable -Warity-mismatch -Wformat -Wshadowed-toplevel -o "tests/events.scm.go" "tests/events.scm"
wrote `tests/events.scm.go'
./pre-inst-env /gnu/store/wavrmrs065ikbava5mmvql3l8y4gp6ms-profile/bin/guild compile  -O1 -W1 -Wunbound-variable -Warity-mismatch -Wformat -Wshadowed-toplevel -o "tests/files.scm.go" "tests/files.scm"
wrote `tests/files.scm.go'
./pre-inst-env /gnu/store/wavrmrs065ikbava5mmvql3l8y4gp6ms-profile/bin/guild compile  -O1 -W1 -Wunbound-variable -Warity-mismatch -Wformat -Wshadowed-toplevel -o "tests/forgejo.scm.go" "tests/forgejo.scm"
wrote `tests/forgejo.scm.go'
./pre-inst-env /gnu/store/wavrmrs065ikbava5mmvql3l8y4gp6ms-profile/bin/guild compile  -O1 -W1 -Wunbound-variable -Warity-mismatch -Wformat -Wshadowed-toplevel -o "tests/http.scm.go" "tests/http.scm"
wrote `tests/check.scm.go'
./pre-inst-env /gnu/store/wavrmrs065ikbava5mmvql3l8y4gp6ms-profile/bin/guild compile  -O1 -W1 -Wunbound-variable -Warity-mismatch -Wformat -Wshadowed-toplevel -o "tests/layout.scm.go" "tests/layout.scm"
wrote `tests/http.scm.go'
./pre-inst-env /gnu/store/wavrmrs065ikbava5mmvql3l8y4gp6ms-profile/bin/guild compile  -O1 -W1 -Wunbound-variable -Warity-mismatch -Wformat -Wshadowed-toplevel -o "tests/masking.scm.go" "tests/masking.scm"
wrote `tests/masking.scm.go'
./pre-inst-env /gnu/store/wavrmrs065ikbava5mmvql3l8y4gp6ms-profile/bin/guild compile  -O1 -W1 -Wunbound-variable -Warity-mismatch -Wformat -Wshadowed-toplevel -o "tests/metrics.scm.go" "tests/metrics.scm"
wrote `tests/layout.scm.go'
./pre-inst-env /gnu/store/wavrmrs065ikbava5mmvql3l8y4gp6ms-profile/bin/guild compile  -O1 -W1 -Wunbound-variable -Warity-mismatch -Wformat -Wshadowed-toplevel -o "tests/pages.scm.go" "tests/pages.scm"
wrote `tests/metrics.scm.go'
./pre-inst-env /gnu/store/wavrmrs065ikbava5mmvql3l8y4gp6ms-profile/bin/guild compile  -O1 -W1 -Wunbound-variable -Warity-mismatch -Wformat -Wshadowed-toplevel -o "tests/model.scm.go" "tests/model.scm"
wrote `tests/pages.scm.go'
./pre-inst-env /gnu/store/wavrmrs065ikbava5mmvql3l8y4gp6ms-profile/bin/guild compile  -O1 -W1 -Wunbound-variable -Warity-mismatch -Wformat -Wshadowed-toplevel -o "tests/output-marks.scm.go" "tests/output-marks.scm"
wrote `tests/output-marks.scm.go'
./pre-inst-env /gnu/store/wavrmrs065ikbava5mmvql3l8y4gp6ms-profile/bin/guild compile  -O1 -W1 -Wunbound-variable -Warity-mismatch -Wformat -Wshadowed-toplevel -o "tests/notify.scm.go" "tests/notify.scm"
wrote `tests/model.scm.go'
./pre-inst-env /gnu/store/wavrmrs065ikbava5mmvql3l8y4gp6ms-profile/bin/guild compile  -O1 -W1 -Wunbound-variable -Warity-mismatch -Wformat -Wshadowed-toplevel -o "tests/pipeline.scm.go" "tests/pipeline.scm"
wrote `tests/notify.scm.go'
./pre-inst-env /gnu/store/wavrmrs065ikbava5mmvql3l8y4gp6ms-profile/bin/guild compile  -O1 -W1 -Wunbound-variable -Warity-mismatch -Wformat -Wshadowed-toplevel -o "tests/pipeline-shepherd.scm.go" "tests/pipeline-shepherd.scm"
wrote `tests/pipeline-shepherd.scm.go'
./pre-inst-env /gnu/store/wavrmrs065ikbava5mmvql3l8y4gp6ms-profile/bin/guild compile  -O1 -W1 -Wunbound-variable -Warity-mismatch -Wformat -Wshadowed-toplevel -o "tests/processes.scm.go" "tests/processes.scm"
wrote `tests/processes.scm.go'
./pre-inst-env /gnu/store/wavrmrs065ikbava5mmvql3l8y4gp6ms-profile/bin/guild compile  -O1 -W1 -Wunbound-variable -Warity-mismatch -Wformat -Wshadowed-toplevel -o "tests/pumphouse.scm.go" "tests/pumphouse.scm"
wrote `tests/pipeline.scm.go'
./pre-inst-env /gnu/store/wavrmrs065ikbava5mmvql3l8y4gp6ms-profile/bin/guild compile  -O1 -W1 -Wunbound-variable -Warity-mismatch -Wformat -Wshadowed-toplevel -o "tests/pumphouse-draining.scm.go" "tests/pumphouse-draining.scm"
wrote `tests/pumphouse-draining.scm.go'
./pre-inst-env /gnu/store/wavrmrs065ikbava5mmvql3l8y4gp6ms-profile/bin/guild compile  -O1 -W1 -Wunbound-variable -Warity-mismatch -Wformat -Wshadowed-toplevel -o "tests/pumphouse-lost.scm.go" "tests/pumphouse-lost.scm"
wrote `tests/pumphouse.scm.go'
./pre-inst-env /gnu/store/wavrmrs065ikbava5mmvql3l8y4gp6ms-profile/bin/guild compile  -O1 -W1 -Wunbound-variable -Warity-mismatch -Wformat -Wshadowed-toplevel -o "tests/pumphouse-replay.scm.go" "tests/pumphouse-replay.scm"
wrote `tests/pumphouse-lost.scm.go'
./pre-inst-env /gnu/store/wavrmrs065ikbava5mmvql3l8y4gp6ms-profile/bin/guild compile  -O1 -W1 -Wunbound-variable -Warity-mismatch -Wformat -Wshadowed-toplevel -o "tests/pumphouse-restart.scm.go" "tests/pumphouse-restart.scm"
wrote `tests/pumphouse-replay.scm.go'
./pre-inst-env /gnu/store/wavrmrs065ikbava5mmvql3l8y4gp6ms-profile/bin/guild compile  -O1 -W1 -Wunbound-variable -Warity-mismatch -Wformat -Wshadowed-toplevel -o "tests/pumphouse-shepherd.scm.go" "tests/pumphouse-shepherd.scm"
wrote `tests/pumphouse-restart.scm.go'
./pre-inst-env /gnu/store/wavrmrs065ikbava5mmvql3l8y4gp6ms-profile/bin/guild compile  -O1 -W1 -Wunbound-variable -Warity-mismatch -Wformat -Wshadowed-toplevel -o "tests/pumphouse-stopping.scm.go" "tests/pumphouse-stopping.scm"
wrote `tests/pumphouse-shepherd.scm.go'
./pre-inst-env /gnu/store/wavrmrs065ikbava5mmvql3l8y4gp6ms-profile/bin/guild compile  -O1 -W1 -Wunbound-variable -Warity-mismatch -Wformat -Wshadowed-toplevel -o "tests/pumphouse-timers.scm.go" "tests/pumphouse-timers.scm"
wrote `tests/pumphouse-stopping.scm.go'
./pre-inst-env /gnu/store/wavrmrs065ikbava5mmvql3l8y4gp6ms-profile/bin/guild compile  -O1 -W1 -Wunbound-variable -Warity-mismatch -Wformat -Wshadowed-toplevel -o "tests/reconnect.scm.go" "tests/reconnect.scm"
wrote `tests/pumphouse-timers.scm.go'
./pre-inst-env /gnu/store/wavrmrs065ikbava5mmvql3l8y4gp6ms-profile/bin/guild compile  -O1 -W1 -Wunbound-variable -Warity-mismatch -Wformat -Wshadowed-toplevel -o "tests/records.scm.go" "tests/records.scm"
wrote `tests/reconnect.scm.go'
./pre-inst-env /gnu/store/wavrmrs065ikbava5mmvql3l8y4gp6ms-profile/bin/guild compile  -O1 -W1 -Wunbound-variable -Warity-mismatch -Wformat -Wshadowed-toplevel -o "tests/relay.scm.go" "tests/relay.scm"
wrote `tests/records.scm.go'
./pre-inst-env /gnu/store/wavrmrs065ikbava5mmvql3l8y4gp6ms-profile/bin/guild compile  -O1 -W1 -Wunbound-variable -Warity-mismatch -Wformat -Wshadowed-toplevel -o "tests/run-query.scm.go" "tests/run-query.scm"
wrote `tests/relay.scm.go'
./pre-inst-env /gnu/store/wavrmrs065ikbava5mmvql3l8y4gp6ms-profile/bin/guild compile  -O1 -W1 -Wunbound-variable -Warity-mismatch -Wformat -Wshadowed-toplevel -o "tests/shepherd-bridge.scm.go" "tests/shepherd-bridge.scm"
wrote `tests/run-query.scm.go'
./pre-inst-env /gnu/store/wavrmrs065ikbava5mmvql3l8y4gp6ms-profile/bin/guild compile  -O1 -W1 -Wunbound-variable -Warity-mismatch -Wformat -Wshadowed-toplevel -o "tests/repl.scm.go" "tests/repl.scm"
wrote `tests/repl.scm.go'
./pre-inst-env /gnu/store/wavrmrs065ikbava5mmvql3l8y4gp6ms-profile/bin/guild compile  -O1 -W1 -Wunbound-variable -Warity-mismatch -Wformat -Wshadowed-toplevel -o "tests/scope.scm.go" "tests/scope.scm"
wrote `tests/scope.scm.go'
./pre-inst-env /gnu/store/wavrmrs065ikbava5mmvql3l8y4gp6ms-profile/bin/guild compile  -O1 -W1 -Wunbound-variable -Warity-mismatch -Wformat -Wshadowed-toplevel -o "tests/source.scm.go" "tests/source.scm"
wrote `tests/shepherd-bridge.scm.go'
./pre-inst-env /gnu/store/wavrmrs065ikbava5mmvql3l8y4gp6ms-profile/bin/guild compile  -O1 -W1 -Wunbound-variable -Warity-mismatch -Wformat -Wshadowed-toplevel -o "tests/step-scheduling.scm.go" "tests/step-scheduling.scm"
wrote `tests/source.scm.go'
./pre-inst-env /gnu/store/wavrmrs065ikbava5mmvql3l8y4gp6ms-profile/bin/guild compile  -O1 -W1 -Wunbound-variable -Warity-mismatch -Wformat -Wshadowed-toplevel -o "tests/uploader.scm.go" "tests/uploader.scm"
wrote `tests/step-scheduling.scm.go'
wrote `tests/uploader.scm.go'
make[2]: Leaving directory '/home/chris/pipeline-shepherd/state/work/automate-pipelines/automate-tbdYWg/automate-work-Bdjwb0/workspace/source'
make  check-TESTS
make[2]: Entering directory '/home/chris/pipeline-shepherd/state/work/automate-pipelines/automate-tbdYWg/automate-work-Bdjwb0/workspace/source'
make[3]: Entering directory '/home/chris/pipeline-shepherd/state/work/automate-pipelines/automate-tbdYWg/automate-work-Bdjwb0/workspace/source'
PASS: tests/authority.scm
PASS: tests/attach.scm
PASS: tests/check.scm
PASS: tests/dispatch.scm
PASS: tests/errors.scm
PASS: tests/contain.scm
PASS: tests/events.scm
PASS: tests/files.scm
PASS: tests/forgejo.scm
PASS: tests/layout.scm
PASS: tests/masking.scm
PASS: tests/http.scm
PASS: tests/metrics.scm
PASS: tests/pages.scm
PASS: tests/output-marks.scm
PASS: tests/notify.scm
PASS: tests/model.scm
PASS: tests/pipeline-shepherd.scm
PASS: tests/processes.scm
PASS: tests/pipeline.scm
FAIL: tests/pumphouse.scm
PASS: tests/pumphouse-draining.scm
PASS: tests/pumphouse-replay.scm
PASS: tests/pumphouse-lost.scm
PASS: tests/pumphouse-restart.scm
PASS: tests/pumphouse-shepherd.scm
PASS: tests/pumphouse-stopping.scm
PASS: tests/pumphouse-timers.scm
PASS: tests/records.scm
PASS: tests/reconnect.scm
PASS: tests/relay.scm
PASS: tests/run-query.scm
PASS: tests/repl.scm
PASS: tests/scope.scm
PASS: tests/source.scm
PASS: tests/shepherd-bridge.scm
PASS: tests/step-scheduling.scm
PASS: tests/uploader.scm
================================================
   guile-automate 0.0.0-dev: ./test-suite.log
================================================

# TOTAL: 38
# PASS:  37
# SKIP:  0
# XFAIL: 0
# FAIL:  1
# XPASS: 0
# ERROR: 0

System information (uname -a): Linux 6.18.13-gnu #1 SMP PREEMPT_DYNAMIC 1 x86_64

.. contents:: :depth: 2

FAIL: tests/pumphouse
=====================

http on port 44121
pumphouse listening on /tmp/automate-tests-f3TXkb/automate-pumphouse-lHKSCz/socket
admin: /tmp/automate-tests-f3TXkb/automate-pumphouse-lHKSCz/admin
remote admin: /tmp/automate-tests-f3TXkb/automate-pumphouse-lHKSCz/remote-admin
attached to the pumphouse of /tmp/automate-tests-f3TXkb/automate-pumphouse-lHKSCz/any
lost the pumphouse; reconnecting
attached to the pumphouse of /tmp/automate-tests-f3TXkb/automate-pumphouse-lHKSCz/any

Goblins exception:
In message to #<local-object fulfilled-handler>:
  (((pipeline . tests/sum) (outcome . succeeded) (instance . "mago")))
ice-9/boot-9.scm:1705:22: In procedure raise-exception:
ERROR:
  1. &automate-error:
      kind: invalid-request
      irritants: ("2f601000dd29b19f" tests/sum)
  2. &message: "the run is of another pipeline"
  3. &irritants: ("2f601000dd29b19f" tests/sum)
warning: mutating the process environment while multiple threads are running;
         further behavior unspecified.
In goblins/core.scm:
   1074:7  3 (syscaller-$ _ #<local-object fulfilled-handler> (((pipeline . tests/sum) (outcome . succeeded) (instance . "mago"))))
  2038:14  2 (_ . _)
In automate/model.scm:
    119:2  1 (raise-automate-error _ _ . _)
In ice-9/boot-9.scm:
  1705:22  0 (raise-exception _ #:continuable? _)

admin run: the run is of another pipeline: "2f601000dd29b19f", tests/sum

Goblins exception:
In message to #<local-object ^pipeline-endpoint>:
  (run (run-request (id . "e445dcff26b36a84") (parameters) (cause . #f) (ancestors)))
ice-9/boot-9.scm:1705:22: In procedure raise-exception:
ERROR:
  1. &automate-error:
      kind: missing-parameter
      irritants: (n)
  2. &message: "run request lacks a parameter"
  3. &irritants: (n)
warning: mutating the process environment while multiple threads are running;
         further behavior unspecified.
In goblins/core.scm:
   1074:7  4 (syscaller-$ _ #<local-object ^pipeline-endpoint> (run (run-request (id . "e445dcff26b36a84") (parameters) (cause . #f) (ancestors))))
In automate/pipeline/daemon.scm:
    491:7  3 (run (run-request (id . "e445dcff26b36a84") (parameters) (cause . #f) (ancestors)))
In srfi/srfi-1.scm:
    750:9  2 (for-each #<procedure 7f498a6b0e60 at automate/pipeline.scm:1103:12 (entry)> ((param (name n))))
In automate/model.scm:
    119:2  1 (raise-automate-error _ _ . _)
In ice-9/boot-9.scm:
  1705:22  0 (raise-exception _ #:continuable? _)

tests/sum run: run request lacks a parameter: n
admin run: run request lacks a parameter: n

Goblins exception:
In message to #<local-object ^call-with-vat>:
ice-9/boot-9.scm:1705:22: In procedure raise-exception:
ERROR:
  1. &automate-error:
      kind: no-unix-socket
      irritants: ("/tmp/automate-tests-f3TXkb/automate-pumphouse-lHKSCz/no-socket")
  2. &message: "no pumphouse socket here; --unix-socket names another"
  3. &irritants: ("/tmp/automate-tests-f3TXkb/automate-pumphouse-lHKSCz/no-socket")
2026-10-14 20:30:36 INFO: dropping a connection that failed to hand shake: #<&compound-exception components: (#<&error> #<&irritants irritants: (#<gnutls-error-enum Error in the pull function.> handshake)> #<&exception-with-kind-and-args kind: gnutls-error args: (#<gnutls-error-enum Error in the pull function.> handshake)>)>
2026-10-14 20:30:36 INFO: dropping a connection that failed to hand shake: #<&compound-exception components: (#<&external-error> #<&origin origin: "fport_write"> #<&message message: "~A"> #<&irritants irritants: ("Broken pipe")> #<&exception-with-kind-and-args kind: system-error args: ("fport_write" "~A" ("Broken pipe") (32))>)>
2026-10-14 20:30:36 INFO: dropping a connection that failed to hand shake: #<&compound-exception components: (#<&error> #<&irritants irritants: (#<gnutls-error-enum Error in the pull function.> handshake)> #<&exception-with-kind-and-args kind: gnutls-error args: (#<gnutls-error-enum Error in the pull function.> handshake)>)>

Goblins exception:
In message to #<local-object ^scoped-registrar>:
  (register tests/nap "mago" "/tmp/automate-tests-f3TXkb/automate-def-Sng5G3" (structure (version 3) (name tests/nap) (steps ((step (name nap) (label #f) (group #f) (timeout #f) (error-permitted #f) (outputs (value)) (inputs ())))) (resources ()) (params ()) (outputs ()) (web-ui-options ())) #<remote-object> "ocapn://4jy5enqkp72jyh3hydlpjdb5gdxyngoggezyzkmd7tbtkqpbgrdq.tcp-tls/s/8zC-2f66p2U7ztDpQ8EjoenUoL6iYnUbSW-ejgw25ls?" ())
ice-9/boot-9.scm:1705:22: In procedure raise-exception:
ERROR:
  1. &automate-error:
      kind: not-permitted
      irritants: (tests/nap (tests/only tests/scoped/))
  2. &message: "this registration does not cover the pipeline"
  3. &irritants: (tests/nap (tests/only tests/scoped/))
In goblins/core.scm:
   1074:7  3 (syscaller-$ _ #<local-object ^scoped-registrar> (register tests/nap "mago" "/tmp/automate-tests-f3TXkb/automate-def-Sng5G3" (structure (version 3) (name tests/nap) (steps ((step (name nap) (label #f) (group #f) (timeout #f) (error-permitted #f) (outputs (value)) (inputs ())))) (resources ()) (params ()) (outputs ()) (web-ui-options ())) #<remote-object> "ocapn://4jy5enqkp72jyh3hydlpjdb5gdxyngoggezyzkmd7tbtkqpbgrdq.tcp-tls/s/8zC-2f66p2U7ztDpQ8EjoenUoL6iYnUbSW-ejgw25ls?" ()))
In automate/pumphouse.scm:
    552:6  2 (register tests/nap "mago" "/tmp/automate-tests-f3TXkb/automate-def-Sng5G3" (structure (version 3) (name tests/nap) (steps ((step (name nap) (label #f) (group #f) (timeout #f) (error-permitted #f) (outputs (value)) (inputs ())))) (resources ()) (params ()) (outputs ()) (web-ui-options ())) #<remote-object> "ocapn://4jy5enqkp72jyh3hydlpjdb5gdxyngoggezyzkmd7tbtkqpbgrdq.tcp-tls/s/8zC-2f66p2U7ztDpQ8EjoenUoL6iYnUbSW-ejgw25ls?" ())
In automate/model.scm:
    119:2  1 (raise-automate-error _ _ . _)
In ice-9/boot-9.scm:
  1705:22  0 (raise-exception _ #:continuable? _)

pumphouse refused tests/nap: Unknown error occurred with remote object
attached to the pumphouse

Goblins exception:
In message to #<local-object ^admin>:
  (revoke (tests/nowhere) #f)
ice-9/boot-9.scm:1705:22: In procedure raise-exception:
ERROR:
  1. &automate-error:
      kind: no-registration
      irritants: ((tests/nowhere) #f)
  2. &message: "no registration of this scope"
  3. &irritants: ((tests/nowhere) #f)
In goblins/core.scm:
   1074:7  2 (syscaller-$ _ #<local-object ^admin> (revoke (tests/nowhere) #f))
In automate/model.scm:
    119:2  1 (raise-automate-error _ _ . _)
In ice-9/boot-9.scm:
  1705:22  0 (raise-exception _ #:continuable? _)

admin revoke: no registration of this scope: (tests/nowhere), #f

Goblins exception:
In message to #<local-object fulfilled-handler>:
  (#t)
ice-9/boot-9.scm:1705:22: In procedure raise-exception:
ERROR:
  1. &automate-error:
      kind: not-attached
      irritants: (tests/nowhere #f)
  2. &message: "no pipeline process serving the pipeline's definition is attached"
  3. &irritants: (tests/nowhere #f)
In goblins/core.scm:
   1074:7  3 (syscaller-$ _ #<local-object fulfilled-handler> (#t))
  2038:14  2 (_ . _)
In automate/model.scm:
    119:2  1 (raise-automate-error _ _ . _)
In ice-9/boot-9.scm:
  1705:22  0 (raise-exception _ #:continuable? _)

admin run: no pipeline process serving the pipeline's definition is attached: tests/nowhere, #f
2026-10-14 20:30:46 (with-exception-handler) INFO: POST /output/2709454020e050b3/chatty 200 13ms
lost the pumphouse; reconnecting
attached to the pumphouse of /tmp/automate-tests-f3TXkb/automate-pumphouse-lHKSCz/any
2026-10-14 20:30:50 (with-exception-handler) INFO: POST /output/cef24ccc3e3c5cc2/chatty 200 4ms
run cef24ccc3e3c5cc2 reported to the pumphouse
run succeeded
  chatty: succeeded
2026-10-14 20:30:51 (with-exception-handler) INFO: GET /events/runs/78a82856049af2c9 200 53ms
2026-10-14 20:30:51 (with-exception-handler) INFO: GET /events/runs/nothing 404 1ms
2026-10-14 20:30:51 (with-exception-handler) INFO: GET /health 200 2ms
2026-10-14 20:30:51 (with-exception-handler) INFO: GET / 200 28ms
2026-10-14 20:30:51 (with-exception-handler) INFO: GET /runs/2709454020e050b3 200 39ms
2026-10-14 20:30:51 (with-exception-handler) INFO: GET /runs/2709454020e050b3/steps/chatty 200 3ms
GET /events/pumphouse: error replying to client
2026-10-14 20:30:51 (with-exception-handler) INFO: GET /events/pumphouse 200 incomplete
2026-10-14 20:30:53 (with-exception-handler) INFO: POST /output/e0dd1be069451df8/after 200 38ms
lost the pumphouse; reconnecting
lost the pumphouse; reconnecting
attached to the pumphouse of /tmp/automate-tests-f3TXkb/automate-pumphouse-lHKSCz/any

Goblins exception:
In message to #<local-object ^scoped-registrar>:
  (register tests/only "mago" "/tmp/automate-tests-f3TXkb/automate-def-JFHoG1" (structure (version 3) (name tests/only) (steps ((step (name quick) (label #f) (group #f) (timeout #f) (error-permitted #f) (outputs (value)) (inputs ())))) (resources ()) (params ()) (outputs ()) (web-ui-options ())) #<remote-object> "ocapn://zssfehmsnx5574bkijq6hxrtyedwr7o3bk4yorl24ukvn65keq2q.tcp-tls/s/D6tV_BMDZNIehhw6ED62QZi1-K5UtxVS6_VkNfHhURE?" ())
ice-9/boot-9.scm:1705:22: In procedure raise-exception:
ERROR:
  1. &automate-error:
      kind: revoked
      irritants: ((tests/only tests/scoped/))
  2. &message: "this registration was revoked"
  3. &irritants: ((tests/only tests/scoped/))
In goblins/core.scm:
   1074:7  3 (syscaller-$ _ #<local-object ^scoped-registrar> (register tests/only "mago" "/tmp/automate-tests-f3TXkb/automate-def-JFHoG1" (structure (version 3) (name tests/only) (steps ((step (name quick) (label #f) (group #f) (timeout #f) (error-permitted #f) (outputs (value)) (inputs ())))) (resources ()) (params ()) (outputs ()) (web-ui-options ())) #<remote-object> "ocapn://zssfehmsnx5574bkijq6hxrtyedwr7o3bk4yorl24ukvn65keq2q.tcp-tls/s/D6tV_BMDZNIehhw6ED62QZi1-K5UtxVS6_VkNfHhURE?" ()))
In automate/pumphouse.scm:
    550:6  2 (register tests/only "mago" "/tmp/automate-tests-f3TXkb/automate-def-JFHoG1" (structure (version 3) (name tests/only) (steps ((step (name quick) (label #f) (group #f) (timeout #f) (error-permitted #f) (outputs (value)) (inputs ())))) (resources ()) (params ()) (outputs ()) (web-ui-options ())) #<remote-object> "ocapn://zssfehmsnx5574bkijq6hxrtyedwr7o3bk4yorl24ukvn65keq2q.tcp-tls/s/D6tV_BMDZNIehhw6ED62QZi1-K5UtxVS6_VkNfHhURE?" ())
In automate/model.scm:
    119:2  1 (raise-automate-error _ _ . _)
In ice-9/boot-9.scm:
  1705:22  0 (raise-exception _ #:continuable? _)

pumphouse refused tests/only: Unknown error occurred with remote object

Goblins exception:
In message to #<local-object ^scoped-registrar>:
  (register tests/scoped/one "mago" "/tmp/automate-tests-f3TXkb/automate-def-rbO8EE" (structure (version 3) (name tests/scoped/one) (steps ((step (name quick) (label #f) (group #f) (timeout #f) (error-permitted #f) (outputs (value)) (inputs ())))) (resources ()) (params ()) (outputs ()) (web-ui-options ())) #<remote-object> "ocapn://zssfehmsnx5574bkijq6hxrtyedwr7o3bk4yorl24ukvn65keq2q.tcp-tls/s/E_gbBnaL6JFD19_3bBD_RyZ1t-zDKZJA8nBY-3osYU4?" ())
ice-9/boot-9.scm:1705:22: In procedure raise-exception:
ERROR:
  1. &automate-error:
      kind: revoked
      irritants: ((tests/only tests/scoped/))
  2. &message: "this registration was revoked"
  3. &irritants: ((tests/only tests/scoped/))
In goblins/core.scm:
   1074:7  3 (syscaller-$ _ #<local-object ^scoped-registrar> (register tests/scoped/one "mago" "/tmp/automate-tests-f3TXkb/automate-def-rbO8EE" (structure (version 3) (name tests/scoped/one) (steps ((step (name quick) (label #f) (group #f) (timeout #f) (error-permitted #f) (outputs (value)) (inputs ())))) (resources ()) (params ()) (outputs ()) (web-ui-options ())) #<remote-object> "ocapn://zssfehmsnx5574bkijq6hxrtyedwr7o3bk4yorl24ukvn65keq2q.tcp-tls/s/E_gbBnaL6JFD19_3bBD_RyZ1t-zDKZJA8nB…" …))
In automate/pumphouse.scm:
    550:6  2 (register tests/scoped/one "mago" "/tmp/automate-tests-f3TXkb/automate-def-rbO8EE" (structure (version 3) (name tests/scoped/one) (steps ((step (name quick) (label #f) (group #f) (timeout #f) (error-permitted #f) (outputs (value)) (inputs ())))) (resources ()) (params ()) (outputs ()) (web-ui-options ())) #<remote-object> "ocapn://zssfehmsnx5574bkijq6hxrtyedwr7o3bk4yorl24ukvn65keq2q.tcp-tls/s/E_gbBnaL6JFD19_3bBD_RyZ1t-zDKZJA8nBY-3osYU4?" ())
In automate/model.scm:
    119:2  1 (raise-automate-error _ _ . _)
In ice-9/boot-9.scm:
  1705:22  0 (raise-exception _ #:continuable? _)

pumphouse refused tests/scoped/one: Unknown error occurred with remote object

Goblins exception:
In message to #<local-object ^scoped-registrar>:
  (register tests/nap "mago" "/tmp/automate-tests-f3TXkb/automate-def-Sng5G3" (structure (version 3) (name tests/nap) (steps ((step (name nap) (label #f) (group #f) (timeout #f) (error-permitted #f) (outputs (value)) (inputs ())))) (resources ()) (params ()) (outputs ()) (web-ui-options ())) #<remote-object> "ocapn://zssfehmsnx5574bkijq6hxrtyedwr7o3bk4yorl24ukvn65keq2q.tcp-tls/s/3alwJoyesuuCfwJkTdU93vdkGQBHyOvF4Vs2XEmisik?" ())
ice-9/boot-9.scm:1705:22: In procedure raise-exception:
ERROR:
  1. &automate-error:
      kind: revoked
      irritants: ((tests/only tests/scoped/))
  2. &message: "this registration was revoked"
  3. &irritants: ((tests/only tests/scoped/))
In goblins/core.scm:
   1074:7  3 (syscaller-$ _ #<local-object ^scoped-registrar> (register tests/nap "mago" "/tmp/automate-tests-f3TXkb/automate-def-Sng5G3" (structure (version 3) (name tests/nap) (steps ((step (name nap) (label #f) (group #f) (timeout #f) (error-permitted #f) (outputs (value)) (inputs ())))) (resources ()) (params ()) (outputs ()) (web-ui-options ())) #<remote-object> "ocapn://zssfehmsnx5574bkijq6hxrtyedwr7o3bk4yorl24ukvn65keq2q.tcp-tls/s/3alwJoyesuuCfwJkTdU93vdkGQBHyOvF4Vs2XEmisik?" ()))
In automate/pumphouse.scm:
    550:6  2 (register tests/nap "mago" "/tmp/automate-tests-f3TXkb/automate-def-Sng5G3" (structure (version 3) (name tests/nap) (steps ((step (name nap) (label #f) (group #f) (timeout #f) (error-permitted #f) (outputs (value)) (inputs ())))) (resources ()) (params ()) (outputs ()) (web-ui-options ())) #<remote-object> "ocapn://zssfehmsnx5574bkijq6hxrtyedwr7o3bk4yorl24ukvn65keq2q.tcp-tls/s/3alwJoyesuuCfwJkTdU93vdkGQBHyOvF4Vs2XEmisik?" ())
In automate/model.scm:
    119:2  1 (raise-automate-error _ _ . _)
In ice-9/boot-9.scm:
  1705:22  0 (raise-exception _ #:continuable? _)

pumphouse refused tests/nap: Unknown error occurred with remote object
lost the pumphouse; reconnecting

Goblins exception:
In message to #<local-object ^scoped-registrar>:
  (register tests/only "mago" "/tmp/automate-tests-f3TXkb/automate-def-JFHoG1" (structure (version 3) (name tests/only) (steps ((step (name quick) (label #f) (group #f) (timeout #f) (error-permitted #f) (outputs (value)) (inputs ())))) (resources ()) (params ()) (outputs ()) (web-ui-options ())) #<remote-object> "ocapn://irlez2ha7umlqbpd255jfrgokj5iskuglct5zzx74g5ujdju757a.tcp-tls/s/pqK_03oszY8fYipwopWDCo9sa984LyvPQIFMih1b6oY?" ())
ice-9/boot-9.scm:1705:22: In procedure raise-exception:
ERROR:
  1. &automate-error:
      kind: revoked
      irritants: ((tests/only tests/scoped/))
  2. &message: "this registration was revoked"
  3. &irritants: ((tests/only tests/scoped/))
In goblins/core.scm:
   1074:7  3 (syscaller-$ _ #<local-object ^scoped-registrar> (register tests/only "mago" "/tmp/automate-tests-f3TXkb/automate-def-JFHoG1" (structure (version 3) (name tests/only) (steps ((step (name quick) (label #f) (group #f) (timeout #f) (error-permitted #f) (outputs (value)) (inputs ())))) (resources ()) (params ()) (outputs ()) (web-ui-options ())) #<remote-object> "ocapn://irlez2ha7umlqbpd255jfrgokj5iskuglct5zzx74g5ujdju757a.tcp-tls/s/pqK_03oszY8fYipwopWDCo9sa984LyvPQIFMih1b6oY?" ()))
In automate/pumphouse.scm:
    550:6  2 (register tests/only "mago" "/tmp/automate-tests-f3TXkb/automate-def-JFHoG1" (structure (version 3) (name tests/only) (steps ((step (name quick) (label #f) (group #f) (timeout #f) (error-permitted #f) (outputs (value)) (inputs ())))) (resources ()) (params ()) (outputs ()) (web-ui-options ())) #<remote-object> "ocapn://irlez2ha7umlqbpd255jfrgokj5iskuglct5zzx74g5ujdju757a.tcp-tls/s/pqK_03oszY8fYipwopWDCo9sa984LyvPQIFMih1b6oY?" ())
In automate/model.scm:
    119:2  1 (raise-automate-error _ _ . _)
In ice-9/boot-9.scm:
  1705:22  0 (raise-exception _ #:continuable? _)

pumphouse refused tests/only: Unknown error occurred with remote object

Goblins exception:
In message to #<local-object ^scoped-registrar>:
  (register tests/scoped/one "mago" "/tmp/automate-tests-f3TXkb/automate-def-rbO8EE" (structure (version 3) (name tests/scoped/one) (steps ((step (name quick) (label #f) (group #f) (timeout #f) (error-permitted #f) (outputs (value)) (inputs ())))) (resources ()) (params ()) (outputs ()) (web-ui-options ())) #<remote-object> "ocapn://irlez2ha7umlqbpd255jfrgokj5iskuglct5zzx74g5ujdju757a.tcp-tls/s/An40Rm9h95NbWZ1qjbZ7QdklHegL4BvlZyJGQYY86Jk?" ())
ice-9/boot-9.scm:1705:22: In procedure raise-exception:
ERROR:
  1. &automate-error:
      kind: revoked
      irritants: ((tests/only tests/scoped/))
  2. &message: "this registration was revoked"
  3. &irritants: ((tests/only tests/scoped/))
In goblins/core.scm:
   1074:7  3 (syscaller-$ _ #<local-object ^scoped-registrar> (register tests/scoped/one "mago" "/tmp/automate-tests-f3TXkb/automate-def-rbO8EE" (structure (version 3) (name tests/scoped/one) (steps ((step (name quick) (label #f) (group #f) (timeout #f) (error-permitted #f) (outputs (value)) (inputs ())))) (resources ()) (params ()) (outputs ()) (web-ui-options ())) #<remote-object> "ocapn://irlez2ha7umlqbpd255jfrgokj5iskuglct5zzx74g5ujdju757a.tcp-tls/s/An40Rm9h95NbWZ1qjbZ7QdklHegL4BvlZyJ…" …))
In automate/pumphouse.scm:
    550:6  2 (register tests/scoped/one "mago" "/tmp/automate-tests-f3TXkb/automate-def-rbO8EE" (structure (version 3) (name tests/scoped/one) (steps ((step (name quick) (label #f) (group #f) (timeout #f) (error-permitted #f) (outputs (value)) (inputs ())))) (resources ()) (params ()) (outputs ()) (web-ui-options ())) #<remote-object> "ocapn://irlez2ha7umlqbpd255jfrgokj5iskuglct5zzx74g5ujdju757a.tcp-tls/s/An40Rm9h95NbWZ1qjbZ7QdklHegL4BvlZyJGQYY86Jk?" ())
In automate/model.scm:
    119:2  1 (raise-automate-error _ _ . _)
In ice-9/boot-9.scm:
  1705:22  0 (raise-exception _ #:continuable? _)

pumphouse refused tests/scoped/one: Unknown error occurred with remote object

Goblins exception:
In message to #<local-object ^scoped-registrar>:
  (register tests/nap "mago" "/tmp/automate-tests-f3TXkb/automate-def-Sng5G3" (structure (version 3) (name tests/nap) (steps ((step (name nap) (label #f) (group #f) (timeout #f) (error-permitted #f) (outputs (value)) (inputs ())))) (resources ()) (params ()) (outputs ()) (web-ui-options ())) #<remote-object> "ocapn://irlez2ha7umlqbpd255jfrgokj5iskuglct5zzx74g5ujdju757a.tcp-tls/s/ABqIc9lwTECuj_N270FH1CS7mYkeBMrTII9T_9vN5GU?" ())
ice-9/boot-9.scm:1705:22: In procedure raise-exception:
ERROR:
  1. &automate-error:
      kind: revoked
      irritants: ((tests/only tests/scoped/))
  2. &message: "this registration was revoked"
  3. &irritants: ((tests/only tests/scoped/))
In goblins/core.scm:
   1074:7  3 (syscaller-$ _ #<local-object ^scoped-registrar> (register tests/nap "mago" "/tmp/automate-tests-f3TXkb/automate-def-Sng5G3" (structure (version 3) (name tests/nap) (steps ((step (name nap) (label #f) (group #f) (timeout #f) (error-permitted #f) (outputs (value)) (inputs ())))) (resources ()) (params ()) (outputs ()) (web-ui-options ())) #<remote-object> "ocapn://irlez2ha7umlqbpd255jfrgokj5iskuglct5zzx74g5ujdju757a.tcp-tls/s/ABqIc9lwTECuj_N270FH1CS7mYkeBMrTII9T_9vN5GU?" ()))
In automate/pumphouse.scm:
    550:6  2 (register tests/nap "mago" "/tmp/automate-tests-f3TXkb/automate-def-Sng5G3" (structure (version 3) (name tests/nap) (steps ((step (name nap) (label #f) (group #f) (timeout #f) (error-permitted #f) (outputs (value)) (inputs ())))) (resources ()) (params ()) (outputs ()) (web-ui-options ())) #<remote-object> "ocapn://irlez2ha7umlqbpd255jfrgokj5iskuglct5zzx74g5ujdju757a.tcp-tls/s/ABqIc9lwTECuj_N270FH1CS7mYkeBMrTII9T_9vN5GU?" ())
In automate/model.scm:
    119:2  1 (raise-automate-error _ _ . _)
In ice-9/boot-9.scm:
  1705:22  0 (raise-exception _ #:continuable? _)

pumphouse refused tests/nap: Unknown error occurred with remote object
attached to the pumphouse of /tmp/automate-tests-f3TXkb/automate-pumphouse-lHKSCz/any
2026-10-14 20:31:02 (with-exception-handler) INFO: POST /output/b60e37b8042da6e4/look 200 168ms

Goblins exception:
In message to #<local-object ^scoped-registrar>:
  (register tests/only "mago" "/tmp/automate-tests-f3TXkb/automate-def-JFHoG1" (structure (version 3) (name tests/only) (steps ((step (name quick) (label #f) (group #f) (timeout #f) (error-permitted #f) (outputs (value)) (inputs ())))) (resources ()) (params ()) (outputs ()) (web-ui-options ())) #<remote-object> "ocapn://qga27rltl5qlzbdpxqb3aybg64unkojztrf4iyrwiovjhvsds5yq.tcp-tls/s/tFirjwS8VvriQuVp8fD1M652NfksR-a0FqiLHYYOlyA?" ())
ice-9/boot-9.scm:1705:22: In procedure raise-exception:
ERROR:
  1. &automate-error:
      kind: revoked
      irritants: ((tests/only tests/scoped/))
  2. &message: "this registration was revoked"
  3. &irritants: ((tests/only tests/scoped/))
In goblins/core.scm:
   1074:7  3 (syscaller-$ _ #<local-object ^scoped-registrar> (register tests/only "mago" "/tmp/automate-tests-f3TXkb/automate-def-JFHoG1" (structure (version 3) (name tests/only) (steps ((step (name quick) (label #f) (group #f) (timeout #f) (error-permitted #f) (outputs (value)) (inputs ())))) (resources ()) (params ()) (outputs ()) (web-ui-options ())) #<remote-object> "ocapn://qga27rltl5qlzbdpxqb3aybg64unkojztrf4iyrwiovjhvsds5yq.tcp-tls/s/tFirjwS8VvriQuVp8fD1M652NfksR-a0FqiLHYYOlyA?" ()))
In automate/pumphouse.scm:
    550:6  2 (register tests/only "mago" "/tmp/automate-tests-f3TXkb/automate-def-JFHoG1" (structure (version 3) (name tests/only) (steps ((step (name quick) (label #f) (group #f) (timeout #f) (error-permitted #f) (outputs (value)) (inputs ())))) (resources ()) (params ()) (outputs ()) (web-ui-options ())) #<remote-object> "ocapn://qga27rltl5qlzbdpxqb3aybg64unkojztrf4iyrwiovjhvsds5yq.tcp-tls/s/tFirjwS8VvriQuVp8fD1M652NfksR-a0FqiLHYYOlyA?" ())
In automate/model.scm:
    119:2  1 (raise-automate-error _ _ . _)
In ice-9/boot-9.scm:
  1705:22  0 (raise-exception _ #:continuable? _)

pumphouse refused tests/only: Unknown error occurred with remote object

Goblins exception:
In message to #<local-object ^scoped-registrar>:
  (register tests/scoped/one "mago" "/tmp/automate-tests-f3TXkb/automate-def-rbO8EE" (structure (version 3) (name tests/scoped/one) (steps ((step (name quick) (label #f) (group #f) (timeout #f) (error-permitted #f) (outputs (value)) (inputs ())))) (resources ()) (params ()) (outputs ()) (web-ui-options ())) #<remote-object> "ocapn://qga27rltl5qlzbdpxqb3aybg64unkojztrf4iyrwiovjhvsds5yq.tcp-tls/s/Vz8PgEQvRFDZYlkmgHMN30qJuxzJ_olCevg8v_ofUZ8?" ())
ice-9/boot-9.scm:1705:22: In procedure raise-exception:
ERROR:
  1. &automate-error:
      kind: revoked
      irritants: ((tests/only tests/scoped/))
  2. &message: "this registration was revoked"
  3. &irritants: ((tests/only tests/scoped/))
In goblins/core.scm:
   1074:7  3 (syscaller-$ _ #<local-object ^scoped-registrar> (register tests/scoped/one "mago" "/tmp/automate-tests-f3TXkb/automate-def-rbO8EE" (structure (version 3) (name tests/scoped/one) (steps ((step (name quick) (label #f) (group #f) (timeout #f) (error-permitted #f) (outputs (value)) (inputs ())))) (resources ()) (params ()) (outputs ()) (web-ui-options ())) #<remote-object> "ocapn://qga27rltl5qlzbdpxqb3aybg64unkojztrf4iyrwiovjhvsds5yq.tcp-tls/s/Vz8PgEQvRFDZYlkmgHMN30qJuxzJ_olCevg…" …))
In automate/pumphouse.scm:
    550:6  2 (register tests/scoped/one "mago" "/tmp/automate-tests-f3TXkb/automate-def-rbO8EE" (structure (version 3) (name tests/scoped/one) (steps ((step (name quick) (label #f) (group #f) (timeout #f) (error-permitted #f) (outputs (value)) (inputs ())))) (resources ()) (params ()) (outputs ()) (web-ui-options ())) #<remote-object> "ocapn://qga27rltl5qlzbdpxqb3aybg64unkojztrf4iyrwiovjhvsds5yq.tcp-tls/s/Vz8PgEQvRFDZYlkmgHMN30qJuxzJ_olCevg8v_ofUZ8?" ())
In automate/model.scm:
    119:2  1 (raise-automate-error _ _ . _)
In ice-9/boot-9.scm:
  1705:22  0 (raise-exception _ #:continuable? _)

pumphouse refused tests/scoped/one: Unknown error occurred with remote object

Goblins exception:
In message to #<local-object ^scoped-registrar>:
  (register tests/nap "mago" "/tmp/automate-tests-f3TXkb/automate-def-Sng5G3" (structure (version 3) (name tests/nap) (steps ((step (name nap) (label #f) (group #f) (timeout #f) (error-permitted #f) (outputs (value)) (inputs ())))) (resources ()) (params ()) (outputs ()) (web-ui-options ())) #<remote-object> "ocapn://qga27rltl5qlzbdpxqb3aybg64unkojztrf4iyrwiovjhvsds5yq.tcp-tls/s/vpqkT_RiNjeCYXvi4ir7MGxKezrV892jIJKYrg5Hivc?" ())
ice-9/boot-9.scm:1705:22: In procedure raise-exception:
ERROR:
  1. &automate-error:
      kind: revoked
      irritants: ((tests/only tests/scoped/))
  2. &message: "this registration was revoked"
  3. &irritants: ((tests/only tests/scoped/))
In goblins/core.scm:
   1074:7  3 (syscaller-$ _ #<local-object ^scoped-registrar> (register tests/nap "mago" "/tmp/automate-tests-f3TXkb/automate-def-Sng5G3" (structure (version 3) (name tests/nap) (steps ((step (name nap) (label #f) (group #f) (timeout #f) (error-permitted #f) (outputs (value)) (inputs ())))) (resources ()) (params ()) (outputs ()) (web-ui-options ())) #<remote-object> "ocapn://qga27rltl5qlzbdpxqb3aybg64unkojztrf4iyrwiovjhvsds5yq.tcp-tls/s/vpqkT_RiNjeCYXvi4ir7MGxKezrV892jIJKYrg5Hivc?" ()))
In automate/pumphouse.scm:
    550:6  2 (register tests/nap "mago" "/tmp/automate-tests-f3TXkb/automate-def-Sng5G3" (structure (version 3) (name tests/nap) (steps ((step (name nap) (label #f) (group #f) (timeout #f) (error-permitted #f) (outputs (value)) (inputs ())))) (resources ()) (params ()) (outputs ()) (web-ui-options ())) #<remote-object> "ocapn://qga27rltl5qlzbdpxqb3aybg64unkojztrf4iyrwiovjhvsds5yq.tcp-tls/s/vpqkT_RiNjeCYXvi4ir7MGxKezrV892jIJKYrg5Hivc?" ())
In automate/model.scm:
    119:2  1 (raise-automate-error _ _ . _)
In ice-9/boot-9.scm:
  1705:22  0 (raise-exception _ #:continuable? _)

pumphouse refused tests/nap: Unknown error occurred with remote object

Goblins exception:
In message to #<local-object ^scoped-registrar>:
  (register tests/only "mago" "/tmp/automate-tests-f3TXkb/automate-def-JFHoG1" (structure (version 3) (name tests/only) (steps ((step (name quick) (label #f) (group #f) (timeout #f) (error-permitted #f) (outputs (value)) (inputs ())))) (resources ()) (params ()) (outputs ()) (web-ui-options ())) #<remote-object> "ocapn://rxfb3fqybkybv5jm5uwvofncqrchbmizp5hne7mlqjwhbsoy2x3q.tcp-tls/s/rrqs6wilsvNO8TWdKvGo_SggnBDkHrNYwCdr4qAcr38?" ())
ice-9/boot-9.scm:1705:22: In procedure raise-exception:
ERROR:
  1. &automate-error:
      kind: revoked
      irritants: ((tests/only tests/scoped/))
  2. &message: "this registration was revoked"
  3. &irritants: ((tests/only tests/scoped/))
In goblins/core.scm:
   1074:7  3 (syscaller-$ _ #<local-object ^scoped-registrar> (register tests/only "mago" "/tmp/automate-tests-f3TXkb/automate-def-JFHoG1" (structure (version 3) (name tests/only) (steps ((step (name quick) (label #f) (group #f) (timeout #f) (error-permitted #f) (outputs (value)) (inputs ())))) (resources ()) (params ()) (outputs ()) (web-ui-options ())) #<remote-object> "ocapn://rxfb3fqybkybv5jm5uwvofncqrchbmizp5hne7mlqjwhbsoy2x3q.tcp-tls/s/rrqs6wilsvNO8TWdKvGo_SggnBDkHrNYwCdr4qAcr38?" ()))
In automate/pumphouse.scm:
    550:6  2 (register tests/only "mago" "/tmp/automate-tests-f3TXkb/automate-def-JFHoG1" (structure (version 3) (name tests/only) (steps ((step (name quick) (label #f) (group #f) (timeout #f) (error-permitted #f) (outputs (value)) (inputs ())))) (resources ()) (params ()) (outputs ()) (web-ui-options ())) #<remote-object> "ocapn://rxfb3fqybkybv5jm5uwvofncqrchbmizp5hne7mlqjwhbsoy2x3q.tcp-tls/s/rrqs6wilsvNO8TWdKvGo_SggnBDkHrNYwCdr4qAcr38?" ())
In automate/model.scm:
    119:2  1 (raise-automate-error _ _ . _)
In ice-9/boot-9.scm:
  1705:22  0 (raise-exception _ #:continuable? _)

pumphouse refused tests/only: Unknown error occurred with remote object

Goblins exception:
In message to #<local-object ^scoped-registrar>:
  (register tests/scoped/one "mago" "/tmp/automate-tests-f3TXkb/automate-def-rbO8EE" (structure (version 3) (name tests/scoped/one) (steps ((step (name quick) (label #f) (group #f) (timeout #f) (error-permitted #f) (outputs (value)) (inputs ())))) (resources ()) (params ()) (outputs ()) (web-ui-options ())) #<remote-object> "ocapn://rxfb3fqybkybv5jm5uwvofncqrchbmizp5hne7mlqjwhbsoy2x3q.tcp-tls/s/tJOkEOAP0aqddG_XU32DCk8C_6UQjaqVcSq1ZOer3JM?" ())
ice-9/boot-9.scm:1705:22: In procedure raise-exception:
ERROR:
  1. &automate-error:
      kind: revoked
      irritants: ((tests/only tests/scoped/))
  2. &message: "this registration was revoked"
  3. &irritants: ((tests/only tests/scoped/))
In goblins/core.scm:
   1074:7  3 (syscaller-$ _ #<local-object ^scoped-registrar> (register tests/scoped/one "mago" "/tmp/automate-tests-f3TXkb/automate-def-rbO8EE" (structure (version 3) (name tests/scoped/one) (steps ((step (name quick) (label #f) (group #f) (timeout #f) (error-permitted #f) (outputs (value)) (inputs ())))) (resources ()) (params ()) (outputs ()) (web-ui-options ())) #<remote-object> "ocapn://rxfb3fqybkybv5jm5uwvofncqrchbmizp5hne7mlqjwhbsoy2x3q.tcp-tls/s/tJOkEOAP0aqddG_XU32DCk8C_6UQjaqVcSq…" …))
In automate/pumphouse.scm:
    550:6  2 (register tests/scoped/one "mago" "/tmp/automate-tests-f3TXkb/automate-def-rbO8EE" (structure (version 3) (name tests/scoped/one) (steps ((step (name quick) (label #f) (group #f) (timeout #f) (error-permitted #f) (outputs (value)) (inputs ())))) (resources ()) (params ()) (outputs ()) (web-ui-options ())) #<remote-object> "ocapn://rxfb3fqybkybv5jm5uwvofncqrchbmizp5hne7mlqjwhbsoy2x3q.tcp-tls/s/tJOkEOAP0aqddG_XU32DCk8C_6UQjaqVcSq1ZOer3JM?" ())
In automate/model.scm:
    119:2  1 (raise-automate-error _ _ . _)
In ice-9/boot-9.scm:
  1705:22  0 (raise-exception _ #:continuable? _)

pumphouse refused tests/scoped/one: Unknown error occurred with remote object

Goblins exception:
In message to #<local-object ^scoped-registrar>:
  (register tests/nap "mago" "/tmp/automate-tests-f3TXkb/automate-def-Sng5G3" (structure (version 3) (name tests/nap) (steps ((step (name nap) (label #f) (group #f) (timeout #f) (error-permitted #f) (outputs (value)) (inputs ())))) (resources ()) (params ()) (outputs ()) (web-ui-options ())) #<remote-object> "ocapn://rxfb3fqybkybv5jm5uwvofncqrchbmizp5hne7mlqjwhbsoy2x3q.tcp-tls/s/TCNWdacmcyFY6Cp0Ccyfd7V0-BGv8jl46ZL1YyHVoDc?" ())
ice-9/boot-9.scm:1705:22: In procedure raise-exception:
ERROR:
  1. &automate-error:
      kind: revoked
      irritants: ((tests/only tests/scoped/))
  2. &message: "this registration was revoked"
  3. &irritants: ((tests/only tests/scoped/))
In goblins/core.scm:
   1074:7  3 (syscaller-$ _ #<local-object ^scoped-registrar> (register tests/nap "mago" "/tmp/automate-tests-f3TXkb/automate-def-Sng5G3" (structure (version 3) (name tests/nap) (steps ((step (name nap) (label #f) (group #f) (timeout #f) (error-permitted #f) (outputs (value)) (inputs ())))) (resources ()) (params ()) (outputs ()) (web-ui-options ())) #<remote-object> "ocapn://rxfb3fqybkybv5jm5uwvofncqrchbmizp5hne7mlqjwhbsoy2x3q.tcp-tls/s/TCNWdacmcyFY6Cp0Ccyfd7V0-BGv8jl46ZL1YyHVoDc?" ()))
In automate/pumphouse.scm:
    550:6  2 (register tests/nap "mago" "/tmp/automate-tests-f3TXkb/automate-def-Sng5G3" (structure (version 3) (name tests/nap) (steps ((step (name nap) (label #f) (group #f) (timeout #f) (error-permitted #f) (outputs (value)) (inputs ())))) (resources ()) (params ()) (outputs ()) (web-ui-options ())) #<remote-object> "ocapn://rxfb3fqybkybv5jm5uwvofncqrchbmizp5hne7mlqjwhbsoy2x3q.tcp-tls/s/TCNWdacmcyFY6Cp0Ccyfd7V0-BGv8jl46ZL1YyHVoDc?" ())
In automate/model.scm:
    119:2  1 (raise-automate-error _ _ . _)
In ice-9/boot-9.scm:
  1705:22  0 (raise-exception _ #:continuable? _)

pumphouse refused tests/nap: Unknown error occurred with remote object

Goblins exception:
In message to #<local-object ^scoped-registrar>:
  (register tests/only "mago" "/tmp/automate-tests-f3TXkb/automate-def-JFHoG1" (structure (version 3) (name tests/only) (steps ((step (name quick) (label #f) (group #f) (timeout #f) (error-permitted #f) (outputs (value)) (inputs ())))) (resources ()) (params ()) (outputs ()) (web-ui-options ())) #<remote-object> "ocapn://f2gipf7ovkzi53b3ynp5udx6rzyqnaes4n2domsogikbybah772q.tcp-tls/s/BjLjjwZhY24EPOAomQlmYIYvL7vKn7-R6xSILzG7vJ4?" ())
ice-9/boot-9.scm:1705:22: In procedure raise-exception:
ERROR:
  1. &automate-error:
      kind: revoked
      irritants: ((tests/only tests/scoped/))
  2. &message: "this registration was revoked"
  3. &irritants: ((tests/only tests/scoped/))
In goblins/core.scm:
   1074:7  3 (syscaller-$ _ #<local-object ^scoped-registrar> (register tests/only "mago" "/tmp/automate-tests-f3TXkb/automate-def-JFHoG1" (structure (version 3) (name tests/only) (steps ((step (name quick) (label #f) (group #f) (timeout #f) (error-permitted #f) (outputs (value)) (inputs ())))) (resources ()) (params ()) (outputs ()) (web-ui-options ())) #<remote-object> "ocapn://f2gipf7ovkzi53b3ynp5udx6rzyqnaes4n2domsogikbybah772q.tcp-tls/s/BjLjjwZhY24EPOAomQlmYIYvL7vKn7-R6xSILzG7vJ4?" ()))
In automate/pumphouse.scm:
    550:6  2 (register tests/only "mago" "/tmp/automate-tests-f3TXkb/automate-def-JFHoG1" (structure (version 3) (name tests/only) (steps ((step (name quick) (label #f) (group #f) (timeout #f) (error-permitted #f) (outputs (value)) (inputs ())))) (resources ()) (params ()) (outputs ()) (web-ui-options ())) #<remote-object> "ocapn://f2gipf7ovkzi53b3ynp5udx6rzyqnaes4n2domsogikbybah772q.tcp-tls/s/BjLjjwZhY24EPOAomQlmYIYvL7vKn7-R6xSILzG7vJ4?" ())
In automate/model.scm:
    119:2  1 (raise-automate-error _ _ . _)
In ice-9/boot-9.scm:
  1705:22  0 (raise-exception _ #:continuable? _)

pumphouse refused tests/only: Unknown error occurred with remote object

Goblins exception:
In message to #<local-object ^scoped-registrar>:
  (register tests/scoped/one "mago" "/tmp/automate-tests-f3TXkb/automate-def-rbO8EE" (structure (version 3) (name tests/scoped/one) (steps ((step (name quick) (label #f) (group #f) (timeout #f) (error-permitted #f) (outputs (value)) (inputs ())))) (resources ()) (params ()) (outputs ()) (web-ui-options ())) #<remote-object> "ocapn://f2gipf7ovkzi53b3ynp5udx6rzyqnaes4n2domsogikbybah772q.tcp-tls/s/pEfFJsymVypyOGITuthkkU2UJB3usFPKLgZLi2o_uhk?" ())
ice-9/boot-9.scm:1705:22: In procedure raise-exception:
ERROR:
  1. &automate-error:
      kind: revoked
      irritants: ((tests/only tests/scoped/))
  2. &message: "this registration was revoked"
  3. &irritants: ((tests/only tests/scoped/))
In goblins/core.scm:
   1074:7  3 (syscaller-$ _ #<local-object ^scoped-registrar> (register tests/scoped/one "mago" "/tmp/automate-tests-f3TXkb/automate-def-rbO8EE" (structure (version 3) (name tests/scoped/one) (steps ((step (name quick) (label #f) (group #f) (timeout #f) (error-permitted #f) (outputs (value)) (inputs ())))) (resources ()) (params ()) (outputs ()) (web-ui-options ())) #<remote-object> "ocapn://f2gipf7ovkzi53b3ynp5udx6rzyqnaes4n2domsogikbybah772q.tcp-tls/s/pEfFJsymVypyOGITuthkkU2UJB3usFPKLgZ…" …))
In automate/pumphouse.scm:
    550:6  2 (register tests/scoped/one "mago" "/tmp/automate-tests-f3TXkb/automate-def-rbO8EE" (structure (version 3) (name tests/scoped/one) (steps ((step (name quick) (label #f) (group #f) (timeout #f) (error-permitted #f) (outputs (value)) (inputs ())))) (resources ()) (params ()) (outputs ()) (web-ui-options ())) #<remote-object> "ocapn://f2gipf7ovkzi53b3ynp5udx6rzyqnaes4n2domsogikbybah772q.tcp-tls/s/pEfFJsymVypyOGITuthkkU2UJB3usFPKLgZLi2o_uhk?" ())
In automate/model.scm:
    119:2  1 (raise-automate-error _ _ . _)
In ice-9/boot-9.scm:
  1705:22  0 (raise-exception _ #:continuable? _)

pumphouse refused tests/scoped/one: Unknown error occurred with remote object

Goblins exception:
In message to #<local-object ^scoped-registrar>:
  (register tests/nap "mago" "/tmp/automate-tests-f3TXkb/automate-def-Sng5G3" (structure (version 3) (name tests/nap) (steps ((step (name nap) (label #f) (group #f) (timeout #f) (error-permitted #f) (outputs (value)) (inputs ())))) (resources ()) (params ()) (outputs ()) (web-ui-options ())) #<remote-object> "ocapn://f2gipf7ovkzi53b3ynp5udx6rzyqnaes4n2domsogikbybah772q.tcp-tls/s/Yg5xbBVA9CxDXf0s9OxGYCH3rQlLqisFjc6jR0cp2ak?" ())
ice-9/boot-9.scm:1705:22: In procedure raise-exception:
ERROR:
  1. &automate-error:
      kind: revoked
      irritants: ((tests/only tests/scoped/))
  2. &message: "this registration was revoked"
  3. &irritants: ((tests/only tests/scoped/))
In goblins/core.scm:
   1074:7  3 (syscaller-$ _ #<local-object ^scoped-registrar> (register tests/nap "mago" "/tmp/automate-tests-f3TXkb/automate-def-Sng5G3" (structure (version 3) (name tests/nap) (steps ((step (name nap) (label #f) (group #f) (timeout #f) (error-permitted #f) (outputs (value)) (inputs ())))) (resources ()) (params ()) (outputs ()) (web-ui-options ())) #<remote-object> "ocapn://f2gipf7ovkzi53b3ynp5udx6rzyqnaes4n2domsogikbybah772q.tcp-tls/s/Yg5xbBVA9CxDXf0s9OxGYCH3rQlLqisFjc6jR0cp2ak?" ()))
In automate/pumphouse.scm:
    550:6  2 (register tests/nap "mago" "/tmp/automate-tests-f3TXkb/automate-def-Sng5G3" (structure (version 3) (name tests/nap) (steps ((step (name nap) (label #f) (group #f) (timeout #f) (error-permitted #f) (outputs (value)) (inputs ())))) (resources ()) (params ()) (outputs ()) (web-ui-options ())) #<remote-object> "ocapn://f2gipf7ovkzi53b3ynp5udx6rzyqnaes4n2domsogikbybah772q.tcp-tls/s/Yg5xbBVA9CxDXf0s9OxGYCH3rQlLqisFjc6jR0cp2ak?" ())
In automate/model.scm:
    119:2  1 (raise-automate-error _ _ . _)
In ice-9/boot-9.scm:
  1705:22  0 (raise-exception _ #:continuable? _)

pumphouse refused tests/nap: Unknown error occurred with remote object
lost the pumphouse; reconnecting

Goblins exception:
In message to #<local-object ^scoped-registrar>:
  (register tests/only "mago" "/tmp/automate-tests-f3TXkb/automate-def-JFHoG1" (structure (version 3) (name tests/only) (steps ((step (name quick) (label #f) (group #f) (timeout #f) (error-permitted #f) (outputs (value)) (inputs ())))) (resources ()) (params ()) (outputs ()) (web-ui-options ())) #<remote-object> "ocapn://rc4nhgha7z5sxx53ovyfpw4aubrfpxmt7q5wwnulkwc7tgubcdga.tcp-tls/s/ta9eCRx122rpM94bt9os5EH0S859dEZnDJCe2rqwpEE?" ())
ice-9/boot-9.scm:1705:22: In procedure raise-exception:
ERROR:
  1. &automate-error:
      kind: revoked
      irritants: ((tests/only tests/scoped/))
  2. &message: "this registration was revoked"
  3. &irritants: ((tests/only tests/scoped/))
In goblins/core.scm:
   1074:7  3 (syscaller-$ _ #<local-object ^scoped-registrar> (register tests/only "mago" "/tmp/automate-tests-f3TXkb/automate-def-JFHoG1" (structure (version 3) (name tests/only) (steps ((step (name quick) (label #f) (group #f) (timeout #f) (error-permitted #f) (outputs (value)) (inputs ())))) (resources ()) (params ()) (outputs ()) (web-ui-options ())) #<remote-object> "ocapn://rc4nhgha7z5sxx53ovyfpw4aubrfpxmt7q5wwnulkwc7tgubcdga.tcp-tls/s/ta9eCRx122rpM94bt9os5EH0S859dEZnDJCe2rqwpEE?" ()))
In automate/pumphouse.scm:
    550:6  2 (register tests/only "mago" "/tmp/automate-tests-f3TXkb/automate-def-JFHoG1" (structure (version 3) (name tests/only) (steps ((step (name quick) (label #f) (group #f) (timeout #f) (error-permitted #f) (outputs (value)) (inputs ())))) (resources ()) (params ()) (outputs ()) (web-ui-options ())) #<remote-object> "ocapn://rc4nhgha7z5sxx53ovyfpw4aubrfpxmt7q5wwnulkwc7tgubcdga.tcp-tls/s/ta9eCRx122rpM94bt9os5EH0S859dEZnDJCe2rqwpEE?" ())
In automate/model.scm:
    119:2  1 (raise-automate-error _ _ . _)
In ice-9/boot-9.scm:
  1705:22  0 (raise-exception _ #:continuable? _)

2026-10-14 20:31:09 (with-exception-handler) INFO: POST /output/44910b7bf9eaf762/look 200 66ms
pumphouse refused tests/only: Unknown error occurred with remote object

Goblins exception:
In message to #<local-object ^scoped-registrar>:
  (register tests/scoped/one "mago" "/tmp/automate-tests-f3TXkb/automate-def-rbO8EE" (structure (version 3) (name tests/scoped/one) (steps ((step (name quick) (label #f) (group #f) (timeout #f) (error-permitted #f) (outputs (value)) (inputs ())))) (resources ()) (params ()) (outputs ()) (web-ui-options ())) #<remote-object> "ocapn://rc4nhgha7z5sxx53ovyfpw4aubrfpxmt7q5wwnulkwc7tgubcdga.tcp-tls/s/zhVK18ltyQz5qcz9IzBbfJOEs17va9RWfZ_UnAGMJus?" ())
ice-9/boot-9.scm:1705:22: In procedure raise-exception:
ERROR:
  1. &automate-error:
      kind: revoked
      irritants: ((tests/only tests/scoped/))
  2. &message: "this registration was revoked"
  3. &irritants: ((tests/only tests/scoped/))
In goblins/core.scm:
   1074:7  3 (syscaller-$ _ #<local-object ^scoped-registrar> (register tests/scoped/one "mago" "/tmp/automate-tests-f3TXkb/automate-def-rbO8EE" (structure (version 3) (name tests/scoped/one) (steps ((step (name quick) (label #f) (group #f) (timeout #f) (error-permitted #f) (outputs (value)) (inputs ())))) (resources ()) (params ()) (outputs ()) (web-ui-options ())) #<remote-object> "ocapn://rc4nhgha7z5sxx53ovyfpw4aubrfpxmt7q5wwnulkwc7tgubcdga.tcp-tls/s/zhVK18ltyQz5qcz9IzBbfJOEs17va9RWfZ_…" …))
In automate/pumphouse.scm:
    550:6  2 (register tests/scoped/one "mago" "/tmp/automate-tests-f3TXkb/automate-def-rbO8EE" (structure (version 3) (name tests/scoped/one) (steps ((step (name quick) (label #f) (group #f) (timeout #f) (error-permitted #f) (outputs (value)) (inputs ())))) (resources ()) (params ()) (outputs ()) (web-ui-options ())) #<remote-object> "ocapn://rc4nhgha7z5sxx53ovyfpw4aubrfpxmt7q5wwnulkwc7tgubcdga.tcp-tls/s/zhVK18ltyQz5qcz9IzBbfJOEs17va9RWfZ_UnAGMJus?" ())
In automate/model.scm:
Error in IO handling wrapped resource #<input-output: file 263>:
#<&compound-exception components: (#<&external-error> #<&origin origin: "fport_write"> #<&message message: "~A"> #<&irritants irritants: ("Broken pipe")> #<&exception-with-kind-and-args kind: system-error args: ("fport_write" "~A" ("Broken pipe") (32))>)>
In fibers.scm:
     85:4 13 (%run-fibers _ _ _ _)
In fibers/interrupts.scm:
     98:4 12 (with-interrupts/thread-cputime _ _ _ _)
In fibers/scheduler.scm:
   380:26 11 (run-scheduler #<scheduler 7f498ec76a10 (remote-peers: (7f498ec76a80))> _)
In ice-9/boot-9.scm:
  1778:15 10 (with-exception-handler #<procedure 7f498b86ddb0 at ice-9/boot-9.scm:1882:7 (exn)> _ #:unwind? _ #:unwind-for-type _)
    119:2  1 (raise-automate-error _ _ . _)
In ice-9/boot-9.scm:
  1784:12  9 (with-exception-handler _ _ #:unwind? _ #:unwind-for-type _)
  1705:22  0 In fibers/scheduler.scm:
(raise-exception _ #:continuable? _)
   344:10  8 (next-task)
In fibers.scm:

    179:8  7 (_)
In goblins/actor-lib/io.scm:
    60:10  6 (_)
    85:15  5 (_ _)
In ice-9/boot-9.scm:
  1784:12  4 (with-exception-handler _ _ #:unwind? _ #:unwind-for-type _)
In goblins/actor-lib/io.scm:
    70:18  3 (run-and-send)
In ice-9/suspendable-ports.scm:
     83:4  2 (write-bytes #<input-output: file 263> #vu8(60 49 51 39 111 112 58 103 99 45 101 120 112 111 114 116 115 91 49 43 93 91 49 43 93 62 111 114 116 52 43 62 91 55 39 102 117 108 102 105 108 108 50 39 111 107 93 102 102 62 99 58 105 109 112 111 114 116 45 111 98 106 101 99 116 50 43 62 91 91 53 39 115 116 97 116 101 53 39 118 97 108 117 101 54 39 102 97 105 108 101 100 93 93 91 53 39 118 97 108 117 101 93 91 60 52 39 112 97 105 114 54 39 114 117 110 45 105 100 49 54 34 52 52 57 49 …) …)
In unknown file:
           1 (port-write #<input-output: file 263> #vu8(60 49 51 39 111 112 58 103 99 45 101 120 112 111 114 116 115 91 49 43 93 91 49 43 93 62 111 114 116 52 43 62 91 55 39 102 117 108 102 105 108 108 50 39 111 107 93 102 102 62 99 58 105 109 112 111 114 116 45 111 98 106 101 99 116 50 43 62 91 91 53 39 115 116 97 116 101 53 39 118 97 108 117 101 54 39 102 97 105 108 101 100 93 93 91 53 39 118 97 108 117 101 93 91 60 52 39 112 97 105 114 54 39 114 117 110 45 105 100 49 54 34 52 52 57 49 # …) …)
In ice-9/boot-9.scm:
  1705:22  0 (raise-exception _ #:continuable? _)

Uncaught exception in task:
In fibers.scm:
    179:8 11 (_)
In goblins/actor-lib/io.scm:
pumphouse refused tests/scoped/one: Unknown error occurred with remote object
    60:10 10 (_)
    85:15  9 (_ _)
In ice-9/boot-9.scm:
  1784:12  8 (with-exception-handler _ _ #:unwind? _ #:unwind-for-type _)
In goblins/actor-lib/io.scm:
    70:18  7 (run-and-send)
In ice-9/suspendable-ports.scm:
     83:4  6 (write-bytes #<input-output: file 263> #vu8(60 49 51 39 111 112 58 103 99 45 101 120 112 111 114 116 115 91 49 43 93 91 49 43 93 62 111 114 116 52 43 62 91 55 39 102 117 108 102 105 108 108 50 39 111 107 93 102 102 62 99 58 105 109 112 111 114 116 45 111 98 106 101 99 116 50 43 62 91 91 53 39 115 116 97 116 101 53 39 118 97 108 117 101 54 39 102 97 105 108 101 100 93 93 91 53 39 118 97 108 117 101 93 91 60 52 39 112 97 105 114 54 39 114 117 110 45 105 100 49 54 34 52 52 57 49 …) …)
In unknown file:
           5 (port-write #<input-output: file 263> #vu8(60 49 51 39 111 112 58 103 99 45 101 120 112 111 114 116 115 91 49 43 93 91 49 43 93 62 111 114 116 52 43 62 91 55 39 102 117 108 102 105 108 108 50 39 111 107 93 102 102 62 99 58 105 109 112 111 114 116 45 111 98 106 101 99 116 50 43 62 91 91 53 39 115 116 97 116 101 53 39 118 97 108 117 101 54 39 102 97 105 108 101 100 93 93 91 53 39 118 97 108 117 101 93 91 60 52 39 112 97 105 114 54 39 114 117 110 45 105 100 49 54 34 52 52 57 49 # …) …)
In ice-9/boot-9.scm:
  1705:22  4 (raise-exception _ #:continuable? _)
In goblins/core.scm:
   1987:7  3 (<-np-extern _ . _)
In fibers/operations.scm:
   200:10  2 (perform-operation _)
In fibers/scheduler.scm:
    461:6  1 (suspend-current-task _)
In ice-9/boot-9.scm:
  1705:22  0 (raise-exception _ #:continuable? _)

Goblins exception:
In message to #<local-object ^scoped-registrar>:
  (register tests/nap "mago" "/tmp/automate-tests-f3TXkb/automate-def-Sng5G3" (structure (version 3) (name tests/nap) (steps ((step (name nap) (label #f) (group #f) (timeout #f) (error-permitted #f) (outputs (value)) (inputs ())))) (resources ()) (params ()) (outputs ()) (web-ui-options ())) #<remote-object> "ocapn://rc4nhgha7z5sxx53ovyfpw4aubrfpxmt7q5wwnulkwc7tgubcdga.tcp-tls/s/1Xl5_An96DwV6k976XKoo4Ut35IsY4eaQBzxVDJZN5s?" ())
ice-9/boot-9.scm:1705:22: In procedure raise-exception:
ERROR:
  1. &automate-error:
      kind: revoked
      irritants: ((tests/only tests/scoped/))
  2. &message: "this registration was revoked"
  3. &irritants: ((tests/only tests/scoped/))
ice-9/boot-9.scm:1705:22: In procedure raise-exception:
Attempt to suspend fiber within continuation barrier
In goblins/core.scm:
   1074:7  3 (syscaller-$ _ #<local-object ^scoped-registrar> (register tests/nap "mago" "/tmp/automate-tests-f3TXkb/automate-def-Sng5G3" (structure (version 3) (name tests/nap) (steps ((step (name nap) (label #f) (group #f) (timeout #f) (error-permitted #f) (outputs (value)) (inputs ())))) (resources ()) (params ()) (outputs ()) (web-ui-options ())) #<remote-object> "ocapn://rc4nhgha7z5sxx53ovyfpw4aubrfpxmt7q5wwnulkwc7tgubcdga.tcp-tls/s/1Xl5_An96DwV6k976XKoo4Ut35IsY4eaQBzxVDJZN5s?" ()))
In automate/pumphouse.scm:
    550:6  2 (register tests/nap "mago" "/tmp/automate-tests-f3TXkb/automate-def-Sng5G3" (structure (version 3) (name tests/nap) (steps ((step (name nap) (label #f) (group #f) (timeout #f) (error-permitted #f) (outputs (value)) (inputs ())))) (resources ()) (params ()) (outputs ()) (web-ui-options ())) #<remote-object> "ocapn://rc4nhgha7z5sxx53ovyfpw4aubrfpxmt7q5wwnulkwc7tgubcdga.tcp-tls/s/1Xl5_An96DwV6k976XKoo4Ut35IsY4eaQBzxVDJZN5s?" ())
In automate/model.scm:
    119:2  1 (raise-automate-error _ _ . _)
In ice-9/boot-9.scm:
  1705:22  0 (raise-exception _ #:continuable? _)

pumphouse refused tests/nap: Unknown error occurred with remote object
2026-10-14 20:31:10 (with-exception-handler) INFO: POST /output/44910b7bf9eaf762/change 200 23ms
attached to the pumphouse of /tmp/automate-tests-f3TXkb/automate-pumphouse-lHKSCz/any

Goblins exception:
In message to #<local-object ^scoped-registrar>:
  (register tests/only "mago" "/tmp/automate-tests-f3TXkb/automate-def-JFHoG1" (structure (version 3) (name tests/only) (steps ((step (name quick) (label #f) (group #f) (timeout #f) (error-permitted #f) (outputs (value)) (inputs ())))) (resources ()) (params ()) (outputs ()) (web-ui-options ())) #<remote-object> "ocapn://jkx2pa2geshfe7f54kdh4ncfcg2nivueqb7calt4fw3ullbrv7qa.tcp-tls/s/jAxjsgu6Hb7WkhJ7712WW9UawLG1bkCcedVKtmGGZXs?" ())
ice-9/boot-9.scm:1705:22: In procedure raise-exception:
ERROR:
  1. &automate-error:
      kind: revoked
      irritants: ((tests/only tests/scoped/))
  2. &message: "this registration was revoked"
  3. &irritants: ((tests/only tests/scoped/))
In goblins/core.scm:
   1074:7  3 (syscaller-$ _ #<local-object ^scoped-registrar> (register tests/only "mago" "/tmp/automate-tests-f3TXkb/automate-def-JFHoG1" (structure (version 3) (name tests/only) (steps ((step (name quick) (label #f) (group #f) (timeout #f) (error-permitted #f) (outputs (value)) (inputs ())))) (resources ()) (params ()) (outputs ()) (web-ui-options ())) #<remote-object> "ocapn://jkx2pa2geshfe7f54kdh4ncfcg2nivueqb7calt4fw3ullbrv7qa.tcp-tls/s/jAxjsgu6Hb7WkhJ7712WW9UawLG1bkCcedVKtmGGZXs?" ()))
In automate/pumphouse.scm:
    550:6  2 (register tests/only "mago" "/tmp/automate-tests-f3TXkb/automate-def-JFHoG1" (structure (version 3) (name tests/only) (steps ((step (name quick) (label #f) (group #f) (timeout #f) (error-permitted #f) (outputs (value)) (inputs ())))) (resources ()) (params ()) (outputs ()) (web-ui-options ())) #<remote-object> "ocapn://jkx2pa2geshfe7f54kdh4ncfcg2nivueqb7calt4fw3ullbrv7qa.tcp-tls/s/jAxjsgu6Hb7WkhJ7712WW9UawLG1bkCcedVKtmGGZXs?" ())
In automate/model.scm:
    119:2  1 (raise-automate-error _ _ . _)
In ice-9/boot-9.scm:
  1705:22  0 (raise-exception _ #:continuable? _)

2026-10-14 20:31:11 (with-exception-handler) INFO: POST /webhook 202 465ms
pumphouse refused tests/only: Unknown error occurred with remote object

Goblins exception:
In message to #<local-object ^scoped-registrar>:
  (register tests/scoped/one "mago" "/tmp/automate-tests-f3TXkb/automate-def-rbO8EE" (structure (version 3) (name tests/scoped/one) (steps ((step (name quick) (label #f) (group #f) (timeout #f) (error-permitted #f) (outputs (value)) (inputs ())))) (resources ()) (params ()) (outputs ()) (web-ui-options ())) #<remote-object> "ocapn://jkx2pa2geshfe7f54kdh4ncfcg2nivueqb7calt4fw3ullbrv7qa.tcp-tls/s/ioK31GSvaJvdF9VmWP_u5dOaUD6FVe9EhAYMSbyhPUY?" ())
ice-9/boot-9.scm:1705:22: In procedure raise-exception:
ERROR:
  1. &automate-error:
      kind: revoked
      irritants: ((tests/only tests/scoped/))
  2. &message: "this registration was revoked"
  3. &irritants: ((tests/only tests/scoped/))
In goblins/core.scm:
   1074:7  3 (syscaller-$ _ #<local-object ^scoped-registrar> (register tests/scoped/one "mago" "/tmp/automate-tests-f3TXkb/automate-def-rbO8EE" (structure (version 3) (name tests/scoped/one) (steps ((step (name quick) (label #f) (group #f) (timeout #f) (error-permitted #f) (outputs (value)) (inputs ())))) (resources ()) (params ()) (outputs ()) (web-ui-options ())) #<remote-object> "ocapn://jkx2pa2geshfe7f54kdh4ncfcg2nivueqb7calt4fw3ullbrv7qa.tcp-tls/s/ioK31GSvaJvdF9VmWP_u5dOaUD6FVe9EhAY…" …))
In automate/pumphouse.scm:
    550:6  2 (register tests/scoped/one "mago" "/tmp/automate-tests-f3TXkb/automate-def-rbO8EE" (structure (version 3) (name tests/scoped/one) (steps ((step (name quick) (label #f) (group #f) (timeout #f) (error-permitted #f) (outputs (value)) (inputs ())))) (resources ()) (params ()) (outputs ()) (web-ui-options ())) #<remote-object> "ocapn://jkx2pa2geshfe7f54kdh4ncfcg2nivueqb7calt4fw3ullbrv7qa.tcp-tls/s/ioK31GSvaJvdF9VmWP_u5dOaUD6FVe9EhAYMSbyhPUY?" ())
In automate/model.scm:
    119:2  1 (raise-automate-error _ _ . _)
In ice-9/boot-9.scm:
  1705:22  0 (raise-exception _ #:continuable? _)

pumphouse refused tests/scoped/one: Unknown error occurred with remote object

Goblins exception:
In message to #<local-object ^scoped-registrar>:
  (register tests/nap "mago" "/tmp/automate-tests-f3TXkb/automate-def-Sng5G3" (structure (version 3) (name tests/nap) (steps ((step (name nap) (label #f) (group #f) (timeout #f) (error-permitted #f) (outputs (value)) (inputs ())))) (resources ()) (params ()) (outputs ()) (web-ui-options ())) #<remote-object> "ocapn://jkx2pa2geshfe7f54kdh4ncfcg2nivueqb7calt4fw3ullbrv7qa.tcp-tls/s/ILTrCcR3SIKbv6o4ZLeS4u9Rnv6PMjzHn8YVxyKhhmI?" ())
ice-9/boot-9.scm:1705:22: In procedure raise-exception:
ERROR:
  1. &automate-error:
      kind: revoked
      irritants: ((tests/only tests/scoped/))
  2. &message: "this registration was revoked"
  3. &irritants: ((tests/only tests/scoped/))
In goblins/core.scm:
   1074:7  3 (syscaller-$ _ #<local-object ^scoped-registrar> (register tests/nap "mago" "/tmp/automate-tests-f3TXkb/automate-def-Sng5G3" (structure (version 3) (name tests/nap) (steps ((step (name nap) (label #f) (group #f) (timeout #f) (error-permitted #f) (outputs (value)) (inputs ())))) (resources ()) (params ()) (outputs ()) (web-ui-options ())) #<remote-object> "ocapn://jkx2pa2geshfe7f54kdh4ncfcg2nivueqb7calt4fw3ullbrv7qa.tcp-tls/s/ILTrCcR3SIKbv6o4ZLeS4u9Rnv6PMjzHn8YVxyKhhmI?" ()))
In automate/pumphouse.scm:
    550:6  2 (register tests/nap "mago" "/tmp/automate-tests-f3TXkb/automate-def-Sng5G3" (structure (version 3) (name tests/nap) (steps ((step (name nap) (label #f) (group #f) (timeout #f) (error-permitted #f) (outputs (value)) (inputs ())))) (resources ()) (params ()) (outputs ()) (web-ui-options ())) #<remote-object> "ocapn://jkx2pa2geshfe7f54kdh4ncfcg2nivueqb7calt4fw3ullbrv7qa.tcp-tls/s/ILTrCcR3SIKbv6o4ZLeS4u9Rnv6PMjzHn8YVxyKhhmI?" ())
In automate/model.scm:
    119:2  1 (raise-automate-error _ _ . _)
In ice-9/boot-9.scm:
  1705:22  0 (raise-exception _ #:continuable? _)

pumphouse refused tests/nap: Unknown error occurred with remote object
2026-10-14 20:31:11 (with-exception-handler) INFO: POST /webhook 202 7ms
2026-10-14 20:31:11 (with-exception-handler) INFO: POST /hooks/other 202 6ms
2026-10-14 20:31:11 (with-exception-handler) INFO: POST /hooks/other 403 2ms
2026-10-14 20:31:12 (with-exception-handler) INFO: POST /webhook 403 0ms

Goblins exception:
In message to #<local-object ^scoped-registrar>:
  (register tests/only "mago" "/tmp/automate-tests-f3TXkb/automate-def-JFHoG1" (structure (version 3) (name tests/only) (steps ((step (name quick) (label #f) (group #f) (timeout #f) (error-permitted #f) (outputs (value)) (inputs ())))) (resources ()) (params ()) (outputs ()) (web-ui-options ())) #<remote-object> "ocapn://wkdwtbklot4b5ezzvgmtvv36vyfy7iweohoy44dnijklqmmsn5da.tcp-tls/s/UfgWMLN1JrRjKUdfjPF-5qpYX4bl_NExSQH6LIXP3SA?" ())
ice-9/boot-9.scm:1705:22: In procedure raise-exception:
ERROR:
  1. &automate-error:
      kind: revoked
      irritants: ((tests/only tests/scoped/))
  2. &message: "this registration was revoked"
  3. &irritants: ((tests/only tests/scoped/))
In goblins/core.scm:
   1074:7  3 (syscaller-$ _ #<local-object ^scoped-registrar> (register tests/only "mago" "/tmp/automate-tests-f3TXkb/automate-def-JFHoG1" (structure (version 3) (name tests/only) (steps ((step (name quick) (label #f) (group #f) (timeout #f) (error-permitted #f) (outputs (value)) (inputs ())))) (resources ()) (params ()) (outputs ()) (web-ui-options ())) #<remote-object> "ocapn://wkdwtbklot4b5ezzvgmtvv36vyfy7iweohoy44dnijklqmmsn5da.tcp-tls/s/UfgWMLN1JrRjKUdfjPF-5qpYX4bl_NExSQH6LIXP3SA?" ()))
In automate/pumphouse.scm:
    550:6  2 (register tests/only "mago" "/tmp/automate-tests-f3TXkb/automate-def-JFHoG1" (structure (version 3) (name tests/only) (steps ((step (name quick) (label #f) (group #f) (timeout #f) (error-permitted #f) (outputs (value)) (inputs ())))) (resources ()) (params ()) (outputs ()) (web-ui-options ())) #<remote-object> "ocapn://wkdwtbklot4b5ezzvgmtvv36vyfy7iweohoy44dnijklqmmsn5da.tcp-tls/s/UfgWMLN1JrRjKUdfjPF-5qpYX4bl_NExSQH6LIXP3SA?" ())
In automate/model.scm:
    119:2  1 (raise-automate-error _ _ . _)
In ice-9/boot-9.scm:
  1705:22  0 (raise-exception _ #:continuable? _)

pumphouse refused tests/only: Unknown error occurred with remote object

Goblins exception:
In message to #<local-object ^scoped-registrar>:
  (register tests/scoped/one "mago" "/tmp/automate-tests-f3TXkb/automate-def-rbO8EE" (structure (version 3) (name tests/scoped/one) (steps ((step (name quick) (label #f) (group #f) (timeout #f) (error-permitted #f) (outputs (value)) (inputs ())))) (resources ()) (params ()) (outputs ()) (web-ui-options ())) #<remote-object> "ocapn://wkdwtbklot4b5ezzvgmtvv36vyfy7iweohoy44dnijklqmmsn5da.tcp-tls/s/Ch6o8aGlNNcG8p6Y0op0iCDlr4VZxiXp3_RueuQWdjU?" ())
ice-9/boot-9.scm:1705:22: In procedure raise-exception:
ERROR:
  1. &automate-error:
      kind: revoked
      irritants: ((tests/only tests/scoped/))
  2. &message: "this registration was revoked"
  3. &irritants: ((tests/only tests/scoped/))
In goblins/core.scm:
   1074:7  3 (syscaller-$ _ #<local-object ^scoped-registrar> (register tests/scoped/one "mago" "/tmp/automate-tests-f3TXkb/automate-def-rbO8EE" (structure (version 3) (name tests/scoped/one) (steps ((step (name quick) (label #f) (group #f) (timeout #f) (error-permitted #f) (outputs (value)) (inputs ())))) (resources ()) (params ()) (outputs ()) (web-ui-options ())) #<remote-object> "ocapn://wkdwtbklot4b5ezzvgmtvv36vyfy7iweohoy44dnijklqmmsn5da.tcp-tls/s/Ch6o8aGlNNcG8p6Y0op0iCDlr4VZxiXp3_R…" …))
In automate/pumphouse.scm:
    550:6  2 (register tests/scoped/one "mago" "/tmp/automate-tests-f3TXkb/automate-def-rbO8EE" (structure (version 3) (name tests/scoped/one) (steps ((step (name quick) (label #f) (group #f) (timeout #f) (error-permitted #f) (outputs (value)) (inputs ())))) (resources ()) (params ()) (outputs ()) (web-ui-options ())) #<remote-object> "ocapn://wkdwtbklot4b5ezzvgmtvv36vyfy7iweohoy44dnijklqmmsn5da.tcp-tls/s/Ch6o8aGlNNcG8p6Y0op0iCDlr4VZxiXp3_RueuQWdjU?" ())
In automate/model.scm:
    119:2  1 (raise-automate-error _ _ . _)
In ice-9/boot-9.scm:
  1705:22  0 (raise-exception _ #:continuable? _)

pumphouse refused tests/scoped/one: Unknown error occurred with remote object

Goblins exception:
In message to #<local-object ^scoped-registrar>:
  (register tests/nap "mago" "/tmp/automate-tests-f3TXkb/automate-def-Sng5G3" (structure (version 3) (name tests/nap) (steps ((step (name nap) (label #f) (group #f) (timeout #f) (error-permitted #f) (outputs (value)) (inputs ())))) (resources ()) (params ()) (outputs ()) (web-ui-options ())) #<remote-object> "ocapn://wkdwtbklot4b5ezzvgmtvv36vyfy7iweohoy44dnijklqmmsn5da.tcp-tls/s/h1FA1RwfwKvrFl8eaMKg5XITUDrpYoZdEZDyc9MSrn4?" ())
ice-9/boot-9.scm:1705:22: In procedure raise-exception:
ERROR:
  1. &automate-error:
      kind: revoked
      irritants: ((tests/only tests/scoped/))
  2. &message: "this registration was revoked"
  3. &irritants: ((tests/only tests/scoped/))
In goblins/core.scm:
   1074:7  3 (syscaller-$ _ #<local-object ^scoped-registrar> (register tests/nap "mago" "/tmp/automate-tests-f3TXkb/automate-def-Sng5G3" (structure (version 3) (name tests/nap) (steps ((step (name nap) (label #f) (group #f) (timeout #f) (error-permitted #f) (outputs (value)) (inputs ())))) (resources ()) (params ()) (outputs ()) (web-ui-options ())) #<remote-object> "ocapn://wkdwtbklot4b5ezzvgmtvv36vyfy7iweohoy44dnijklqmmsn5da.tcp-tls/s/h1FA1RwfwKvrFl8eaMKg5XITUDrpYoZdEZDyc9MSrn4?" ()))
In automate/pumphouse.scm:
    550:6  2 (register tests/nap "mago" "/tmp/automate-tests-f3TXkb/automate-def-Sng5G3" (structure (version 3) (name tests/nap) (steps ((step (name nap) (label #f) (group #f) (timeout #f) (error-permitted #f) (outputs (value)) (inputs ())))) (resources ()) (params ()) (outputs ()) (web-ui-options ())) #<remote-object> "ocapn://wkdwtbklot4b5ezzvgmtvv36vyfy7iweohoy44dnijklqmmsn5da.tcp-tls/s/h1FA1RwfwKvrFl8eaMKg5XITUDrpYoZdEZDyc9MSrn4?" ())
In automate/model.scm:
    119:2  1 (raise-automate-error _ _ . _)
In ice-9/boot-9.scm:
  1705:22  0 (raise-exception _ #:continuable? _)

pumphouse refused tests/nap: Unknown error occurred with remote object

Goblins exception:
In message to #<local-object ^session>:
  (abort "3cf94166bdfa3873" "3cf94166bdfa3873" "aborted")
ice-9/boot-9.scm:1705:22: In procedure raise-exception:
ERROR:
  1. &automate-error:
      kind: not-permitted
      irritants: ("3cf94166bdfa3873")
  2. &message: "a run may not abort itself"
  3. &irritants: ("3cf94166bdfa3873")
In goblins/core.scm:
   1074:7  3 (syscaller-$ _ #<local-object ^session> (abort "3cf94166bdfa3873" "3cf94166bdfa3873" "aborted"))
In automate/pumphouse.scm:
    412:6  2 (abort "3cf94166bdfa3873" "3cf94166bdfa3873" "aborted")
In automate/model.scm:
    119:2  1 (raise-automate-error _ _ . _)
In ice-9/boot-9.scm:
  1705:22  0 (raise-exception _ #:continuable? _)

session tests/stopper on mago abort: a run may not abort itself: "3cf94166bdfa3873"

Goblins exception:
In message to #<local-object ^scoped-registrar>:
  (register tests/only "mago" "/tmp/automate-tests-f3TXkb/automate-def-JFHoG1" (structure (version 3) (name tests/only) (steps ((step (name quick) (label #f) (group #f) (timeout #f) (error-permitted #f) (outputs (value)) (inputs ())))) (resources ()) (params ()) (outputs ()) (web-ui-options ())) #<remote-object> "ocapn://4x4yewav72i33ls6ks3psgsgupsf52korqo62n5hvvi3xfatjoya.tcp-tls/s/5J4mgZQKewmkCD25DhIW8mJS_lmCQOqREoPlA75NyBY?" ())
ice-9/boot-9.scm:1705:22: In procedure raise-exception:
ERROR:
  1. &automate-error:
      kind: revoked
      irritants: ((tests/only tests/scoped/))
  2. &message: "this registration was revoked"
  3. &irritants: ((tests/only tests/scoped/))
In goblins/core.scm:
   1074:7  3 (syscaller-$ _ #<local-object ^scoped-registrar> (register tests/only "mago" "/tmp/automate-tests-f3TXkb/automate-def-JFHoG1" (structure (version 3) (name tests/only) (steps ((step (name quick) (label #f) (group #f) (timeout #f) (error-permitted #f) (outputs (value)) (inputs ())))) (resources ()) (params ()) (outputs ()) (web-ui-options ())) #<remote-object> "ocapn://4x4yewav72i33ls6ks3psgsgupsf52korqo62n5hvvi3xfatjoya.tcp-tls/s/5J4mgZQKewmkCD25DhIW8mJS_lmCQOqREoPlA75NyBY?" ()))
In automate/pumphouse.scm:
    550:6  2 (register tests/only "mago" "/tmp/automate-tests-f3TXkb/automate-def-JFHoG1" (structure (version 3) (name tests/only) (steps ((step (name quick) (label #f) (group #f) (timeout #f) (error-permitted #f) (outputs (value)) (inputs ())))) (resources ()) (params ()) (outputs ()) (web-ui-options ())) #<remote-object> "ocapn://4x4yewav72i33ls6ks3psgsgupsf52korqo62n5hvvi3xfatjoya.tcp-tls/s/5J4mgZQKewmkCD25DhIW8mJS_lmCQOqREoPlA75NyBY?" ())
In automate/model.scm:
    119:2  1 (raise-automate-error _ _ . _)
In ice-9/boot-9.scm:
  1705:22  0 (raise-exception _ #:continuable? _)

pumphouse refused tests/only: Unknown error occurred with remote object

Goblins exception:
In message to #<local-object ^scoped-registrar>:
  (register tests/scoped/one "mago" "/tmp/automate-tests-f3TXkb/automate-def-rbO8EE" (structure (version 3) (name tests/scoped/one) (steps ((step (name quick) (label #f) (group #f) (timeout #f) (error-permitted #f) (outputs (value)) (inputs ())))) (resources ()) (params ()) (outputs ()) (web-ui-options ())) #<remote-object> "ocapn://4x4yewav72i33ls6ks3psgsgupsf52korqo62n5hvvi3xfatjoya.tcp-tls/s/qcSV-HY02r6jPomOWcxk5-vbXBGjtgqgE4nFh0KxIMU?" ())
ice-9/boot-9.scm:1705:22: In procedure raise-exception:
ERROR:
  1. &automate-error:
      kind: revoked
      irritants: ((tests/only tests/scoped/))
  2. &message: "this registration was revoked"
  3. &irritants: ((tests/only tests/scoped/))
In goblins/core.scm:
   1074:7  3 (syscaller-$ _ #<local-object ^scoped-registrar> (register tests/scoped/one "mago" "/tmp/automate-tests-f3TXkb/automate-def-rbO8EE" (structure (version 3) (name tests/scoped/one) (steps ((step (name quick) (label #f) (group #f) (timeout #f) (error-permitted #f) (outputs (value)) (inputs ())))) (resources ()) (params ()) (outputs ()) (web-ui-options ())) #<remote-object> "ocapn://4x4yewav72i33ls6ks3psgsgupsf52korqo62n5hvvi3xfatjoya.tcp-tls/s/qcSV-HY02r6jPomOWcxk5-vbXBGjtgqgE4n…" …))
In automate/pumphouse.scm:
    550:6  2 (register tests/scoped/one "mago" "/tmp/automate-tests-f3TXkb/automate-def-rbO8EE" (structure (version 3) (name tests/scoped/one) (steps ((step (name quick) (label #f) (group #f) (timeout #f) (error-permitted #f) (outputs (value)) (inputs ())))) (resources ()) (params ()) (outputs ()) (web-ui-options ())) #<remote-object> "ocapn://4x4yewav72i33ls6ks3psgsgupsf52korqo62n5hvvi3xfatjoya.tcp-tls/s/qcSV-HY02r6jPomOWcxk5-vbXBGjtgqgE4nFh0KxIMU?" ())
In automate/model.scm:
    119:2  1 (raise-automate-error _ _ . _)
In ice-9/boot-9.scm:
  1705:22  0 (raise-exception _ #:continuable? _)

pumphouse refused tests/scoped/one: Unknown error occurred with remote object

Goblins exception:
In message to #<local-object ^scoped-registrar>:
  (register tests/nap "mago" "/tmp/automate-tests-f3TXkb/automate-def-Sng5G3" (structure (version 3) (name tests/nap) (steps ((step (name nap) (label #f) (group #f) (timeout #f) (error-permitted #f) (outputs (value)) (inputs ())))) (resources ()) (params ()) (outputs ()) (web-ui-options ())) #<remote-object> "ocapn://4x4yewav72i33ls6ks3psgsgupsf52korqo62n5hvvi3xfatjoya.tcp-tls/s/w_HcscmsF4EszYsW08bw_-vbttbSACbOfcJRcvMd5_A?" ())
ice-9/boot-9.scm:1705:22: In procedure raise-exception:
ERROR:
  1. &automate-error:
      kind: revoked
      irritants: ((tests/only tests/scoped/))
  2. &message: "this registration was revoked"
  3. &irritants: ((tests/only tests/scoped/))
In goblins/core.scm:
   1074:7  3 (syscaller-$ _ #<local-object ^scoped-registrar> (register tests/nap "mago" "/tmp/automate-tests-f3TXkb/automate-def-Sng5G3" (structure (version 3) (name tests/nap) (steps ((step (name nap) (label #f) (group #f) (timeout #f) (error-permitted #f) (outputs (value)) (inputs ())))) (resources ()) (params ()) (outputs ()) (web-ui-options ())) #<remote-object> "ocapn://4x4yewav72i33ls6ks3psgsgupsf52korqo62n5hvvi3xfatjoya.tcp-tls/s/w_HcscmsF4EszYsW08bw_-vbttbSACbOfcJRcvMd5_A?" ()))
In automate/pumphouse.scm:
    550:6  2 (register tests/nap "mago" "/tmp/automate-tests-f3TXkb/automate-def-Sng5G3" (structure (version 3) (name tests/nap) (steps ((step (name nap) (label #f) (group #f) (timeout #f) (error-permitted #f) (outputs (value)) (inputs ())))) (resources ()) (params ()) (outputs ()) (web-ui-options ())) #<remote-object> "ocapn://4x4yewav72i33ls6ks3psgsgupsf52korqo62n5hvvi3xfatjoya.tcp-tls/s/w_HcscmsF4EszYsW08bw_-vbttbSACbOfcJRcvMd5_A?" ())
In automate/model.scm:
    119:2  1 (raise-automate-error _ _ . _)
In ice-9/boot-9.scm:
  1705:22  0 (raise-exception _ #:continuable? _)

pumphouse refused tests/nap: Unknown error occurred with remote object

Goblins exception:
In message to #<local-object ^scoped-registrar>:
  (register tests/only "mago" "/tmp/automate-tests-f3TXkb/automate-def-JFHoG1" (structure (version 3) (name tests/only) (steps ((step (name quick) (label #f) (group #f) (timeout #f) (error-permitted #f) (outputs (value)) (inputs ())))) (resources ()) (params ()) (outputs ()) (web-ui-options ())) #<remote-object> "ocapn://dvpnc7ddnyaefm2w3g2bghqlxgpsxawopqnszudmiboovdsir4ja.tcp-tls/s/V95u4ZfDFQFzIK6dFrfpdV3fVqQ_i3Q0diIcQf1woCg?" ())
ice-9/boot-9.scm:1705:22: In procedure raise-exception:
ERROR:
  1. &automate-error:
      kind: revoked
      irritants: ((tests/only tests/scoped/))
  2. &message: "this registration was revoked"
  3. &irritants: ((tests/only tests/scoped/))
In goblins/core.scm:
   1074:7  3 (syscaller-$ _ #<local-object ^scoped-registrar> (register tests/only "mago" "/tmp/automate-tests-f3TXkb/automate-def-JFHoG1" (structure (version 3) (name tests/only) (steps ((step (name quick) (label #f) (group #f) (timeout #f) (error-permitted #f) (outputs (value)) (inputs ())))) (resources ()) (params ()) (outputs ()) (web-ui-options ())) #<remote-object> "ocapn://dvpnc7ddnyaefm2w3g2bghqlxgpsxawopqnszudmiboovdsir4ja.tcp-tls/s/V95u4ZfDFQFzIK6dFrfpdV3fVqQ_i3Q0diIcQf1woCg?" ()))
In automate/pumphouse.scm:
    550:6  2 (register tests/only "mago" "/tmp/automate-tests-f3TXkb/automate-def-JFHoG1" (structure (version 3) (name tests/only) (steps ((step (name quick) (label #f) (group #f) (timeout #f) (error-permitted #f) (outputs (value)) (inputs ())))) (resources ()) (params ()) (outputs ()) (web-ui-options ())) #<remote-object> "ocapn://dvpnc7ddnyaefm2w3g2bghqlxgpsxawopqnszudmiboovdsir4ja.tcp-tls/s/V95u4ZfDFQFzIK6dFrfpdV3fVqQ_i3Q0diIcQf1woCg?" ())
In automate/model.scm:
    119:2  1 (raise-automate-error _ _ . _)
In ice-9/boot-9.scm:
  1705:22  0 (raise-exception _ #:continuable? _)


Goblins exception:
In message to #<local-object ^session>:
  (abort "47063dcde57ff11f" "47063dcde57ff11f" "aborted")
ice-9/boot-9.scm:1705:22: In procedure raise-exception:
ERROR:
  1. &automate-error:
      kind: not-permitted
      irritants: ("47063dcde57ff11f")
  2. &message: "a run may not abort itself"
  3. &irritants: ("47063dcde57ff11f")
In goblins/core.scm:
   1074:7  3 (syscaller-$ _ #<local-object ^session> (abort "47063dcde57ff11f" "47063dcde57ff11f" "aborted"))
In automate/pumphouse.scm:
    412:6  2 (abort "47063dcde57ff11f" "47063dcde57ff11f" "aborted")
In automate/model.scm:
    119:2  1 (raise-automate-error _ _ . _)
In ice-9/boot-9.scm:
  1705:22  0 (raise-exception _ #:continuable? _)

session tests/stopper on mago abort: a run may not abort itself: "47063dcde57ff11f"
pumphouse refused tests/only: Unknown error occurred with remote object

Goblins exception:
In message to #<local-object ^scoped-registrar>:
  (register tests/scoped/one "mago" "/tmp/automate-tests-f3TXkb/automate-def-rbO8EE" (structure (version 3) (name tests/scoped/one) (steps ((step (name quick) (label #f) (group #f) (timeout #f) (error-permitted #f) (outputs (value)) (inputs ())))) (resources ()) (params ()) (outputs ()) (web-ui-options ())) #<remote-object> "ocapn://dvpnc7ddnyaefm2w3g2bghqlxgpsxawopqnszudmiboovdsir4ja.tcp-tls/s/nxKwguTbzb8v_6lZa-qxUAvyIcVaav_AAwRiar8F8iM?" ())
ice-9/boot-9.scm:1705:22: In procedure raise-exception:
ERROR:
  1. &automate-error:
      kind: revoked
      irritants: ((tests/only tests/scoped/))
  2. &message: "this registration was revoked"
  3. &irritants: ((tests/only tests/scoped/))
In goblins/core.scm:
   1074:7  3 (syscaller-$ _ #<local-object ^scoped-registrar> (register tests/scoped/one "mago" "/tmp/automate-tests-f3TXkb/automate-def-rbO8EE" (structure (version 3) (name tests/scoped/one) (steps ((step (name quick) (label #f) (group #f) (timeout #f) (error-permitted #f) (outputs (value)) (inputs ())))) (resources ()) (params ()) (outputs ()) (web-ui-options ())) #<remote-object> "ocapn://dvpnc7ddnyaefm2w3g2bghqlxgpsxawopqnszudmiboovdsir4ja.tcp-tls/s/nxKwguTbzb8v_6lZa-qxUAvyIcVaav_AAwR…" …))
In automate/pumphouse.scm:
    550:6  2 (register tests/scoped/one "mago" "/tmp/automate-tests-f3TXkb/automate-def-rbO8EE" (structure (version 3) (name tests/scoped/one) (steps ((step (name quick) (label #f) (group #f) (timeout #f) (error-permitted #f) (outputs (value)) (inputs ())))) (resources ()) (params ()) (outputs ()) (web-ui-options ())) #<remote-object> "ocapn://dvpnc7ddnyaefm2w3g2bghqlxgpsxawopqnszudmiboovdsir4ja.tcp-tls/s/nxKwguTbzb8v_6lZa-qxUAvyIcVaav_AAwRiar8F8iM?" ())
In automate/model.scm:
    119:2  1 (raise-automate-error _ _ . _)
In ice-9/boot-9.scm:
  1705:22  0 (raise-exception _ #:continuable? _)

pumphouse refused tests/scoped/one: Unknown error occurred with remote object

Goblins exception:
In message to #<local-object ^scoped-registrar>:
  (register tests/nap "mago" "/tmp/automate-tests-f3TXkb/automate-def-Sng5G3" (structure (version 3) (name tests/nap) (steps ((step (name nap) (label #f) (group #f) (timeout #f) (error-permitted #f) (outputs (value)) (inputs ())))) (resources ()) (params ()) (outputs ()) (web-ui-options ())) #<remote-object> "ocapn://dvpnc7ddnyaefm2w3g2bghqlxgpsxawopqnszudmiboovdsir4ja.tcp-tls/s/0LgTEEydFCcD5IKd1HF0v2USq6iHhBx9qCNRtcZJnQw?" ())
ice-9/boot-9.scm:1705:22: In procedure raise-exception:
ERROR:
  1. &automate-error:
      kind: revoked
      irritants: ((tests/only tests/scoped/))
  2. &message: "this registration was revoked"
  3. &irritants: ((tests/only tests/scoped/))
In goblins/core.scm:
   1074:7  3 (syscaller-$ _ #<local-object ^scoped-registrar> (register tests/nap "mago" "/tmp/automate-tests-f3TXkb/automate-def-Sng5G3" (structure (version 3) (name tests/nap) (steps ((step (name nap) (label #f) (group #f) (timeout #f) (error-permitted #f) (outputs (value)) (inputs ())))) (resources ()) (params ()) (outputs ()) (web-ui-options ())) #<remote-object> "ocapn://dvpnc7ddnyaefm2w3g2bghqlxgpsxawopqnszudmiboovdsir4ja.tcp-tls/s/0LgTEEydFCcD5IKd1HF0v2USq6iHhBx9qCNRtcZJnQw?" ()))
In automate/pumphouse.scm:
    550:6  2 (register tests/nap "mago" "/tmp/automate-tests-f3TXkb/automate-def-Sng5G3" (structure (version 3) (name tests/nap) (steps ((step (name nap) (label #f) (group #f) (timeout #f) (error-permitted #f) (outputs (value)) (inputs ())))) (resources ()) (params ()) (outputs ()) (web-ui-options ())) #<remote-object> "ocapn://dvpnc7ddnyaefm2w3g2bghqlxgpsxawopqnszudmiboovdsir4ja.tcp-tls/s/0LgTEEydFCcD5IKd1HF0v2USq6iHhBx9qCNRtcZJnQw?" ())
In automate/model.scm:
    119:2  1 (raise-automate-error _ _ . _)
In ice-9/boot-9.scm:
  1705:22  0 (raise-exception _ #:continuable? _)

warning: mutating the process environment while multiple threads are running;
         further behavior unspecified.
In goblins/core.scm:
   1074:7  4 (syscaller-$ _ #<local-object ^call-with-vat> ())
In unknown file:
           3 (_ #<procedure list _>)
In automate/pumphouse/client.scm:
    168:7  2 (spawn-pumphouse-netlayer _ "/tmp/automate-tests-f3TXkb/automate-pumphouse-lHKSCz/no-socket")
In automate/model.scm:
    119:2  1 (raise-automate-error _ _ . _)
In ice-9/boot-9.scm:
  1705:22  0 (raise-exception _ #:continuable? _)

== pumphouse.scm
  fail: the first run of a parameter value lists no earlier run
    expected: ()
    actual:   #f
  fail: the next lists the first, with what it answered
    expected: (("b60e37b8042da6e4" ()))
    actual:   ()
  fail: a value written differently is another value
    expected: ()
    actual:   #f
  fail: the checks of another value are apart
    expected: (first #f)
    actual:   #f
stop 1264: kill #<unspecified>, waitpid (1264 . 9)
stop 1163: kill #<unspecified>, waitpid (1163 . 9)
stop 1075: kill #<unspecified>, waitpid (1075 . 0)
131 passed, 4 failed
FAIL tests/pumphouse.scm (exit status: 1)

============================================================================
Testsuite summary for guile-automate 0.0.0-dev
============================================================================
# TOTAL: 38
# PASS:  37
# SKIP:  0
# XFAIL: 0
# FAIL:  1
# XPASS: 0
# ERROR: 0
============================================================================
See ./test-suite.log for debugging.
============================================================================
make[3]: *** [Makefile:987: test-suite.log] Error 1
make[3]: Leaving directory '/home/chris/pipeline-shepherd/state/work/automate-pipelines/automate-tbdYWg/automate-work-Bdjwb0/workspace/source'
make[2]: *** [Makefile:1122: check-TESTS] Error 2
make[2]: Leaving directory '/home/chris/pipeline-shepherd/state/work/automate-pipelines/automate-tbdYWg/automate-work-Bdjwb0/workspace/source'
make[1]: *** [Makefile:1344: check-am] Error 2
make[1]: Leaving directory '/home/chris/pipeline-shepherd/state/work/automate-pipelines/automate-tbdYWg/automate-work-Bdjwb0/workspace/source'
make: *** [Makefile:873: check-recursive] Error 1
error: #<&invoke-error program: "/gnu/store/wavrmrs065ikbava5mmvql3l8y4gp6ms-profile/bin/bash" arguments: ("-c" "set -eo pipefail\nexport GUIX_PROFILE=/gnu/store/wavrmrs065ikbava5mmvql3l8y4gp6ms-profile\nsource \"$GUIX_PROFILE/etc/profile\"\ncd /home/chris/pipeline-shepherd/state/work/automate-pipelines/automate-tbdYWg/automate-work-Bdjwb0/workspace/source\nexport XDG_CACHE_HOME=\"$TMPDIR/cache\"\nmake check -j$(nproc) VERBOSE=1") exit-status: 2 term-signal: #f stop-signal: #f>
backtrace:
  automate/pipeline/step.scm:675:62 (_)
  automate/step-body/check.scm:23:4 (body-thunk)
  guix/build/utils.scm:822:6 (invoke)