d2091f2cb63e1675 / package errored
- Started
- Duration
- 8m 19s
Defined at .automate/pipelines.scm:132
Building guile-automate from the channel at /home/chris/pipeline-shepherd/state/work/automate-pipelines/automate-tbdYWg/automate-work-Bdjwb0/workspace/channel substitute: substitute: [Klooking for substitutes on 'https://bordeaux.guix.gnu.org'... 0.0% substitute: [Klooking for substitutes on 'https://bordeaux.guix.gnu.org'... 100.0% substitute: substitute: [Klooking for substitutes on 'https://ci.guix.gnu.org'... 0.0% substitute: [Klooking for substitutes on 'https://ci.guix.gnu.org'... 100.0% The following derivation will be built: /gnu/store/rdb144ix3dpqw15ffyyksvqsw818pfhj-guile-automate-0.0.0-dev.drv building /gnu/store/rdb144ix3dpqw15ffyyksvqsw818pfhj-guile-automate-0.0.0-dev.drv... starting phase `separate-from-pid1' build process now running as PID 4 phase `separate-from-pid1' succeeded after 0.0 seconds starting phase `set-SOURCE-DATE-EPOCH' phase `set-SOURCE-DATE-EPOCH' succeeded after 0.0 seconds starting phase `set-paths' environment variable `PATH' set to `/gnu/store/k7vkw9x3wl3lni6a0i2w8xz2z8ylrqyz-guile-3.0.11/bin:/gnu/store/8lbxqsdjb6h32npjf1xg0vfs4a14j3c3-autoconf-2.69/bin:/gnu/store/pq8iw7w4ii30cy8kd5zwmxib36ziwccn-automake-1.17/bin:/gnu/store/vrwsp65rnf487x907m16033yx9x585dc-make-4.4.1/bin:/gnu/store/2862nsy960k83ci9k4jdmvwp100q07gs-pkg-config-0.29.2/bin:/gnu/store/wp75a72a13s2x1dk4d2vc4m4ma9gaxyx-texinfo-7.3/bin:/gnu/store/r5gafvw9iapq6173liw37bzxj40bslhs-guile-documenta-0.4.0/bin:/gnu/store/hia0r9nnmqaxjwlgwjay50a3x43scrci-bash-minimal-5.2.37/bin:/gnu/store/k83f6pby77lzbilg4gdv99s63ib5jr44-coreutils-9.1/bin:/gnu/store/p2h7xqh23qsjlbapadpmfzxibxqfahpc-tar-1.35/bin:/gnu/store/gsr333qygwvf1zjdsc413hs07pd3ygwc-gzip-1.14/bin:/gnu/store/jwp4z6flb9hqfjwvvbkzij7b893j382y-bzip2-1.0.8/bin:/gnu/store/gziyc8kh2wd5gq3ah8vjvpr73my4cgam-xz-5.4.5/bin:/gnu/store/7a6l3fzjvr3nvbnw579wdkhhszzzh3ql-guix-1.5.0-6.64d4de2/bin:/gnu/store/fp4rjwzvrm309wg11jahx8qcm7ypkai3-guile-ares-rs-0.9.8/bin:/gnu/store/hfx188ymz9y9ialr175lqifn3b6xfdnz-shepherd-1.0.9/bin:/gnu/store/hfx188ymz9y9ialr175lqifn3b6xfdnz-shepherd-1.0.9/sbin' environment variable `GUILE_LOAD_PATH' set to `/gnu/store/r5gafvw9iapq6173liw37bzxj40bslhs-guile-documenta-0.4.0/share/guile/site/3.0:/gnu/store/qzml053shmjml5vj6rbcfss5247h20f6-guile-syntax-highlight-0.3.1/share/guile/site/3.0:/gnu/store/7a6l3fzjvr3nvbnw579wdkhhszzzh3ql-guix-1.5.0-6.64d4de2/share/guile/site/3.0:/gnu/store/zplkplr3qmp5dpvhcxpgqr1lg44wmxyk-guile-goblins-0.18.0/share/guile/site/3.0:/gnu/store/5la7a0imnji190xnfmxf0jrsp82dn9hq-guile-fibers-1.4.3/share/guile/site/3.0:/gnu/store/z4fnbwa7d6dprqvd7f89wcifq6ggr2wm-guile-gcrypt-0.5.0/share/guile/site/3.0:/gnu/store/b9928rpaj24whj9cz36yd1h28w7pwphq-guile-gnutls-5.0.2/share/guile/site/3.0:/gnu/store/nw7d5iijwm9sa16k2swxjalgp0vlm01v-guile-json-4.7.3/share/guile/site/3.0:/gnu/store/gyf1hm3gzbq00aw3m9x1xickf3zs3pq8-guile-knots-0.1-39.3417d25/share/guile/site/3.0:/gnu/store/wsg7chjw2cg6xnp4il5caff5w0w69ikc-guile-sqlite3-0.1.3/share/guile/site/3.0:/gnu/store/8n90dzhz177l1lz8bjrxsgbiyh1kmjap-guile-zlib-0.2.2/share/guile/site/3.0:/gnu/store/2qm9a3n19pnznv791jvglb4sgh1jda3s-guile-safsaf-0.5-1.8b35410/share/guile/site/3.0:/gnu/store/9ia4lplmfhpdxnnkvk0zyhyainyn0r0q-guile-prometheus-0-11.8f70b4b/share/guile/site/3.0:/gnu/store/fp4rjwzvrm309wg11jahx8qcm7ypkai3-guile-ares-rs-0.9.8/share/guile/site/3.0:/gnu/store/hfx188ymz9y9ialr175lqifn3b6xfdnz-shepherd-1.0.9/share/guile/site/3.0:/gnu/store/x9ypa71lzv9jrd5n0qxq51hxnra83z2x-guile-lib-0.2.8.1/share/guile/site/3.0:/gnu/store/9rd4c5w765bmsx0cimk0idpfasicvcdr-guile-config-0.5.1/share/guile/site/3.0:/gnu/store/lsys62yw1wnmchmvv3q5x7bzkghyasil-guile-zstd-0.1.1/share/guile/site/3.0:/gnu/store/gq36qbm22984252qxrzrgvrqzx807kd0-guile-lzlib-0.4.0/share/guile/site/3.0:/gnu/store/axcsnac5kji5p4apyf67jqgpbvs47hcm-guile-git-0.12.1/share/guile/site/3.0:/gnu/store/3xl1r2ppwspvhrlv4rzdcw3izhnvlkzm-guile-ssh-1.0.0/share/guile/site/3.0:/gnu/store/dkzraln87ih1cbl36npg9fgyfqnmpqhh-guile-semver-0.2.0/share/guile/site/3.0:/gnu/store/06k0pq8d20w6f3ymkgdwkm6k6rf2v7yj-guile-lib-0.2.8.1/share/guile/site/3.0:/gnu/store/gl031z5csmpkyvicv8q4a3wjjgl5gqbi-guile-avahi-0.4.1/share/guile/site/3.0:/gnu/store/k1yhnx32pjwr409ag3l25816ylasvzrf-guile-websocket-0.3.0/share/guile/site/3.0:/gnu/store/c7k95lcd985bph7kycpjcwsbw0ky0yw1-guile-bstructs-0.2.0/share/guile/site/3.0:/gnu/store/a7k8b77qmv34vjbw5gkgm160zph4lxlg-guile-webutils-0.1-1.d309d65/share/guile/site/3.0:/gnu/store/cjnz2ikdas5ih7x2gs95fgi9q6f376gk-guile-bytestructures-2.0.2/share/guile/site/3.0:/gnu/store/kwd8v8nwvw00d6akyr58d5bjqjcmfy5d-guile-irregex-0.9.12/share/guile/site/3.0' environment variable `GUILE_LOAD_COMPILED_PATH' set to `/gnu/store/r5gafvw9iapq6173liw37bzxj40bslhs-guile-documenta-0.4.0/lib/guile/3.0/site-ccache:/gnu/store/r5gafvw9iapq6173liw37bzxj40bslhs-guile-documenta-0.4.0/share/guile/site/3.0:/gnu/store/qzml053shmjml5vj6rbcfss5247h20f6-guile-syntax-highlight-0.3.1/lib/guile/3.0/site-ccache:/gnu/store/qzml053shmjml5vj6rbcfss5247h20f6-guile-syntax-highlight-0.3.1/share/guile/site/3.0:/gnu/store/7a6l3fzjvr3nvbnw579wdkhhszzzh3ql-guix-1.5.0-6.64d4de2/lib/guile/3.0/site-ccache:/gnu/store/7a6l3fzjvr3nvbnw579wdkhhszzzh3ql-guix-1.5.0-6.64d4de2/share/guile/site/3.0:/gnu/store/zplkplr3qmp5dpvhcxpgqr1lg44wmxyk-guile-goblins-0.18.0/lib/guile/3.0/site-ccache:/gnu/store/zplkplr3qmp5dpvhcxpgqr1lg44wmxyk-guile-goblins-0.18.0/share/guile/site/3.0:/gnu/store/5la7a0imnji190xnfmxf0jrsp82dn9hq-guile-fibers-1.4.3/lib/guile/3.0/site-ccache:/gnu/store/5la7a0imnji190xnfmxf0jrsp82dn9hq-guile-fibers-1.4.3/share/guile/site/3.0:/gnu/store/z4fnbwa7d6dprqvd7f89wcifq6ggr2wm-guile-gcrypt-0.5.0/lib/guile/3.0/site-ccache:/gnu/store/z4fnbwa7d6dprqvd7f89wcifq6ggr2wm-guile-gcrypt-0.5.0/share/guile/site/3.0:/gnu/store/b9928rpaj24whj9cz36yd1h28w7pwphq-guile-gnutls-5.0.2/lib/guile/3.0/site-ccache:/gnu/store/b9928rpaj24whj9cz36yd1h28w7pwphq-guile-gnutls-5.0.2/share/guile/site/3.0:/gnu/store/nw7d5iijwm9sa16k2swxjalgp0vlm01v-guile-json-4.7.3/lib/guile/3.0/site-ccache:/gnu/store/nw7d5iijwm9sa16k2swxjalgp0vlm01v-guile-json-4.7.3/share/guile/site/3.0:/gnu/store/gyf1hm3gzbq00aw3m9x1xickf3zs3pq8-guile-knots-0.1-39.3417d25/lib/guile/3.0/site-ccache:/gnu/store/gyf1hm3gzbq00aw3m9x1xickf3zs3pq8-guile-knots-0.1-39.3417d25/share/guile/site/3.0:/gnu/store/wsg7chjw2cg6xnp4il5caff5w0w69ikc-guile-sqlite3-0.1.3/lib/guile/3.0/site-ccache:/gnu/store/wsg7chjw2cg6xnp4il5caff5w0w69ikc-guile-sqlite3-0.1.3/share/guile/site/3.0:/gnu/store/8n90dzhz177l1lz8bjrxsgbiyh1kmjap-guile-zlib-0.2.2/lib/guile/3.0/site-ccache:/gnu/store/8n90dzhz177l1lz8bjrxsgbiyh1kmjap-guile-zlib-0.2.2/share/guile/site/3.0:/gnu/store/2qm9a3n19pnznv791jvglb4sgh1jda3s-guile-safsaf-0.5-1.8b35410/lib/guile/3.0/site-ccache:/gnu/store/2qm9a3n19pnznv791jvglb4sgh1jda3s-guile-safsaf-0.5-1.8b35410/share/guile/site/3.0:/gnu/store/9ia4lplmfhpdxnnkvk0zyhyainyn0r0q-guile-prometheus-0-11.8f70b4b/lib/guile/3.0/site-ccache:/gnu/store/9ia4lplmfhpdxnnkvk0zyhyainyn0r0q-guile-prometheus-0-11.8f70b4b/share/guile/site/3.0:/gnu/store/fp4rjwzvrm309wg11jahx8qcm7ypkai3-guile-ares-rs-0.9.8/lib/guile/3.0/site-ccache:/gnu/store/fp4rjwzvrm309wg11jahx8qcm7ypkai3-guile-ares-rs-0.9.8/share/guile/site/3.0:/gnu/store/hfx188ymz9y9ialr175lqifn3b6xfdnz-shepherd-1.0.9/lib/guile/3.0/site-ccache:/gnu/store/hfx188ymz9y9ialr175lqifn3b6xfdnz-shepherd-1.0.9/share/guile/site/3.0:/gnu/store/x9ypa71lzv9jrd5n0qxq51hxnra83z2x-guile-lib-0.2.8.1/lib/guile/3.0/site-ccache:/gnu/store/x9ypa71lzv9jrd5n0qxq51hxnra83z2x-guile-lib-0.2.8.1/share/guile/site/3.0:/gnu/store/9rd4c5w765bmsx0cimk0idpfasicvcdr-guile-config-0.5.1/lib/guile/3.0/site-ccache:/gnu/store/9rd4c5w765bmsx0cimk0idpfasicvcdr-guile-config-0.5.1/share/guile/site/3.0:/gnu/store/lsys62yw1wnmchmvv3q5x7bzkghyasil-guile-zstd-0.1.1/lib/guile/3.0/site-ccache:/gnu/store/lsys62yw1wnmchmvv3q5x7bzkghyasil-guile-zstd-0.1.1/share/guile/site/3.0:/gnu/store/gq36qbm22984252qxrzrgvrqzx807kd0-guile-lzlib-0.4.0/lib/guile/3.0/site-ccache:/gnu/store/gq36qbm22984252qxrzrgvrqzx807kd0-guile-lzlib-0.4.0/share/guile/site/3.0:/gnu/store/axcsnac5kji5p4apyf67jqgpbvs47hcm-guile-git-0.12.1/lib/guile/3.0/site-ccache:/gnu/store/axcsnac5kji5p4apyf67jqgpbvs47hcm-guile-git-0.12.1/share/guile/site/3.0:/gnu/store/3xl1r2ppwspvhrlv4rzdcw3izhnvlkzm-guile-ssh-1.0.0/lib/guile/3.0/site-ccache:/gnu/store/3xl1r2ppwspvhrlv4rzdcw3izhnvlkzm-guile-ssh-1.0.0/share/guile/site/3.0:/gnu/store/dkzraln87ih1cbl36npg9fgyfqnmpqhh-guile-semver-0.2.0/lib/guile/3.0/site-ccache:/gnu/store/dkzraln87ih1cbl36npg9fgyfqnmpqhh-guile-semver-0.2.0/share/guile/site/3.0:/gnu/store/06k0pq8d20w6f3ymkgdwkm6k6rf2v7yj-guile-lib-0.2.8.1/lib/guile/3.0/site-ccache:/gnu/store/06k0pq8d20w6f3ymkgdwkm6k6rf2v7yj-guile-lib-0.2.8.1/share/guile/site/3.0:/gnu/store/gl031z5csmpkyvicv8q4a3wjjgl5gqbi-guile-avahi-0.4.1/lib/guile/3.0/site-ccache:/gnu/store/gl031z5csmpkyvicv8q4a3wjjgl5gqbi-guile-avahi-0.4.1/share/guile/site/3.0:/gnu/store/k1yhnx32pjwr409ag3l25816ylasvzrf-guile-websocket-0.3.0/lib/guile/3.0/site-ccache:/gnu/store/k1yhnx32pjwr409ag3l25816ylasvzrf-guile-websocket-0.3.0/share/guile/site/3.0:/gnu/store/c7k95lcd985bph7kycpjcwsbw0ky0yw1-guile-bstructs-0.2.0/lib/guile/3.0/site-ccache:/gnu/store/c7k95lcd985bph7kycpjcwsbw0ky0yw1-guile-bstructs-0.2.0/share/guile/site/3.0:/gnu/store/a7k8b77qmv34vjbw5gkgm160zph4lxlg-guile-webutils-0.1-1.d309d65/share/guile/site/3.0:/gnu/store/cjnz2ikdas5ih7x2gs95fgi9q6f376gk-guile-bytestructures-2.0.2/lib/guile/3.0/site-ccache:/gnu/store/cjnz2ikdas5ih7x2gs95fgi9q6f376gk-guile-bytestructures-2.0.2/share/guile/site/3.0:/gnu/store/kwd8v8nwvw00d6akyr58d5bjqjcmfy5d-guile-irregex-0.9.12/lib/guile/3.0/site-ccache:/gnu/store/kwd8v8nwvw00d6akyr58d5bjqjcmfy5d-guile-irregex-0.9.12/share/guile/site/3.0' environment variable `GUILE_EXTENSIONS_PATH' set to `/gnu/store/5la7a0imnji190xnfmxf0jrsp82dn9hq-guile-fibers-1.4.3/lib/guile/3.0/extensions:/gnu/store/b9928rpaj24whj9cz36yd1h28w7pwphq-guile-gnutls-5.0.2/lib/guile/3.0/extensions:/gnu/store/gl031z5csmpkyvicv8q4a3wjjgl5gqbi-guile-avahi-0.4.1/lib/guile/3.0/extensions' environment variable `ACLOCAL_PATH' set to `/gnu/store/k7vkw9x3wl3lni6a0i2w8xz2z8ylrqyz-guile-3.0.11/share/aclocal:/gnu/store/pq8iw7w4ii30cy8kd5zwmxib36ziwccn-automake-1.17/share/aclocal:/gnu/store/2862nsy960k83ci9k4jdmvwp100q07gs-pkg-config-0.29.2/share/aclocal' environment variable `PKG_CONFIG_PATH' set to `/gnu/store/k7vkw9x3wl3lni6a0i2w8xz2z8ylrqyz-guile-3.0.11/lib/pkgconfig:/gnu/store/gziyc8kh2wd5gq3ah8vjvpr73my4cgam-xz-5.4.5/lib/pkgconfig:/gnu/store/ykhx0hclxjg59l43dlhq0iivc785g1cf-libgc-8.2.8/lib/pkgconfig:/gnu/store/x9ypa71lzv9jrd5n0qxq51hxnra83z2x-guile-lib-0.2.8.1/lib/pkgconfig:/gnu/store/06k0pq8d20w6f3ymkgdwkm6k6rf2v7yj-guile-lib-0.2.8.1/lib/pkgconfig' environment variable `INFOPATH' set to `/gnu/store/k7vkw9x3wl3lni6a0i2w8xz2z8ylrqyz-guile-3.0.11/share/info:/gnu/store/8lbxqsdjb6h32npjf1xg0vfs4a14j3c3-autoconf-2.69/share/info:/gnu/store/pq8iw7w4ii30cy8kd5zwmxib36ziwccn-automake-1.17/share/info:/gnu/store/vrwsp65rnf487x907m16033yx9x585dc-make-4.4.1/share/info:/gnu/store/wp75a72a13s2x1dk4d2vc4m4ma9gaxyx-texinfo-7.3/share/info:/gnu/store/hia0r9nnmqaxjwlgwjay50a3x43scrci-bash-minimal-5.2.37/share/info:/gnu/store/k83f6pby77lzbilg4gdv99s63ib5jr44-coreutils-9.1/share/info:/gnu/store/p2h7xqh23qsjlbapadpmfzxibxqfahpc-tar-1.35/share/info:/gnu/store/gsr333qygwvf1zjdsc413hs07pd3ygwc-gzip-1.14/share/info:/gnu/store/7a6l3fzjvr3nvbnw579wdkhhszzzh3ql-guix-1.5.0-6.64d4de2/share/info:/gnu/store/zplkplr3qmp5dpvhcxpgqr1lg44wmxyk-guile-goblins-0.18.0/share/info:/gnu/store/5la7a0imnji190xnfmxf0jrsp82dn9hq-guile-fibers-1.4.3/share/info:/gnu/store/z4fnbwa7d6dprqvd7f89wcifq6ggr2wm-guile-gcrypt-0.5.0/share/info:/gnu/store/b9928rpaj24whj9cz36yd1h28w7pwphq-guile-gnutls-5.0.2/share/info:/gnu/store/2qm9a3n19pnznv791jvglb4sgh1jda3s-guile-safsaf-0.5-1.8b35410/share/info:/gnu/store/hfx188ymz9y9ialr175lqifn3b6xfdnz-shepherd-1.0.9/share/info:/gnu/store/81gcnknln3563vx75kw8fx27lgcd57xr-libunistring-1.3/share/info:/gnu/store/x9ypa71lzv9jrd5n0qxq51hxnra83z2x-guile-lib-0.2.8.1/share/info:/gnu/store/9rd4c5w765bmsx0cimk0idpfasicvcdr-guile-config-0.5.1/share/info:/gnu/store/axcsnac5kji5p4apyf67jqgpbvs47hcm-guile-git-0.12.1/share/info:/gnu/store/3xl1r2ppwspvhrlv4rzdcw3izhnvlkzm-guile-ssh-1.0.0/share/info:/gnu/store/06k0pq8d20w6f3ymkgdwkm6k6rf2v7yj-guile-lib-0.2.8.1/share/info:/gnu/store/gl031z5csmpkyvicv8q4a3wjjgl5gqbi-guile-avahi-0.4.1/share/info:/gnu/store/c7k95lcd985bph7kycpjcwsbw0ky0yw1-guile-bstructs-0.2.0/share/info' environment variable `BASH_LOADABLES_PATH' unset environment variable `GUIX_EXTENSIONS_PATH' unset environment variable `SSL_CERT_DIR' unset phase `set-paths' succeeded after 0.0 seconds starting phase `set-locale-path' phase `set-locale-path' succeeded after 0.0 seconds starting phase `install-locale' using 'C.UTF-8' locale for category "LC_ALL" phase `install-locale' succeeded after 0.0 seconds sh: warning: setlocale: LC_ALL: cannot change locale (C.UTF-8): No such file or directory starting phase `unpack' `/gnu/store/hyjnmaiv2zzmnnfx8ww9v5b8wdsq6rdh-guile-automate-checkout/COPYING' -> `./COPYING' `/gnu/store/hyjnmaiv2zzmnnfx8ww9v5b8wdsq6rdh-guile-automate-checkout/CLAUDE.md' -> `./CLAUDE.md' `/gnu/store/hyjnmaiv2zzmnnfx8ww9v5b8wdsq6rdh-guile-automate-checkout/.dir-locals.el' -> `./.dir-locals.el' `/gnu/store/hyjnmaiv2zzmnnfx8ww9v5b8wdsq6rdh-guile-automate-checkout/manifest.scm' -> `./manifest.scm' `/gnu/store/hyjnmaiv2zzmnnfx8ww9v5b8wdsq6rdh-guile-automate-checkout/automate.scm' -> `./automate.scm' `/gnu/store/hyjnmaiv2zzmnnfx8ww9v5b8wdsq6rdh-guile-automate-checkout/STYLE.md' -> `./STYLE.md' `/gnu/store/hyjnmaiv2zzmnnfx8ww9v5b8wdsq6rdh-guile-automate-checkout/DESIGN.md' -> `./DESIGN.md' `/gnu/store/hyjnmaiv2zzmnnfx8ww9v5b8wdsq6rdh-guile-automate-checkout/.envrc' -> `./.envrc' `/gnu/store/hyjnmaiv2zzmnnfx8ww9v5b8wdsq6rdh-guile-automate-checkout/guix.scm' -> `./guix.scm' `/gnu/store/hyjnmaiv2zzmnnfx8ww9v5b8wdsq6rdh-guile-automate-checkout/README.md' -> `./README.md' `/gnu/store/hyjnmaiv2zzmnnfx8ww9v5b8wdsq6rdh-guile-automate-checkout/.guix-channel' -> `./.guix-channel' `/gnu/store/hyjnmaiv2zzmnnfx8ww9v5b8wdsq6rdh-guile-automate-checkout/automate/pumphouse.scm' -> `./automate/pumphouse.scm' `/gnu/store/hyjnmaiv2zzmnnfx8ww9v5b8wdsq6rdh-guile-automate-checkout/automate/source.scm' -> `./automate/source.scm' `/gnu/store/hyjnmaiv2zzmnnfx8ww9v5b8wdsq6rdh-guile-automate-checkout/automate/config.scm' -> `./automate/config.scm' `/gnu/store/hyjnmaiv2zzmnnfx8ww9v5b8wdsq6rdh-guile-automate-checkout/automate/resources.scm' -> `./automate/resources.scm' `/gnu/store/hyjnmaiv2zzmnnfx8ww9v5b8wdsq6rdh-guile-automate-checkout/automate/model.scm' -> `./automate/model.scm' `/gnu/store/hyjnmaiv2zzmnnfx8ww9v5b8wdsq6rdh-guile-automate-checkout/automate/structure.scm' -> `./automate/structure.scm' `/gnu/store/hyjnmaiv2zzmnnfx8ww9v5b8wdsq6rdh-guile-automate-checkout/automate/pipeline.scm' -> `./automate/pipeline.scm' `/gnu/store/hyjnmaiv2zzmnnfx8ww9v5b8wdsq6rdh-guile-automate-checkout/automate/command-line.scm' -> `./automate/command-line.scm' `/gnu/store/hyjnmaiv2zzmnnfx8ww9v5b8wdsq6rdh-guile-automate-checkout/automate/shepherd/pipeline-shepherd.scm' -> `./automate/shepherd/pipeline-shepherd.scm' `/gnu/store/hyjnmaiv2zzmnnfx8ww9v5b8wdsq6rdh-guile-automate-checkout/automate/shepherd/bridge.scm' -> `./automate/shepherd/bridge.scm' `/gnu/store/hyjnmaiv2zzmnnfx8ww9v5b8wdsq6rdh-guile-automate-checkout/automate/shepherd/services.scm' -> `./automate/shepherd/services.scm' `/gnu/store/hyjnmaiv2zzmnnfx8ww9v5b8wdsq6rdh-guile-automate-checkout/automate/shepherd/herd.scm' -> `./automate/shepherd/herd.scm' `/gnu/store/hyjnmaiv2zzmnnfx8ww9v5b8wdsq6rdh-guile-automate-checkout/automate/resources/file-output.scm' -> `./automate/resources/file-output.scm' `/gnu/store/hyjnmaiv2zzmnnfx8ww9v5b8wdsq6rdh-guile-automate-checkout/automate/resources/limiter.scm' -> `./automate/resources/limiter.scm' `/gnu/store/hyjnmaiv2zzmnnfx8ww9v5b8wdsq6rdh-guile-automate-checkout/automate/resources/guix-daemon.scm' -> `./automate/resources/guix-daemon.scm' `/gnu/store/hyjnmaiv2zzmnnfx8ww9v5b8wdsq6rdh-guile-automate-checkout/automate/resources/materialise.scm' -> `./automate/resources/materialise.scm' `/gnu/store/hyjnmaiv2zzmnnfx8ww9v5b8wdsq6rdh-guile-automate-checkout/automate/resources/gate.scm' -> `./automate/resources/gate.scm' `/gnu/store/hyjnmaiv2zzmnnfx8ww9v5b8wdsq6rdh-guile-automate-checkout/automate/resources/shepherd.scm' -> `./automate/resources/shepherd.scm' `/gnu/store/hyjnmaiv2zzmnnfx8ww9v5b8wdsq6rdh-guile-automate-checkout/automate/utils/files.scm' -> `./automate/utils/files.scm' `/gnu/store/hyjnmaiv2zzmnnfx8ww9v5b8wdsq6rdh-guile-automate-checkout/automate/utils/sqlite.scm' -> `./automate/utils/sqlite.scm' `/gnu/store/hyjnmaiv2zzmnnfx8ww9v5b8wdsq6rdh-guile-automate-checkout/automate/utils/sockets.scm' -> `./automate/utils/sockets.scm' `/gnu/store/hyjnmaiv2zzmnnfx8ww9v5b8wdsq6rdh-guile-automate-checkout/automate/utils/goblins.scm' -> `./automate/utils/goblins.scm' `/gnu/store/hyjnmaiv2zzmnnfx8ww9v5b8wdsq6rdh-guile-automate-checkout/automate/utils/processes.scm' -> `./automate/utils/processes.scm' `/gnu/store/hyjnmaiv2zzmnnfx8ww9v5b8wdsq6rdh-guile-automate-checkout/automate/utils/options.scm' -> `./automate/utils/options.scm' `/gnu/store/hyjnmaiv2zzmnnfx8ww9v5b8wdsq6rdh-guile-automate-checkout/automate/utils/tcp-tls-netlayer.scm' -> `./automate/utils/tcp-tls-netlayer.scm' `/gnu/store/hyjnmaiv2zzmnnfx8ww9v5b8wdsq6rdh-guile-automate-checkout/automate/pipeline/one-shot.scm' -> `./automate/pipeline/one-shot.scm' `/gnu/store/hyjnmaiv2zzmnnfx8ww9v5b8wdsq6rdh-guile-automate-checkout/automate/pipeline/repl-client.scm' -> `./automate/pipeline/repl-client.scm' `/gnu/store/hyjnmaiv2zzmnnfx8ww9v5b8wdsq6rdh-guile-automate-checkout/automate/pipeline/step-scheduling.scm' -> `./automate/pipeline/step-scheduling.scm' `/gnu/store/hyjnmaiv2zzmnnfx8ww9v5b8wdsq6rdh-guile-automate-checkout/automate/pipeline/uploader.scm' -> `./automate/pipeline/uploader.scm' `/gnu/store/hyjnmaiv2zzmnnfx8ww9v5b8wdsq6rdh-guile-automate-checkout/automate/pipeline/masking.scm' -> `./automate/pipeline/masking.scm' `/gnu/store/hyjnmaiv2zzmnnfx8ww9v5b8wdsq6rdh-guile-automate-checkout/automate/pipeline/repl.scm' -> `./automate/pipeline/repl.scm' `/gnu/store/hyjnmaiv2zzmnnfx8ww9v5b8wdsq6rdh-guile-automate-checkout/automate/pipeline/lower.scm' -> `./automate/pipeline/lower.scm' `/gnu/store/hyjnmaiv2zzmnnfx8ww9v5b8wdsq6rdh-guile-automate-checkout/automate/pipeline/output-marks.scm' -> `./automate/pipeline/output-marks.scm' `/gnu/store/hyjnmaiv2zzmnnfx8ww9v5b8wdsq6rdh-guile-automate-checkout/automate/pipeline/step.scm' -> `./automate/pipeline/step.scm' `/gnu/store/hyjnmaiv2zzmnnfx8ww9v5b8wdsq6rdh-guile-automate-checkout/automate/pipeline/run-request.scm' -> `./automate/pipeline/run-request.scm' `/gnu/store/hyjnmaiv2zzmnnfx8ww9v5b8wdsq6rdh-guile-automate-checkout/automate/pipeline/confinement.scm' -> `./automate/pipeline/confinement.scm' `/gnu/store/hyjnmaiv2zzmnnfx8ww9v5b8wdsq6rdh-guile-automate-checkout/automate/pipeline/daemon.scm' -> `./automate/pipeline/daemon.scm' `/gnu/store/hyjnmaiv2zzmnnfx8ww9v5b8wdsq6rdh-guile-automate-checkout/automate/pipeline/attach.scm' -> `./automate/pipeline/attach.scm' `/gnu/store/hyjnmaiv2zzmnnfx8ww9v5b8wdsq6rdh-guile-automate-checkout/automate/pipeline/nrepl.scm' -> `./automate/pipeline/nrepl.scm' `/gnu/store/hyjnmaiv2zzmnnfx8ww9v5b8wdsq6rdh-guile-automate-checkout/automate/pipeline/errors.scm' -> `./automate/pipeline/errors.scm' `/gnu/store/hyjnmaiv2zzmnnfx8ww9v5b8wdsq6rdh-guile-automate-checkout/automate/pipeline/contain.scm' -> `./automate/pipeline/contain.scm' `/gnu/store/hyjnmaiv2zzmnnfx8ww9v5b8wdsq6rdh-guile-automate-checkout/automate/helpers/git.scm' -> `./automate/helpers/git.scm' `/gnu/store/hyjnmaiv2zzmnnfx8ww9v5b8wdsq6rdh-guile-automate-checkout/automate/helpers/notify.scm' -> `./automate/helpers/notify.scm' `/gnu/store/hyjnmaiv2zzmnnfx8ww9v5b8wdsq6rdh-guile-automate-checkout/automate/helpers/secrets.scm' -> `./automate/helpers/secrets.scm' `/gnu/store/hyjnmaiv2zzmnnfx8ww9v5b8wdsq6rdh-guile-automate-checkout/automate/helpers/definitions.scm' -> `./automate/helpers/definitions.scm' `/gnu/store/hyjnmaiv2zzmnnfx8ww9v5b8wdsq6rdh-guile-automate-checkout/automate/helpers/profiles.scm' -> `./automate/helpers/profiles.scm' `/gnu/store/hyjnmaiv2zzmnnfx8ww9v5b8wdsq6rdh-guile-automate-checkout/automate/helpers/guix.scm' -> `./automate/helpers/guix.scm' `/gnu/store/hyjnmaiv2zzmnnfx8ww9v5b8wdsq6rdh-guile-automate-checkout/automate/pumphouse/live.scm' -> `./automate/pumphouse/live.scm' `/gnu/store/hyjnmaiv2zzmnnfx8ww9v5b8wdsq6rdh-guile-automate-checkout/automate/pumphouse/datastore.scm' -> `./automate/pumphouse/datastore.scm' `/gnu/store/hyjnmaiv2zzmnnfx8ww9v5b8wdsq6rdh-guile-automate-checkout/automate/pumphouse/hub.scm' -> `./automate/pumphouse/hub.scm' `/gnu/store/hyjnmaiv2zzmnnfx8ww9v5b8wdsq6rdh-guile-automate-checkout/automate/pumphouse/run-query.scm' -> `./automate/pumphouse/run-query.scm' `/gnu/store/hyjnmaiv2zzmnnfx8ww9v5b8wdsq6rdh-guile-automate-checkout/automate/pumphouse/client.scm' -> `./automate/pumphouse/client.scm' `/gnu/store/hyjnmaiv2zzmnnfx8ww9v5b8wdsq6rdh-guile-automate-checkout/automate/pumphouse/attachments.scm' -> `./automate/pumphouse/attachments.scm' `/gnu/store/hyjnmaiv2zzmnnfx8ww9v5b8wdsq6rdh-guile-automate-checkout/automate/pumphouse/schema.scm' -> `./automate/pumphouse/schema.scm' `/gnu/store/hyjnmaiv2zzmnnfx8ww9v5b8wdsq6rdh-guile-automate-checkout/automate/pumphouse/http.scm' -> `./automate/pumphouse/http.scm' `/gnu/store/hyjnmaiv2zzmnnfx8ww9v5b8wdsq6rdh-guile-automate-checkout/automate/pumphouse/records.scm' -> `./automate/pumphouse/records.scm' `/gnu/store/hyjnmaiv2zzmnnfx8ww9v5b8wdsq6rdh-guile-automate-checkout/automate/pumphouse/metrics.scm' -> `./automate/pumphouse/metrics.scm' `/gnu/store/hyjnmaiv2zzmnnfx8ww9v5b8wdsq6rdh-guile-automate-checkout/automate/pumphouse/process.scm' -> `./automate/pumphouse/process.scm' `/gnu/store/hyjnmaiv2zzmnnfx8ww9v5b8wdsq6rdh-guile-automate-checkout/automate/pumphouse/scope.scm' -> `./automate/pumphouse/scope.scm' `/gnu/store/hyjnmaiv2zzmnnfx8ww9v5b8wdsq6rdh-guile-automate-checkout/automate/pumphouse/web/pages.scm' -> `./automate/pumphouse/web/pages.scm' `/gnu/store/hyjnmaiv2zzmnnfx8ww9v5b8wdsq6rdh-guile-automate-checkout/automate/pumphouse/web/output.scm' -> `./automate/pumphouse/web/output.scm' `/gnu/store/hyjnmaiv2zzmnnfx8ww9v5b8wdsq6rdh-guile-automate-checkout/automate/pumphouse/web/layout.scm' -> `./automate/pumphouse/web/layout.scm' `/gnu/store/hyjnmaiv2zzmnnfx8ww9v5b8wdsq6rdh-guile-automate-checkout/automate/pumphouse/web/diagram.scm' -> `./automate/pumphouse/web/diagram.scm' `/gnu/store/hyjnmaiv2zzmnnfx8ww9v5b8wdsq6rdh-guile-automate-checkout/automate/pumphouse/web/events.scm' -> `./automate/pumphouse/web/events.scm' `/gnu/store/hyjnmaiv2zzmnnfx8ww9v5b8wdsq6rdh-guile-automate-checkout/automate/pumphouse/web/static/live.js' -> `./automate/pumphouse/web/static/live.js' `/gnu/store/hyjnmaiv2zzmnnfx8ww9v5b8wdsq6rdh-guile-automate-checkout/automate/pumphouse/web/static/theme.js' -> `./automate/pumphouse/web/static/theme.js' `/gnu/store/hyjnmaiv2zzmnnfx8ww9v5b8wdsq6rdh-guile-automate-checkout/automate/pumphouse/web/static/logo.svg' -> `./automate/pumphouse/web/static/logo.svg' `/gnu/store/hyjnmaiv2zzmnnfx8ww9v5b8wdsq6rdh-guile-automate-checkout/automate/pumphouse/web/static/style.css' -> `./automate/pumphouse/web/static/style.css' `/gnu/store/hyjnmaiv2zzmnnfx8ww9v5b8wdsq6rdh-guile-automate-checkout/automate/forge/forgejo.scm' -> `./automate/forge/forgejo.scm' `/gnu/store/hyjnmaiv2zzmnnfx8ww9v5b8wdsq6rdh-guile-automate-checkout/automate/forge/webhook.scm' -> `./automate/forge/webhook.scm' `/gnu/store/hyjnmaiv2zzmnnfx8ww9v5b8wdsq6rdh-guile-automate-checkout/examples/pipeline-shepherd.scm' -> `./examples/pipeline-shepherd.scm' `/gnu/store/hyjnmaiv2zzmnnfx8ww9v5b8wdsq6rdh-guile-automate-checkout/examples/pumphouse.scm' -> `./examples/pumphouse.scm' `/gnu/store/hyjnmaiv2zzmnnfx8ww9v5b8wdsq6rdh-guile-automate-checkout/examples/linked.scm' -> `./examples/linked.scm' `/gnu/store/hyjnmaiv2zzmnnfx8ww9v5b8wdsq6rdh-guile-automate-checkout/examples/pipeline-daemon.scm' -> `./examples/pipeline-daemon.scm' `/gnu/store/hyjnmaiv2zzmnnfx8ww9v5b8wdsq6rdh-guile-automate-checkout/examples/channels.scm' -> `./examples/channels.scm' `/gnu/store/hyjnmaiv2zzmnnfx8ww9v5b8wdsq6rdh-guile-automate-checkout/examples/slow.scm' -> `./examples/slow.scm' `/gnu/store/hyjnmaiv2zzmnnfx8ww9v5b8wdsq6rdh-guile-automate-checkout/examples/hello.scm' -> `./examples/hello.scm' `/gnu/store/hyjnmaiv2zzmnnfx8ww9v5b8wdsq6rdh-guile-automate-checkout/examples/shepherd-bridge.scm' -> `./examples/shepherd-bridge.scm' `/gnu/store/hyjnmaiv2zzmnnfx8ww9v5b8wdsq6rdh-guile-automate-checkout/channel/guile-automate/package.scm' -> `./channel/guile-automate/package.scm' `/gnu/store/hyjnmaiv2zzmnnfx8ww9v5b8wdsq6rdh-guile-automate-checkout/tests/run.scm' -> `./tests/run.scm' `/gnu/store/hyjnmaiv2zzmnnfx8ww9v5b8wdsq6rdh-guile-automate-checkout/tests/pipeline-shepherd.scm' -> `./tests/pipeline-shepherd.scm' `/gnu/store/hyjnmaiv2zzmnnfx8ww9v5b8wdsq6rdh-guile-automate-checkout/tests/step-scheduling.scm' -> `./tests/step-scheduling.scm' `/gnu/store/hyjnmaiv2zzmnnfx8ww9v5b8wdsq6rdh-guile-automate-checkout/tests/pages.scm' -> `./tests/pages.scm' `/gnu/store/hyjnmaiv2zzmnnfx8ww9v5b8wdsq6rdh-guile-automate-checkout/tests/files.scm' -> `./tests/files.scm' `/gnu/store/hyjnmaiv2zzmnnfx8ww9v5b8wdsq6rdh-guile-automate-checkout/tests/uploader.scm' -> `./tests/uploader.scm' `/gnu/store/hyjnmaiv2zzmnnfx8ww9v5b8wdsq6rdh-guile-automate-checkout/tests/masking.scm' -> `./tests/masking.scm' `/gnu/store/hyjnmaiv2zzmnnfx8ww9v5b8wdsq6rdh-guile-automate-checkout/tests/pumphouse-lost.scm' -> `./tests/pumphouse-lost.scm' `/gnu/store/hyjnmaiv2zzmnnfx8ww9v5b8wdsq6rdh-guile-automate-checkout/tests/pumphouse.scm' -> `./tests/pumphouse.scm' `/gnu/store/hyjnmaiv2zzmnnfx8ww9v5b8wdsq6rdh-guile-automate-checkout/tests/repl.scm' -> `./tests/repl.scm' `/gnu/store/hyjnmaiv2zzmnnfx8ww9v5b8wdsq6rdh-guile-automate-checkout/tests/support.scm' -> `./tests/support.scm' `/gnu/store/hyjnmaiv2zzmnnfx8ww9v5b8wdsq6rdh-guile-automate-checkout/tests/authority.scm' -> `./tests/authority.scm' `/gnu/store/hyjnmaiv2zzmnnfx8ww9v5b8wdsq6rdh-guile-automate-checkout/tests/source.scm' -> `./tests/source.scm' `/gnu/store/hyjnmaiv2zzmnnfx8ww9v5b8wdsq6rdh-guile-automate-checkout/tests/layout.scm' -> `./tests/layout.scm' `/gnu/store/hyjnmaiv2zzmnnfx8ww9v5b8wdsq6rdh-guile-automate-checkout/tests/pumphouse-timers.scm' -> `./tests/pumphouse-timers.scm' `/gnu/store/hyjnmaiv2zzmnnfx8ww9v5b8wdsq6rdh-guile-automate-checkout/tests/output-marks.scm' -> `./tests/output-marks.scm' `/gnu/store/hyjnmaiv2zzmnnfx8ww9v5b8wdsq6rdh-guile-automate-checkout/tests/pumphouse-replay.scm' -> `./tests/pumphouse-replay.scm' `/gnu/store/hyjnmaiv2zzmnnfx8ww9v5b8wdsq6rdh-guile-automate-checkout/tests/notify.scm' -> `./tests/notify.scm' `/gnu/store/hyjnmaiv2zzmnnfx8ww9v5b8wdsq6rdh-guile-automate-checkout/tests/pumphouse-shepherd.scm' -> `./tests/pumphouse-shepherd.scm' `/gnu/store/hyjnmaiv2zzmnnfx8ww9v5b8wdsq6rdh-guile-automate-checkout/tests/run-query.scm' -> `./tests/run-query.scm' `/gnu/store/hyjnmaiv2zzmnnfx8ww9v5b8wdsq6rdh-guile-automate-checkout/tests/processes.scm' -> `./tests/processes.scm' `/gnu/store/hyjnmaiv2zzmnnfx8ww9v5b8wdsq6rdh-guile-automate-checkout/tests/http.scm' -> `./tests/http.scm' `/gnu/store/hyjnmaiv2zzmnnfx8ww9v5b8wdsq6rdh-guile-automate-checkout/tests/model.scm' -> `./tests/model.scm' `/gnu/store/hyjnmaiv2zzmnnfx8ww9v5b8wdsq6rdh-guile-automate-checkout/tests/records.scm' -> `./tests/records.scm' `/gnu/store/hyjnmaiv2zzmnnfx8ww9v5b8wdsq6rdh-guile-automate-checkout/tests/metrics.scm' -> `./tests/metrics.scm' `/gnu/store/hyjnmaiv2zzmnnfx8ww9v5b8wdsq6rdh-guile-automate-checkout/tests/forgejo.scm' -> `./tests/forgejo.scm' `/gnu/store/hyjnmaiv2zzmnnfx8ww9v5b8wdsq6rdh-guile-automate-checkout/tests/dispatch.scm' -> `./tests/dispatch.scm' `/gnu/store/hyjnmaiv2zzmnnfx8ww9v5b8wdsq6rdh-guile-automate-checkout/tests/attach.scm' -> `./tests/attach.scm' `/gnu/store/hyjnmaiv2zzmnnfx8ww9v5b8wdsq6rdh-guile-automate-checkout/tests/pipeline.scm' -> `./tests/pipeline.scm' `/gnu/store/hyjnmaiv2zzmnnfx8ww9v5b8wdsq6rdh-guile-automate-checkout/tests/scope.scm' -> `./tests/scope.scm' `/gnu/store/hyjnmaiv2zzmnnfx8ww9v5b8wdsq6rdh-guile-automate-checkout/tests/pumphouse-draining.scm' -> `./tests/pumphouse-draining.scm' `/gnu/store/hyjnmaiv2zzmnnfx8ww9v5b8wdsq6rdh-guile-automate-checkout/tests/pumphouse-restart.scm' -> `./tests/pumphouse-restart.scm' `/gnu/store/hyjnmaiv2zzmnnfx8ww9v5b8wdsq6rdh-guile-automate-checkout/tests/check.scm' -> `./tests/check.scm' `/gnu/store/hyjnmaiv2zzmnnfx8ww9v5b8wdsq6rdh-guile-automate-checkout/tests/relay.scm' -> `./tests/relay.scm' `/gnu/store/hyjnmaiv2zzmnnfx8ww9v5b8wdsq6rdh-guile-automate-checkout/tests/shepherd-bridge.scm' -> `./tests/shepherd-bridge.scm' `/gnu/store/hyjnmaiv2zzmnnfx8ww9v5b8wdsq6rdh-guile-automate-checkout/tests/errors.scm' -> `./tests/errors.scm' `/gnu/store/hyjnmaiv2zzmnnfx8ww9v5b8wdsq6rdh-guile-automate-checkout/tests/events.scm' -> `./tests/events.scm' `/gnu/store/hyjnmaiv2zzmnnfx8ww9v5b8wdsq6rdh-guile-automate-checkout/tests/pumphouse-stopping.scm' -> `./tests/pumphouse-stopping.scm' `/gnu/store/hyjnmaiv2zzmnnfx8ww9v5b8wdsq6rdh-guile-automate-checkout/tests/reconnect.scm' -> `./tests/reconnect.scm' `/gnu/store/hyjnmaiv2zzmnnfx8ww9v5b8wdsq6rdh-guile-automate-checkout/tests/contain.scm' -> `./tests/contain.scm' `/gnu/store/hyjnmaiv2zzmnnfx8ww9v5b8wdsq6rdh-guile-automate-checkout/tests/integration/lowering.scm' -> `./tests/integration/lowering.scm' `/gnu/store/hyjnmaiv2zzmnnfx8ww9v5b8wdsq6rdh-guile-automate-checkout/tests/steps/step.scm' -> `./tests/steps/step.scm' `/gnu/store/hyjnmaiv2zzmnnfx8ww9v5b8wdsq6rdh-guile-automate-checkout/tests/steps/contain.scm' -> `./tests/steps/contain.scm' `/gnu/store/hyjnmaiv2zzmnnfx8ww9v5b8wdsq6rdh-guile-automate-checkout/tests/pumphouse/support.scm' -> `./tests/pumphouse/support.scm' phase `unpack' succeeded after 0.1 seconds sh: warning: setlocale: LC_ALL: cannot change locale (C.UTF-8): No such file or directory starting phase `patch-usr-bin-file' phase `patch-usr-bin-file' succeeded after 0.0 seconds sh: warning: setlocale: LC_ALL: cannot change locale (C.UTF-8): No such file or directory starting phase `patch-source-shebangs' phase `patch-source-shebangs' succeeded after 0.0 seconds sh: warning: setlocale: LC_ALL: cannot change locale (C.UTF-8): No such file or directory starting phase `patch-generated-file-shebangs' phase `patch-generated-file-shebangs' succeeded after 0.0 seconds sh: warning: setlocale: LC_ALL: cannot change locale (C.UTF-8): No such file or directory starting phase `build' Compiling with Guile 3.0... compile flags: ("-Wunbound-variable" "-Warity-mismatch" "-Wformat") wrote `/gnu/store/b15fw4d7rnky701dgbn6w8dd5mmmzjwm-guile-automate-0.0.0-dev/lib/guile/3.0/site-ccache/./automate/command-line.go' [ 1/66] Compiling... wrote `/gnu/store/b15fw4d7rnky701dgbn6w8dd5mmmzjwm-guile-automate-0.0.0-dev/lib/guile/3.0/site-ccache/./automate/config.go' [ 2/66] Compiling... wrote `/gnu/store/b15fw4d7rnky701dgbn6w8dd5mmmzjwm-guile-automate-0.0.0-dev/lib/guile/3.0/site-ccache/./automate/forge/forgejo.go' [ 3/66] Compiling... wrote `/gnu/store/b15fw4d7rnky701dgbn6w8dd5mmmzjwm-guile-automate-0.0.0-dev/lib/guile/3.0/site-ccache/./automate/forge/webhook.go' [ 4/66] Compiling... wrote `/gnu/store/b15fw4d7rnky701dgbn6w8dd5mmmzjwm-guile-automate-0.0.0-dev/lib/guile/3.0/site-ccache/./automate/helpers/definitions.go' [ 5/66] Compiling... wrote `/gnu/store/b15fw4d7rnky701dgbn6w8dd5mmmzjwm-guile-automate-0.0.0-dev/lib/guile/3.0/site-ccache/./automate/helpers/git.go' [ 6/66] Compiling... wrote `/gnu/store/b15fw4d7rnky701dgbn6w8dd5mmmzjwm-guile-automate-0.0.0-dev/lib/guile/3.0/site-ccache/./automate/helpers/guix.go' [ 7/66] Compiling... wrote `/gnu/store/b15fw4d7rnky701dgbn6w8dd5mmmzjwm-guile-automate-0.0.0-dev/lib/guile/3.0/site-ccache/./automate/helpers/notify.go' [ 8/66] Compiling... wrote `/gnu/store/b15fw4d7rnky701dgbn6w8dd5mmmzjwm-guile-automate-0.0.0-dev/lib/guile/3.0/site-ccache/./automate/helpers/profiles.go' [ 9/66] Compiling... wrote `/gnu/store/b15fw4d7rnky701dgbn6w8dd5mmmzjwm-guile-automate-0.0.0-dev/lib/guile/3.0/site-ccache/./automate/helpers/secrets.go' [10/66] Compiling... wrote `/gnu/store/b15fw4d7rnky701dgbn6w8dd5mmmzjwm-guile-automate-0.0.0-dev/lib/guile/3.0/site-ccache/./automate/model.go' [11/66] Compiling... wrote `/gnu/store/b15fw4d7rnky701dgbn6w8dd5mmmzjwm-guile-automate-0.0.0-dev/lib/guile/3.0/site-ccache/./automate/pipeline.go' [12/66] Compiling... wrote `/gnu/store/b15fw4d7rnky701dgbn6w8dd5mmmzjwm-guile-automate-0.0.0-dev/lib/guile/3.0/site-ccache/./automate/pipeline/attach.go' [13/66] Compiling... wrote `/gnu/store/b15fw4d7rnky701dgbn6w8dd5mmmzjwm-guile-automate-0.0.0-dev/lib/guile/3.0/site-ccache/./automate/pipeline/confinement.go' [14/66] Compiling... wrote `/gnu/store/b15fw4d7rnky701dgbn6w8dd5mmmzjwm-guile-automate-0.0.0-dev/lib/guile/3.0/site-ccache/./automate/pipeline/contain.go' [15/66] Compiling... wrote `/gnu/store/b15fw4d7rnky701dgbn6w8dd5mmmzjwm-guile-automate-0.0.0-dev/lib/guile/3.0/site-ccache/./automate/pipeline/daemon.go' [16/66] Compiling... wrote `/gnu/store/b15fw4d7rnky701dgbn6w8dd5mmmzjwm-guile-automate-0.0.0-dev/lib/guile/3.0/site-ccache/./automate/pipeline/errors.go' [17/66] Compiling... wrote `/gnu/store/b15fw4d7rnky701dgbn6w8dd5mmmzjwm-guile-automate-0.0.0-dev/lib/guile/3.0/site-ccache/./automate/pipeline/masking.go' [18/66] Compiling... wrote `/gnu/store/b15fw4d7rnky701dgbn6w8dd5mmmzjwm-guile-automate-0.0.0-dev/lib/guile/3.0/site-ccache/./automate/pipeline/nrepl.go' [19/66] Compiling... wrote `/gnu/store/b15fw4d7rnky701dgbn6w8dd5mmmzjwm-guile-automate-0.0.0-dev/lib/guile/3.0/site-ccache/./automate/pipeline/one-shot.go' [20/66] Compiling... wrote `/gnu/store/b15fw4d7rnky701dgbn6w8dd5mmmzjwm-guile-automate-0.0.0-dev/lib/guile/3.0/site-ccache/./automate/pipeline/output-marks.go' [21/66] Compiling... wrote `/gnu/store/b15fw4d7rnky701dgbn6w8dd5mmmzjwm-guile-automate-0.0.0-dev/lib/guile/3.0/site-ccache/./automate/pipeline/repl-client.go' [22/66] Compiling... wrote `/gnu/store/b15fw4d7rnky701dgbn6w8dd5mmmzjwm-guile-automate-0.0.0-dev/lib/guile/3.0/site-ccache/./automate/pipeline/repl.go' [23/66] Compiling... wrote `/gnu/store/b15fw4d7rnky701dgbn6w8dd5mmmzjwm-guile-automate-0.0.0-dev/lib/guile/3.0/site-ccache/./automate/pipeline/run-request.go' [24/66] Compiling... wrote `/gnu/store/b15fw4d7rnky701dgbn6w8dd5mmmzjwm-guile-automate-0.0.0-dev/lib/guile/3.0/site-ccache/./automate/pipeline/step-scheduling.go' [25/66] Compiling... wrote `/gnu/store/b15fw4d7rnky701dgbn6w8dd5mmmzjwm-guile-automate-0.0.0-dev/lib/guile/3.0/site-ccache/./automate/pipeline/step.go' [26/66] Compiling... wrote `/gnu/store/b15fw4d7rnky701dgbn6w8dd5mmmzjwm-guile-automate-0.0.0-dev/lib/guile/3.0/site-ccache/./automate/pipeline/uploader.go' [27/66] Compiling... wrote `/gnu/store/b15fw4d7rnky701dgbn6w8dd5mmmzjwm-guile-automate-0.0.0-dev/lib/guile/3.0/site-ccache/./automate/pumphouse.go' [28/66] Compiling... wrote `/gnu/store/b15fw4d7rnky701dgbn6w8dd5mmmzjwm-guile-automate-0.0.0-dev/lib/guile/3.0/site-ccache/./automate/pumphouse/attachments.go' [29/66] Compiling... wrote `/gnu/store/b15fw4d7rnky701dgbn6w8dd5mmmzjwm-guile-automate-0.0.0-dev/lib/guile/3.0/site-ccache/./automate/pumphouse/client.go' [30/66] Compiling... wrote `/gnu/store/b15fw4d7rnky701dgbn6w8dd5mmmzjwm-guile-automate-0.0.0-dev/lib/guile/3.0/site-ccache/./automate/pumphouse/datastore.go' [31/66] Compiling... automate/pumphouse/http.scm:236:36: warning: "no answer from ~a in ~a ~\\nseconds": unsupported format option ~ , use (ice-9 format) instead wrote `/gnu/store/b15fw4d7rnky701dgbn6w8dd5mmmzjwm-guile-automate-0.0.0-dev/lib/guile/3.0/site-ccache/./automate/pumphouse/http.go' [32/66] Compiling... wrote `/gnu/store/b15fw4d7rnky701dgbn6w8dd5mmmzjwm-guile-automate-0.0.0-dev/lib/guile/3.0/site-ccache/./automate/pumphouse/hub.go' [33/66] Compiling... wrote `/gnu/store/b15fw4d7rnky701dgbn6w8dd5mmmzjwm-guile-automate-0.0.0-dev/lib/guile/3.0/site-ccache/./automate/pumphouse/live.go' [34/66] Compiling... wrote `/gnu/store/b15fw4d7rnky701dgbn6w8dd5mmmzjwm-guile-automate-0.0.0-dev/lib/guile/3.0/site-ccache/./automate/pumphouse/metrics.go' [35/66] Compiling... wrote `/gnu/store/b15fw4d7rnky701dgbn6w8dd5mmmzjwm-guile-automate-0.0.0-dev/lib/guile/3.0/site-ccache/./automate/pumphouse/process.go' [36/66] Compiling... wrote `/gnu/store/b15fw4d7rnky701dgbn6w8dd5mmmzjwm-guile-automate-0.0.0-dev/lib/guile/3.0/site-ccache/./automate/pumphouse/records.go' [37/66] Compiling... wrote `/gnu/store/b15fw4d7rnky701dgbn6w8dd5mmmzjwm-guile-automate-0.0.0-dev/lib/guile/3.0/site-ccache/./automate/pumphouse/run-query.go' [38/66] Compiling... wrote `/gnu/store/b15fw4d7rnky701dgbn6w8dd5mmmzjwm-guile-automate-0.0.0-dev/lib/guile/3.0/site-ccache/./automate/pumphouse/schema.go' [39/66] Compiling... wrote `/gnu/store/b15fw4d7rnky701dgbn6w8dd5mmmzjwm-guile-automate-0.0.0-dev/lib/guile/3.0/site-ccache/./automate/pumphouse/scope.go' [40/66] Compiling... wrote `/gnu/store/b15fw4d7rnky701dgbn6w8dd5mmmzjwm-guile-automate-0.0.0-dev/lib/guile/3.0/site-ccache/./automate/pumphouse/web/diagram.go' [41/66] Compiling... wrote `/gnu/store/b15fw4d7rnky701dgbn6w8dd5mmmzjwm-guile-automate-0.0.0-dev/lib/guile/3.0/site-ccache/./automate/pumphouse/web/events.go' [42/66] Compiling... wrote `/gnu/store/b15fw4d7rnky701dgbn6w8dd5mmmzjwm-guile-automate-0.0.0-dev/lib/guile/3.0/site-ccache/./automate/pumphouse/web/layout.go' [43/66] Compiling... wrote `/gnu/store/b15fw4d7rnky701dgbn6w8dd5mmmzjwm-guile-automate-0.0.0-dev/lib/guile/3.0/site-ccache/./automate/pumphouse/web/output.go' [44/66] Compiling... wrote `/gnu/store/b15fw4d7rnky701dgbn6w8dd5mmmzjwm-guile-automate-0.0.0-dev/lib/guile/3.0/site-ccache/./automate/pumphouse/web/pages.go' [45/66] Compiling... wrote `/gnu/store/b15fw4d7rnky701dgbn6w8dd5mmmzjwm-guile-automate-0.0.0-dev/lib/guile/3.0/site-ccache/./automate/resources.go' [46/66] Compiling... wrote `/gnu/store/b15fw4d7rnky701dgbn6w8dd5mmmzjwm-guile-automate-0.0.0-dev/lib/guile/3.0/site-ccache/./automate/resources/file-output.go' [47/66] Compiling... wrote `/gnu/store/b15fw4d7rnky701dgbn6w8dd5mmmzjwm-guile-automate-0.0.0-dev/lib/guile/3.0/site-ccache/./automate/resources/gate.go' [48/66] Compiling... wrote `/gnu/store/b15fw4d7rnky701dgbn6w8dd5mmmzjwm-guile-automate-0.0.0-dev/lib/guile/3.0/site-ccache/./automate/resources/guix-daemon.go' [49/66] Compiling... wrote `/gnu/store/b15fw4d7rnky701dgbn6w8dd5mmmzjwm-guile-automate-0.0.0-dev/lib/guile/3.0/site-ccache/./automate/resources/limiter.go' [50/66] Compiling... wrote `/gnu/store/b15fw4d7rnky701dgbn6w8dd5mmmzjwm-guile-automate-0.0.0-dev/lib/guile/3.0/site-ccache/./automate/resources/materialise.go' [51/66] Compiling... wrote `/gnu/store/b15fw4d7rnky701dgbn6w8dd5mmmzjwm-guile-automate-0.0.0-dev/lib/guile/3.0/site-ccache/./automate/resources/shepherd.go' [52/66] Compiling... wrote `/gnu/store/b15fw4d7rnky701dgbn6w8dd5mmmzjwm-guile-automate-0.0.0-dev/lib/guile/3.0/site-ccache/./automate/shepherd/bridge.go' [53/66] Compiling... wrote `/gnu/store/b15fw4d7rnky701dgbn6w8dd5mmmzjwm-guile-automate-0.0.0-dev/lib/guile/3.0/site-ccache/./automate/shepherd/herd.go' [54/66] Compiling... wrote `/gnu/store/b15fw4d7rnky701dgbn6w8dd5mmmzjwm-guile-automate-0.0.0-dev/lib/guile/3.0/site-ccache/./automate/shepherd/pipeline-shepherd.go' [55/66] Compiling... wrote `/gnu/store/b15fw4d7rnky701dgbn6w8dd5mmmzjwm-guile-automate-0.0.0-dev/lib/guile/3.0/site-ccache/./automate/shepherd/services.go' [56/66] Compiling... wrote `/gnu/store/b15fw4d7rnky701dgbn6w8dd5mmmzjwm-guile-automate-0.0.0-dev/lib/guile/3.0/site-ccache/./automate/source.go' [57/66] Compiling... wrote `/gnu/store/b15fw4d7rnky701dgbn6w8dd5mmmzjwm-guile-automate-0.0.0-dev/lib/guile/3.0/site-ccache/./automate/structure.go' [58/66] Compiling... wrote `/gnu/store/b15fw4d7rnky701dgbn6w8dd5mmmzjwm-guile-automate-0.0.0-dev/lib/guile/3.0/site-ccache/./automate/utils/files.go' [59/66] Compiling... wrote `/gnu/store/b15fw4d7rnky701dgbn6w8dd5mmmzjwm-guile-automate-0.0.0-dev/lib/guile/3.0/site-ccache/./automate/utils/goblins.go' [60/66] Compiling... wrote `/gnu/store/b15fw4d7rnky701dgbn6w8dd5mmmzjwm-guile-automate-0.0.0-dev/lib/guile/3.0/site-ccache/./automate/utils/options.go' [61/66] Compiling... wrote `/gnu/store/b15fw4d7rnky701dgbn6w8dd5mmmzjwm-guile-automate-0.0.0-dev/lib/guile/3.0/site-ccache/./automate/utils/processes.go' [62/66] Compiling... wrote `/gnu/store/b15fw4d7rnky701dgbn6w8dd5mmmzjwm-guile-automate-0.0.0-dev/lib/guile/3.0/site-ccache/./automate/utils/sockets.go' [63/66] Compiling... wrote `/gnu/store/b15fw4d7rnky701dgbn6w8dd5mmmzjwm-guile-automate-0.0.0-dev/lib/guile/3.0/site-ccache/./automate/utils/sqlite.go' [64/66] Compiling... wrote `/gnu/store/b15fw4d7rnky701dgbn6w8dd5mmmzjwm-guile-automate-0.0.0-dev/lib/guile/3.0/site-ccache/./automate/utils/tcp-tls-netlayer.go' [65/66] Compiling... wrote `/gnu/store/b15fw4d7rnky701dgbn6w8dd5mmmzjwm-guile-automate-0.0.0-dev/lib/guile/3.0/site-ccache/./channel/guile-automate/package.go' [66/66] Compiling... phase `build' succeeded after 177.9 seconds sh: warning: setlocale: LC_ALL: cannot change locale (C.UTF-8): No such file or directory starting phase `remove-non-modules' phase `remove-non-modules' succeeded after 0.1 seconds sh: warning: setlocale: LC_ALL: cannot change locale (C.UTF-8): No such file or directory starting phase `install-static-files' `automate/pumphouse/web/static/live.js' -> `/gnu/store/b15fw4d7rnky701dgbn6w8dd5mmmzjwm-guile-automate-0.0.0-dev/share/guile/site/3.0/automate/pumphouse/web/static/live.js' `automate/pumphouse/web/static/theme.js' -> `/gnu/store/b15fw4d7rnky701dgbn6w8dd5mmmzjwm-guile-automate-0.0.0-dev/share/guile/site/3.0/automate/pumphouse/web/static/theme.js' `automate/pumphouse/web/static/logo.svg' -> `/gnu/store/b15fw4d7rnky701dgbn6w8dd5mmmzjwm-guile-automate-0.0.0-dev/share/guile/site/3.0/automate/pumphouse/web/static/logo.svg' `automate/pumphouse/web/static/style.css' -> `/gnu/store/b15fw4d7rnky701dgbn6w8dd5mmmzjwm-guile-automate-0.0.0-dev/share/guile/site/3.0/automate/pumphouse/web/static/style.css' phase `install-static-files' succeeded after 0.1 seconds sh: warning: setlocale: LC_ALL: cannot change locale (C.UTF-8): No such file or directory starting phase `check' == attach.scm stopped at the start of this step resumed error: boom 1 two irritants: "boom" 1 two backtrace: automate/pipeline/step.scm:675:62 (_) ice-9/boot-9.scm:2058:7 (error) stopped at the end of this step resumed stopped at the end of this step resumed stopped at the start of this step resumed ;;; note: auto-compilation is enabled, set GUILE_AUTO_COMPILE=0 ;;; or pass the --no-auto-compile argument to disable. ;;; compiling /tmp/guix-build-guile-automate-0.0.0-dev.drv-0/source/tests/run.scm ;;; compiling ./tests/support.scm ;;; compiled /tmp/guix-build-guile-automate-0.0.0-dev.drv-0/source/.cache/guile/ccache/3.0-LE-8-4.7/tmp/guix-build-guile-automate-0.0.0-dev.drv-0/source/tests/support.scm.go ;;; compiled /tmp/guix-build-guile-automate-0.0.0-dev.drv-0/source/.cache/guile/ccache/3.0-LE-8-4.7/tmp/guix-build-guile-automate-0.0.0-dev.drv-0/source/tests/run.scm.go ;;; compiling /tmp/guix-build-guile-automate-0.0.0-dev.drv-0/source/tests/attach.scm ;;; compiled /tmp/guix-build-guile-automate-0.0.0-dev.drv-0/source/.cache/guile/ccache/3.0-LE-8-4.7/tmp/guix-build-guile-automate-0.0.0-dev.drv-0/source/tests/attach.scm.go Error in IO handling wrapped resource #<input-output: file 105>: #<&compound-exception components: (#<&external-error> #<&origin origin: "fport_read"> #<&message message: "~A"> #<&irritants irritants: ("Connection reset by peer")> #<&exception-with-kind-and-args kind: system-error args: ("fport_read" "~A" ("Connection reset by peer") (104))>)> warning: mutating the process environment while multiple threads are running; further behavior unspecified. In ice-9/boot-9.scm: 1778:15 19 (with-exception-handler #<procedure 7ffff577d810 at ice-9/boot-9.scm:1882:7 (exn)> _ #:unwind? _ #:unwind-for-type _) In fibers.scm: 164:13 18 (run-fibers _ #:hz _ #:scheduler _ #:parallelism _ #:cpus _ #:install-suspendable-ports? _ #:drain? _) 85:4 17 (%run-fibers _ _ _ _) In fibers/interrupts.scm: 98:4 16 (with-interrupts/thread-cputime _ _ _ _) In fibers/scheduler.scm: 380:26 15 (run-scheduler #<scheduler 7ffff0fb8f50 (remote-peers: (7ffff0fb8af0))> _) In ice-9/boot-9.scm: 1778:15 14 (with-exception-handler #<procedure 7ffff42856c0 at ice-9/boot-9.scm:1882:7 (exn)> _ #:unwind? _ #:unwind-for-type _) 1784:12 13 (with-exception-handler _ _ #:unwind? _ #:unwind-for-type _) In fibers/scheduler.scm: 344:10 12 (next-task) In fibers.scm: 179:8 11 (_) In goblins/actor-lib/io.scm: 60:10 10 (_) 85:15 9 (_ _) In ice-9/boot-9.scm: 1784:12 8 (with-exception-handler _ _ #:unwind? _ #:unwind-for-type _) In goblins/actor-lib/io.scm: 70:18 7 (run-and-send) In ice-9/control.scm: 91:24 6 (call-with-escape-continuation _) In goblins/contrib/syrup.scm: 306:7 5 (read-next) In ice-9/suspendable-ports.scm: 558:2 4 (peek-char _) 184:27 3 (fill-input #<input-output: file 105> _ _) 72:4 2 (read-bytes #<input-output: file 105> #vu8(91 54 39 97 116 116 97 99 104 60 49 56 39 100 101 115 99 58 105 109 112 111 114 116 45 111 98 106 101 99 116 51 43 62 93 50 43 60 49 56 39 100 101 115 99 58 105 109 112 111 114 116 45 111 98 106 101 99 116 52 43 62 62 99 116 50 43 62 62 101 101 114 49 56 39 117 110 105 120 45 100 111 109 97 105 110 45 115 111 99 107 101 116 53 50 34 54 121 114 99 120 50 105 118 119 118 102 105 114 121 55 101 98 109 107 106 118 118 51 98 120 97 52 105 …) …) In unknown file: 1 (port-read #<input-output: file 105> #vu8(91 54 39 97 116 116 97 99 104 60 49 56 39 100 101 115 99 58 105 109 112 111 114 116 45 111 98 106 101 99 116 51 43 62 93 50 43 60 49 56 39 100 101 115 99 58 105 109 112 111 114 116 45 111 98 106 101 99 116 52 43 62 62 99 116 50 43 62 62 101 101 114 49 56 39 117 110 105 120 45 100 111 109 97 105 110 45 115 111 99 107 101 116 53 50 34 54 121 114 99 120 50 105 118 119 118 102 105 114 121 55 101 98 109 107 106 118 118 51 98 120 97 52 105 # …) …) In ice-9/boot-9.scm: 1705:22 0 (raise-exception _ #:continuable? _) Uncaught exception in task: In fibers.scm: 179:8 15 (_) In goblins/actor-lib/io.scm: 60:10 14 (_) 85:15 13 (_ _) In ice-9/boot-9.scm: 1784:12 12 (with-exception-handler _ _ #:unwind? _ #:unwind-for-type _) In goblins/actor-lib/io.scm: 70:18 11 (run-and-send) In ice-9/control.scm: 91:24 10 (call-with-escape-continuation _) In goblins/contrib/syrup.scm: 306:7 9 (read-next) In ice-9/suspendable-ports.scm: 558:2 8 (peek-char _) 184:27 7 (fill-input #<input-output: file 105> _ _) 72:4 6 (read-bytes #<input-output: file 105> #vu8(91 54 39 97 116 116 97 99 104 60 49 56 39 100 101 115 99 58 105 109 112 111 114 116 45 111 98 106 101 99 116 51 43 62 93 50 43 60 49 56 39 100 101 115 99 58 105 109 112 111 114 116 45 111 98 106 101 99 116 52 43 62 62 99 116 50 43 62 62 101 101 114 49 56 39 117 110 105 120 45 100 111 109 97 105 110 45 115 111 99 107 101 116 53 50 34 54 121 114 99 120 50 105 118 119 118 102 105 114 121 55 101 98 109 107 106 118 118 51 98 120 97 52 105 …) …) In unknown file: 5 (port-read #<input-output: file 105> #vu8(91 54 39 97 116 116 97 99 104 60 49 56 39 100 101 115 99 58 105 109 112 111 114 116 45 111 98 106 101 99 116 51 43 62 93 50 43 60 49 56 39 100 101 115 99 58 105 109 112 111 114 116 45 111 98 106 101 99 116 52 43 62 62 99 116 50 43 62 62 101 101 114 49 56 39 117 110 105 120 45 100 111 109 97 105 110 45 115 111 99 107 101 116 53 50 34 54 121 114 99 120 50 105 118 119 118 102 105 114 121 55 101 98 109 107 106 118 118 51 98 120 97 52 105 # …) …) In ice-9/boot-9.scm: 1705:22 4 (raise-exception _ #:continuable? _) In goblins/core.scm: 1987:7 3 (<-np-extern _ . _) In fibers/operations.scm: 200:10 2 (perform-operation _) In fibers/scheduler.scm: 461:6 1 (suspend-current-task _) In ice-9/boot-9.scm: 1705:22 0 (raise-exception _ #:continuable? _) ice-9/boot-9.scm:1705:22: In procedure raise-exception: Attempt to suspend fiber within continuation barrier ;;; compiling /tmp/guix-build-guile-automate-0.0.0-dev.drv-0/source/tests/authority.scm ;;; compiled /tmp/guix-build-guile-automate-0.0.0-dev.drv-0/source/.cache/guile/ccache/3.0-LE-8-4.7/tmp/guix-build-guile-automate-0.0.0-dev.drv-0/source/tests/authority.scm.go Goblins exception: In message to #<local-object ^session>: (trigger other/elsewhere "run-1" (run-request (id . "4911b9451f7bc3ee") (parameters) (cause . #f) (ancestors))) ice-9/boot-9.scm:1705:22: In procedure raise-exception: ERROR: 1. &automate-error: kind: not-permitted irritants: (caller other/elsewhere) 2. &message: "this pipeline does not declare that it runs that one" 3. &irritants: (caller other/elsewhere) In goblins/core.scm: 1074:7 3 (syscaller-$ _ #<local-object ^session> (trigger other/elsewhere "run-1" (run-request (id . "4911b9451f7bc3ee") (parameters) (cause . #f) (ancestors)))) In automate/pumphouse.scm: 444:6 2 (trigger other/elsewhere "run-1" (run-request (id . "4911b9451f7bc3ee") (parameters) (cause . #f) (ancestors))) In automate/model.scm: 119:2 1 (raise-automate-error _ _ . _) In ice-9/boot-9.scm: 1705:22 0 (raise-exception _ #:continuable? _) session caller on here trigger: this pipeline does not declare that it runs that one: caller, other/elsewhere Goblins exception: In message to #<local-object ^session>: (trigger other/elsewhere "run-1" (run-request (id . "e42ec1dd427ac600") (parameters) (cause . #f) (ancestors))) ice-9/boot-9.scm:1705:22: In procedure raise-exception: ERROR: 1. &automate-error: kind: not-permitted irritants: (caller other/elsewhere) 2. &message: "this pipeline does not declare that it runs that one" 3. &irritants: (caller other/elsewhere) In goblins/core.scm: 1074:7 3 (syscaller-$ _ #<local-object ^session> (trigger other/elsewhere "run-1" (run-request (id . "e42ec1dd427ac600") (parameters) (cause . #f) (ancestors)))) In automate/pumphouse.scm: 444:6 2 (trigger other/elsewhere "run-1" (run-request (id . "e42ec1dd427ac600") (parameters) (cause . #f) (ancestors))) In automate/model.scm: 119:2 1 (raise-automate-error _ _ . _) In ice-9/boot-9.scm: 1705:22 0 (raise-exception _ #:continuable? _) session caller on here trigger: this pipeline does not declare that it runs that one: caller, other/elsewhere Goblins exception: In message to #<local-object fulfilled-handler>: (#t) ice-9/boot-9.scm:1705:22: In procedure raise-exception: ERROR: 1. &automate-error: kind: not-attached irritants: (other/called #f) 2. &message: "no pipeline process serving the pipeline's definition is attached" 3. &irritants: (other/called #f) In goblins/core.scm: 1074:7 3 (syscaller-$ _ #<local-object fulfilled-handler> (#t)) 2038:14 2 (_ . _) In automate/model.scm: 119:2 1 (raise-automate-error _ _ . _) In ice-9/boot-9.scm: 1705:22 0 (raise-exception _ #:continuable? _) session caller on here trigger: no pipeline process serving the pipeline's definition is attached: other/called, #f Goblins exception: In message to #<local-object fulfilled-handler>: (#t) ice-9/boot-9.scm:1705:22: In procedure raise-exception: ERROR: 1. &automate-error: kind: not-attached irritants: (other/fired #f) 2. &message: "no pipeline process serving the pipeline's definition is attached" 3. &irritants: (other/fired #f) In goblins/core.scm: 1074:7 3 (syscaller-$ _ #<local-object fulfilled-handler> (#t)) 2038:14 2 (_ . _) In automate/model.scm: 119:2 1 (raise-automate-error _ _ . _) In ice-9/boot-9.scm: 1705:22 0 (raise-exception _ #:continuable? _) session caller on here trigger: no pipeline process serving the pipeline's definition is attached: other/fired, #f Goblins exception: In message to #<local-object ^session>: (trigger other/called "run-2" (run-request (id . "a51f365ee97be965") (parameters) (cause . #f) (ancestors))) ice-9/boot-9.scm:1705:22: In procedure raise-exception: ERROR: 1. &automate-error: kind: not-permitted irritants: (quiet other/called) 2. &message: "this pipeline does not declare that it runs that one" 3. &irritants: (quiet other/called) In goblins/core.scm: 1074:7 3 (syscaller-$ _ #<local-object ^session> (trigger other/called "run-2" (run-request (id . "a51f365ee97be965") (parameters) (cause . #f) (ancestors)))) In automate/pumphouse.scm: 444:6 2 (trigger other/called "run-2" (run-request (id . "a51f365ee97be965") (parameters) (cause . #f) (ancestors))) In automate/model.scm: 119:2 1 (raise-automate-error _ _ . _) In ice-9/boot-9.scm: 1705:22 0 (raise-exception _ #:continuable? _) session quiet on here trigger: this pipeline does not declare that it runs that one: quiet, other/called Goblins exception: In message to #<local-object ^session>: (find-runs other/called ()) ice-9/boot-9.scm:1705:22: In procedure raise-exception: ERROR: 1. &automate-error: kind: not-permitted irritants: (reader other/called) 2. &message: "this pipeline does not declare that it lists the runs of that one" 3. &irritants: (reader other/called) In goblins/core.scm: 1074:7 3 (syscaller-$ _ #<local-object ^session> (find-runs other/called ())) In automate/pumphouse.scm: 402:6 2 (find-runs other/called ()) In automate/model.scm: 119:2 1 (raise-automate-error _ _ . _) In ice-9/boot-9.scm: 1705:22 0 (raise-exception _ #:continuable? _) session reader on here find-runs: this pipeline does not declare that it lists the runs of that one: reader, other/called Goblins exception: In message to #<local-object ^session>: (abort "controller-1" "controller-1" "enough") ice-9/boot-9.scm:1705:22: In procedure raise-exception: ERROR: 1. &automate-error: kind: not-permitted irritants: ("controller-1") 2. &message: "a run may not abort itself" 3. &irritants: ("controller-1") In goblins/core.scm: 1074:7 3 (syscaller-$ _ #<local-object ^session> (abort "controller-1" "controller-1" "enough")) In automate/pumphouse.scm: 412:6 2 (abort "controller-1" "controller-1" "enough") In automate/model.scm: 119:2 1 (raise-automate-error _ _ . _) In ice-9/boot-9.scm: 1705:22 0 (raise-exception _ #:continuable? _) session controller on here abort: a run may not abort itself: "controller-1" Goblins exception: In message to #<local-object fulfilled-handler>: (#f) ice-9/boot-9.scm:1705:22: In procedure raise-exception: ERROR: 1. &automate-error: kind: not-attached irritants: (other/trunk "trunk-1") 2. &message: "no pipeline process holds the run" 3. &irritants: (other/trunk "trunk-1") In goblins/core.scm: 1074:7 4 (syscaller-$ _ #<local-object fulfilled-handler> (#f)) 2038:14 3 (_ . _) In automate/pumphouse.scm: 167:20 2 (_ _) In automate/model.scm: 119:2 1 (raise-automate-error _ _ . _) In ice-9/boot-9.scm: 1705:22 0 (raise-exception _ #:continuable? _) session controller on here abort: no pipeline process holds the run: other/trunk, "trunk-1" Goblins exception: In message to #<local-object fulfilled-handler>: (other/elsewhere) ice-9/boot-9.scm:1705:22: In procedure raise-exception: ERROR: 1. &automate-error: kind: not-permitted irritants: (controller other/elsewhere) 2. &message: "this pipeline does not declare that it aborts the runs of that one" 3. &irritants: (controller other/elsewhere) In goblins/core.scm: 1074:7 4 (syscaller-$ _ #<local-object fulfilled-handler> (other/elsewhere)) 2038:14 3 (_ . _) In automate/pumphouse.scm: 179:8 2 (_ other/elsewhere) In automate/model.scm: 119:2 1 (raise-automate-error _ _ . _) In ice-9/boot-9.scm: 1705:22 0 (raise-exception _ #:continuable? _) session controller on here abort: this pipeline does not declare that it aborts the runs of that one: controller, other/elsewhere Goblins exception: In message to #<local-object fulfilled-handler>: (#f) ice-9/boot-9.scm:1705:22: In procedure raise-exception: ERROR: 1. &automate-error: kind: no-such-run irritants: ("nowhere") 2. &message: "no run of that id" 3. &irritants: ("nowhere") In goblins/core.scm: 1074:7 4 (syscaller-$ _ #<local-object fulfilled-handler> (#f)) 2038:14 3 (_ . _) In automate/pumphouse.scm: 178:10 2 (_ #f) In automate/model.scm: 119:2 1 (raise-automate-error _ _ . _) In ice-9/boot-9.scm: 1705:22 0 (raise-exception _ #:continuable? _) session controller on here abort: no run of that id: "nowhere" Goblins exception: In message to #<local-object ^session>: (drain-and-stop stopper "elsewhere" "stopper-1" "upgrade" #t) ice-9/boot-9.scm:1705:22: In procedure raise-exception: ERROR: 1. &automate-error: kind: not-attached irritants: (stopper "elsewhere") 2. &message: "no pipeline process of that instance is attached under this name" 3. &irritants: (stopper "elsewhere") In goblins/core.scm: 1074:7 4 (syscaller-$ _ #<local-object ^session> (drain-and-stop stopper "elsewhere" "stopper-1" "upgrade" #t)) In automate/pumphouse.scm: 431:8 3 (drain-and-stop stopper "elsewhere" "stopper-1" "upgrade" _) 110:6 2 (drain-processes! #<<pumphouse> records: #<local-object ^authority-records> lives: #<hash-table 7ffff0981120 7/31> serving: #<hash-table 7ffff0981100 7/31> owners: #<hash-table 7ffff09810e0 1/31> shared: #<hash-table 7ffff09810c0 0/31> gates: #<hash-table 7ffff09810a0 0/31> stopped: #<hash-table 7ffff0981080 0/31> waiting: #<hash-table 7ffff0981060 0/31> timers: #<hash-table 7ffff0981040 0/31> tokens: #<hash-table 7ffff0981020 0/31> registrations: #<hash-table 7ffff0981000 0/31…> …) In automate/model.scm: 119:2 1 (raise-automate-error _ _ . _) In ice-9/boot-9.scm: 1705:22 0 (raise-exception _ #:continuable? _) session stopper on here drain-and-stop: no pipeline process of that instance is attached under this name: stopper, "elsewhere" Goblins exception: In message to #<local-object ^session>: (drain-and-stop other/trunk #f "stopper-1" "upgrade" #t) ice-9/boot-9.scm:1705:22: In procedure raise-exception: ERROR: 1. &automate-error: kind: not-attached irritants: (other/trunk #f) 2. &message: "no pipeline process is attached under this name" 3. &irritants: (other/trunk #f) In goblins/core.scm: 1074:7 4 (syscaller-$ _ #<local-object ^session> (drain-and-stop other/trunk #f "stopper-1" "upgrade" #t)) In automate/pumphouse.scm: 431:8 3 (drain-and-stop other/trunk #f "stopper-1" "upgrade" _) 110:6 2 (drain-processes! #<<pumphouse> records: #<local-object ^authority-records> lives: #<hash-table 7ffff0981120 7/31> serving: #<hash-table 7ffff0981100 7/31> owners: #<hash-table 7ffff09810e0 1/31> shared: #<hash-table 7ffff09810c0 0/31> gates: #<hash-table 7ffff09810a0 0/31> stopped: #<hash-table 7ffff0981080 0/31> waiting: #<hash-table 7ffff0981060 0/31> timers: #<hash-table 7ffff0981040 0/31> tokens: #<hash-table 7ffff0981020 0/31> registrations: #<hash-table 7ffff0981000 0/31…> …) In automate/model.scm: 119:2 1 (raise-automate-error _ _ . _) In ice-9/boot-9.scm: 1705:22 0 (raise-exception _ #:continuable? _) session stopper on here drain-and-stop: no pipeline process is attached under this name: other/trunk, #f Goblins exception: In message to #<local-object ^session>: (drain-and-stop other/elsewhere #f "stopper-1" "upgrade" #f) ice-9/boot-9.scm:1705:22: In procedure raise-exception: ERROR: 1. &automate-error: kind: not-permitted irritants: (stopper other/elsewhere) 2. &message: "this pipeline does not declare that it stops the processes of that one" 3. &irritants: (stopper other/elsewhere) In goblins/core.scm: 1074:7 3 (syscaller-$ _ #<local-object ^session> (drain-and-stop other/elsewhere #f "stopper-1" "upgrade" #f)) In automate/pumphouse.scm: 427:6 2 (drain-and-stop other/elsewhere #f "stopper-1" "upgrade" #f) In automate/model.scm: 119:2 1 (raise-automate-error _ _ . _) In ice-9/boot-9.scm: 1705:22 0 (raise-exception _ #:continuable? _) session stopper on here drain-and-stop: this pipeline does not declare that it stops the processes of that one: stopper, other/elsewhere Goblins exception: In message to #<local-object ^session>: (drain-and-stop other/elsewhere #f "stopper-1" "upgrade" #t) ice-9/boot-9.scm:1705:22: In procedure raise-exception: ERROR: 1. &automate-error: kind: not-permitted irritants: (stopper other/elsewhere) 2. &message: "this pipeline does not declare that it stops the processes of that one" 3. &irritants: (stopper other/elsewhere) In goblins/core.scm: 1074:7 3 (syscaller-$ _ #<local-object ^session> (drain-and-stop other/elsewhere #f "stopper-1" "upgrade" #t)) In automate/pumphouse.scm: 427:6 2 (drain-and-stop other/elsewhere #f "stopper-1" "upgrade" #t) In automate/model.scm: 119:2 1 (raise-automate-error _ _ . _) In ice-9/boot-9.scm: 1705:22 0 (raise-exception _ #:continuable? _) session stopper on here drain-and-stop: this pipeline does not declare that it stops the processes of that one: stopper, other/elsewhere ;;; compiling /tmp/guix-build-guile-automate-0.0.0-dev.drv-0/source/tests/check.scm ;;; compiling ./automate/pipeline/lower.scm ;;; compiled /tmp/guix-build-guile-automate-0.0.0-dev.drv-0/source/.cache/guile/ccache/3.0-LE-8-4.7/tmp/guix-build-guile-automate-0.0.0-dev.drv-0/source/automate/pipeline/lower.scm.go ;;; compiled /tmp/guix-build-guile-automate-0.0.0-dev.drv-0/source/.cache/guile/ccache/3.0-LE-8-4.7/tmp/guix-build-guile-automate-0.0.0-dev.drv-0/source/tests/check.scm.go ;;; compiling /tmp/guix-build-guile-automate-0.0.0-dev.drv-0/source/tests/contain.scm ;;; compiled /tmp/guix-build-guile-automate-0.0.0-dev.drv-0/source/.cache/guile/ccache/3.0-LE-8-4.7/tmp/guix-build-guile-automate-0.0.0-dev.drv-0/source/tests/contain.scm.go warning: mutating the process environment while multiple threads are running; further behavior unspecified. warning: mutating the process environment while multiple threads are running; further behavior unspecified. warning: mutating the process environment while multiple threads are running; further behavior unspecified. warning: mutating the process environment while multiple threads are running; further behavior unspecified. warning: mutating the process environment while multiple threads are running; further behavior unspecified. warning: mutating the process environment while multiple threads are running; further behavior unspecified. warning: mutating the process environment while multiple threads are running; further behavior unspecified. warning: mutating the process environment while multiple threads are running; further behavior unspecified. warning: mutating the process environment while multiple threads are running; further behavior unspecified. warning: mutating the process environment while multiple threads are running; further behavior unspecified. warning: mutating the process environment while multiple threads are running; further behavior unspecified. warning: mutating the process environment while multiple threads are running; further behavior unspecified. warning: mutating the process environment while multiple threads are running; further behavior unspecified. warning: mutating the process environment while multiple threads are running; further behavior unspecified. ;;; compiling /tmp/guix-build-guile-automate-0.0.0-dev.drv-0/source/tests/dispatch.scm ;;; compiled /tmp/guix-build-guile-automate-0.0.0-dev.drv-0/source/.cache/guile/ccache/3.0-LE-8-4.7/tmp/guix-build-guile-automate-0.0.0-dev.drv-0/source/tests/dispatch.scm.go Goblins exception: In message to #<local-object broken-handler>: ((automate-error busy "this process is stopping" () "" "")) ice-9/boot-9.scm:1705:22: In procedure raise-exception: ERROR: 1. &automate-error: kind: busy irritants: (tests/stopped) 2. &message: "every pipeline process serving the pipeline is busy" 3. &irritants: (tests/stopped) In goblins/core.scm: 1074:7 3 (syscaller-$ _ #<local-object broken-handler> ((automate-error busy "this process is stopping" () "" ""))) 2038:14 2 (_ . _) In automate/model.scm: 119:2 1 (raise-automate-error _ _ . _) In ice-9/boot-9.scm: 1705:22 0 (raise-exception _ #:continuable? _) Goblins exception: In message to #<local-object fulfilled-handler>: (#t) ice-9/boot-9.scm:1705:22: In procedure raise-exception: ERROR: 1. &automate-error: kind: not-attached irritants: (tests/nobody #f) 2. &message: "no pipeline process serving the pipeline's definition is attached" 3. &irritants: (tests/nobody #f) In goblins/core.scm: 1074:7 3 (syscaller-$ _ #<local-object fulfilled-handler> (#t)) 2038:14 2 (_ . _) In automate/model.scm: 119:2 1 (raise-automate-error _ _ . _) In ice-9/boot-9.scm: 1705:22 0 (raise-exception _ #:continuable? _) ;;; compiling /tmp/guix-build-guile-automate-0.0.0-dev.drv-0/source/tests/errors.scm ;;; compiled /tmp/guix-build-guile-automate-0.0.0-dev.drv-0/source/.cache/guile/ccache/3.0-LE-8-4.7/tmp/guix-build-guile-automate-0.0.0-dev.drv-0/source/tests/errors.scm.go Goblins exception: In message to #<local-object>: (fail) ice-9/boot-9.scm:1705:22: In procedure raise-exception: ERROR: 1. &automate-error: kind: no-timer irritants: (fail) 2. &message: "no timer of this name" 3. &irritants: (fail) In execvp of /tmp/guix-build-guile-automate-0.0.0-dev.drv-0/automate-tests-B3XvhA/automate-notify-XRrdkj/missing: No such file or directory 49 passed, 0 failed == authority.scm 27 passed, 0 failed == check.scm 27 passed, 0 failed == contain.scm 24 passed, 0 failed == dispatch.scm 6 passed, 0 failed == errors.scm 17 passed, 0 failed == events.scm 9 passed, 0 failed == files.scm 8 passed, 0 failed == forgejo.scm 99 passed, 0 failed == http.scm 49 passed, 0 failed == layout.scm 46 passed, 0 failed == masking.scm 34 passed, 0 failed == metrics.scm 38 passed, 0 failed == model.scm 166 passed, 0 failed == notify.scm In goblins/core.scm: 1074:7 2 (syscaller-$ _ #<local-object> (fail)) In automate/model.scm: 119:2 1 (raise-automate-error _ _ . _) In ice-9/boot-9.scm: 1705:22 0 (raise-exception _ #:continuable? _) answerer fail: no timer of this name: fail ;;; compiling /tmp/guix-build-guile-automate-0.0.0-dev.drv-0/source/tests/events.scm ;;; compiling /gnu/store/a7k8b77qmv34vjbw5gkgm160zph4lxlg-guile-webutils-0.1-1.d309d65/share/guile/site/3.0/webutils/cookie.scm ;;; compiling /gnu/store/a7k8b77qmv34vjbw5gkgm160zph4lxlg-guile-webutils-0.1-1.d309d65/share/guile/site/3.0/webutils/date.scm ;;; compiled /tmp/guix-build-guile-automate-0.0.0-dev.drv-0/source/.cache/guile/ccache/3.0-LE-8-4.7/gnu/store/a7k8b77qmv34vjbw5gkgm160zph4lxlg-guile-webutils-0.1-1.d309d65/share/guile/site/3.0/webutils/date.scm.go ;;; compiled /tmp/guix-build-guile-automate-0.0.0-dev.drv-0/source/.cache/guile/ccache/3.0-LE-8-4.7/gnu/store/a7k8b77qmv34vjbw5gkgm160zph4lxlg-guile-webutils-0.1-1.d309d65/share/guile/site/3.0/webutils/cookie.scm.go ;;; compiled /tmp/guix-build-guile-automate-0.0.0-dev.drv-0/source/.cache/guile/ccache/3.0-LE-8-4.7/tmp/guix-build-guile-automate-0.0.0-dev.drv-0/source/tests/events.scm.go ;;; compiling /tmp/guix-build-guile-automate-0.0.0-dev.drv-0/source/tests/files.scm ;;; compiled /tmp/guix-build-guile-automate-0.0.0-dev.drv-0/source/.cache/guile/ccache/3.0-LE-8-4.7/tmp/guix-build-guile-automate-0.0.0-dev.drv-0/source/tests/files.scm.go ;;; compiling /tmp/guix-build-guile-automate-0.0.0-dev.drv-0/source/tests/forgejo.scm ;;; compiled /tmp/guix-build-guile-automate-0.0.0-dev.drv-0/source/.cache/guile/ccache/3.0-LE-8-4.7/tmp/guix-build-guile-automate-0.0.0-dev.drv-0/source/tests/forgejo.scm.go ;;; compiling /tmp/guix-build-guile-automate-0.0.0-dev.drv-0/source/tests/http.scm ;;; compiled /tmp/guix-build-guile-automate-0.0.0-dev.drv-0/source/.cache/guile/ccache/3.0-LE-8-4.7/tmp/guix-build-guile-automate-0.0.0-dev.drv-0/source/tests/http.scm.go ;;; compiling /tmp/guix-build-guile-automate-0.0.0-dev.drv-0/source/tests/layout.scm ;;; compiled /tmp/guix-build-guile-automate-0.0.0-dev.drv-0/source/.cache/guile/ccache/3.0-LE-8-4.7/tmp/guix-build-guile-automate-0.0.0-dev.drv-0/source/tests/layout.scm.go ;;; compiling /tmp/guix-build-guile-automate-0.0.0-dev.drv-0/source/tests/masking.scm ;;; compiled /tmp/guix-build-guile-automate-0.0.0-dev.drv-0/source/.cache/guile/ccache/3.0-LE-8-4.7/tmp/guix-build-guile-automate-0.0.0-dev.drv-0/source/tests/masking.scm.go ;;; compiling /tmp/guix-build-guile-automate-0.0.0-dev.drv-0/source/tests/metrics.scm ;;; compiled /tmp/guix-build-guile-automate-0.0.0-dev.drv-0/source/.cache/guile/ccache/3.0-LE-8-4.7/tmp/guix-build-guile-automate-0.0.0-dev.drv-0/source/tests/metrics.scm.go ;;; compiling /tmp/guix-build-guile-automate-0.0.0-dev.drv-0/source/tests/model.scm ;;; compiled /tmp/guix-build-guile-automate-0.0.0-dev.drv-0/source/.cache/guile/ccache/3.0-LE-8-4.7/tmp/guix-build-guile-automate-0.0.0-dev.drv-0/source/tests/model.scm.go ;;; compiling /tmp/guix-build-guile-automate-0.0.0-dev.drv-0/source/tests/notify.scm ;;; compiled /tmp/guix-build-guile-automate-0.0.0-dev.drv-0/source/.cache/guile/ccache/3.0-LE-8-4.7/tmp/guix-build-guile-automate-0.0.0-dev.drv-0/source/tests/notify.scm.go 2026-10-14 19:29:30 (with-exception-handler) INFO: POST /hook 200 0ms 2026-10-14 19:29:30 (with-exception-handler) INFO: POST /refuse 403 0ms 18 passed, 0 failed == output-marks.scm ;;; compiling /tmp/guix-build-guile-automate-0.0.0-dev.drv-0/source/tests/output-marks.scm ;;; compiled /tmp/guix-build-guile-automate-0.0.0-dev.drv-0/source/.cache/guile/ccache/3.0-LE-8-4.7/tmp/guix-build-guile-automate-0.0.0-dev.drv-0/source/tests/output-marks.scm.go 20 passed, 0 failed == pages.scm ;;; compiling /tmp/guix-build-guile-automate-0.0.0-dev.drv-0/source/tests/pages.scm ;;; compiled /tmp/guix-build-guile-automate-0.0.0-dev.drv-0/source/.cache/guile/ccache/3.0-LE-8-4.7/tmp/guix-build-guile-automate-0.0.0-dev.drv-0/source/tests/pages.scm.go 130 passed, 0 failed == pipeline-shepherd.scm ;;; compiling /tmp/guix-build-guile-automate-0.0.0-dev.drv-0/source/tests/pipeline-shepherd.scm ;;; compiled /tmp/guix-build-guile-automate-0.0.0-dev.drv-0/source/.cache/guile/ccache/3.0-LE-8-4.7/tmp/guix-build-guile-automate-0.0.0-dev.drv-0/source/tests/pipeline-shepherd.scm.go GNU Shepherd 1.0.9 (Guile 3.0.9, Fibers 1.4.3, x86_64-unknown-linux-gnu) Starting service root... Service root started. Service root running with value #<<process> id: 631 command: #f>. Service root has been started. Configuration successfully loaded from '/tmp/guix-build-guile-automate-0.0.0-dev.drv-0/automate-tests-B3XvhA/automate-ps-gOkOgQ/ps/shepherd.scm'. Starting service shepherd-bridge... Service shepherd-bridge started. Service shepherd-bridge running with value #<<process> id: 637 command: ("/gnu/store/k7vkw9x3wl3lni6a0i2w8xz2z8ylrqyz-guile-3.0.11/bin/guile" "-L" "/tmp/guix-build-guile-automate-0.0.0-dev.drv-0/source" "-L" "/gnu/store/r5gafvw9iapq6173liw37bzxj40bslhs-guile-documenta-0.4.0/share/guile/site/3.0" "-L" "/gnu/store/qzml053shmjml5vj6rbcfss5247h20f6-guile-syntax-highlight-0.3.1/share/guile/site/3.0" "-L" "/gnu/store/7a6l3fzjvr3nvbnw579wdkhhszzzh3ql-guix-1.5.0-6.64d4de2/share/guile/site/3.0" "-L" "/gnu/store/zplkplr3qmp5dpvhcxpgqr1lg44wmxyk-guile-goblins-0.18.0/share/guile/site/3.0" "-L" "/gnu/store/5la7a0imnji190xnfmxf0jrsp82dn9hq-guile-fibers-1.4.3/share/guile/site/3.0" "-L" "/gnu/store/z4fnbwa7d6dprqvd7f89wcifq6ggr2wm-guile-gcrypt-0.5.0/share/guile/site/3.0" "-L" "/gnu/store/b9928rpaj24whj9cz36yd1h28w7pwphq-guile-gnutls-5.0.2/share/guile/site/3.0" "-L" "/gnu/store/nw7d5iijwm9sa16k2swxjalgp0vlm01v-guile-json-4.7.3/share/guile/site/3.0" "-L" "/gnu/store/gyf1hm3gzbq00aw3m9x1xickf3zs3pq8-guile-knots-0.1-39.3417d25/share/guile/site/3.0" "-L" "/gnu/store/wsg7chjw2cg6xnp4il5caff5w0w69ikc-guile-sqlite3-0.1.3/share/guile/site/3.0" "-L" "/gnu/store/8n90dzhz177l1lz8bjrxsgbiyh1kmjap-guile-zlib-0.2.2/share/guile/site/3.0" "-L" "/gnu/store/2qm9a3n19pnznv791jvglb4sgh1jda3s-guile-safsaf-0.5-1.8b35410/share/guile/site/3.0" "-L" "/gnu/store/9ia4lplmfhpdxnnkvk0zyhyainyn0r0q-guile-prometheus-0-11.8f70b4b/share/guile/site/3.0" "-L" "/gnu/store/fp4rjwzvrm309wg11jahx8qcm7ypkai3-guile-ares-rs-0.9.8/share/guile/site/3.0" "-L" "/gnu/store/hfx188ymz9y9ialr175lqifn3b6xfdnz-shepherd-1.0.9/share/guile/site/3.0" "-L" "/gnu/store/x9ypa71lzv9jrd5n0qxq51hxnra83z2x-guile-lib-0.2.8.1/share/guile/site/3.0" "-L" "/gnu/store/9rd4c5w765bmsx0cimk0idpfasicvcdr-guile-config-0.5.1/share/guile/site/3.0" "-L" "/gnu/store/lsys62yw1wnmchmvv3q5x7bzkghyasil-guile-zstd-0.1.1/share/guile/site/3.0" "-L" "/gnu/store/gq36qbm22984252qxrzrgvrqzx807kd0-guile-lzlib-0.4.0/share/guile/site/3.0" "-L" "/gnu/store/axcsnac5kji5p4apyf67jqgpbvs47hcm-guile-git-0.12.1/share/guile/site/3.0" "-L" "/gnu/store/3xl1r2ppwspvhrlv4rzdcw3izhnvlkzm-guile-ssh-1.0.0/share/guile/site/3.0" "-L" "/gnu/store/dkzraln87ih1cbl36npg9fgyfqnmpqhh-guile-semver-0.2.0/share/guile/site/3.0" "-L" "/gnu/store/06k0pq8d20w6f3ymkgdwkm6k6rf2v7yj-guile-lib-0.2.8.1/share/guile/site/3.0" "-L" "/gnu/store/gl031z5csmpkyvicv8q4a3wjjgl5gqbi-guile-avahi-0.4.1/share/guile/site/3.0" "-L" "/gnu/store/k1yhnx32pjwr409ag3l25816ylasvzrf-guile-websocket-0.3.0/share/guile/site/3.0" "-L" "/gnu/store/c7k95lcd985bph7kycpjcwsbw0ky0yw1-guile-bstructs-0.2.0/share/guile/site/3.0" "-L" "/gnu/store/a7k8b77qmv34vjbw5gkgm160zph4lxlg-guile-webutils-0.1-1.d309d65/share/guile/site/3.0" "-L" "/gnu/store/cjnz2ikdas5ih7x2gs95fgi9q6f376gk-guile-bytestructures-2.0.2/share/guile/site/3.0" "-L" "/gnu/store/kwd8v8nwvw00d6akyr58d5bjqjcmfy5d-guile-irregex-0.9.12/share/guile/site/3.0" "-L" "/gnu/store/k7vkw9x3wl3lni6a0i2w8xz2z8ylrqyz-guile-3.0.11/share/guile/3.0" "-L" "/gnu/store/k7vkw9x3wl3lni6a0i2w8xz2z8ylrqyz-guile-3.0.11/share/guile/site/3.0" "-L" "/gnu/store/k7vkw9x3wl3lni6a0i2w8xz2z8ylrqyz-guile-3.0.11/share/guile/site" "-L" "/gnu/store/k7vkw9x3wl3lni6a0i2w8xz2z8ylrqyz-guile-3.0.11/share/guile" "-C" "/gnu/store/b15fw4d7rnky701dgbn6w8dd5mmmzjwm-guile-automate-0.0.0-dev/lib/guile/3.0/site-ccache" "-C" "/gnu/store/b15fw4d7rnky701dgbn6w8dd5mmmzjwm-guile-automate-0.0.0-dev/lib/guile/3.0/site-ccache/" "-C" "/gnu/store/r5gafvw9iapq6173liw37bzxj40bslhs-guile-documenta-0.4.0/lib/guile/3.0/site-ccache" "-C" "/gnu/store/r5gafvw9iapq6173liw37bzxj40bslhs-guile-documenta-0.4.0/share/guile/site/3.0" "-C" "/gnu/store/qzml053shmjml5vj6rbcfss5247h20f6-guile-syntax-highlight-0.3.1/lib/guile/3.0/site-ccache" "-C" "/gnu/store/qzml053shmjml5vj6rbcfss5247h20f6-guile-syntax-highlight-0.3.1/share/guile/site/3.0" "-C" "/gnu/store/7a6l3fzjvr3nvbnw579wdkhhszzzh3ql-guix-1.5.0-6.64d4de2/lib/guile/3.0/site-ccache" "-C" "/gnu/store/7a6l3fzjvr3nvbnw579wdkhhszzzh3ql-guix-1.5.0-6.64d4de2/share/guile/site/3.0" "-C" "/gnu/store/zplkplr3qmp5dpvhcxpgqr1lg44wmxyk-guile-goblins-0.18.0/lib/guile/3.0/site-ccache" "-C" "/gnu/store/zplkplr3qmp5dpvhcxpgqr1lg44wmxyk-guile-goblins-0.18.0/share/guile/site/3.0" "-C" "/gnu/store/5la7a0imnji190xnfmxf0jrsp82dn9hq-guile-fibers-1.4.3/lib/guile/3.0/site-ccache" "-C" "/gnu/store/5la7a0imnji190xnfmxf0jrsp82dn9hq-guile-fibers-1.4.3/share/guile/site/3.0" "-C" "/gnu/store/z4fnbwa7d6dprqvd7f89wcifq6ggr2wm-guile-gcrypt-0.5.0/lib/guile/3.0/site-ccache" "-C" "/gnu/store/z4fnbwa7d6dprqvd7f89wcifq6ggr2wm-guile-gcrypt-0.5.0/share/guile/site/3.0" "-C" "/gnu/store/b9928rpaj24whj9cz36yd1h28w7pwphq-guile-gnutls-5.0.2/lib/guile/3.0/site-ccache" "-C" "/gnu/store/b9928rpaj24whj9cz36yd1h28w7pwphq-guile-gnutls-5.0.2/share/guile/site/3.0" "-C" "/gnu/store/nw7d5iijwm9sa16k2swxjalgp0vlm01v-guile-json-4.7.3/lib/guile/3.0/site-ccache" "-C" "/gnu/store/nw7d5iijwm9sa16k2swxjalgp0vlm01v-guile-json-4.7.3/share/guile/site/3.0" "-C" "/gnu/store/gyf1hm3gzbq00aw3m9x1xickf3zs3pq8-guile-knots-0.1-39.3417d25/lib/guile/3.0/site-ccache" "-C" "/gnu/store/gyf1hm3gzbq00aw3m9x1xickf3zs3pq8-guile-knots-0.1-39.3417d25/share/guile/site/3.0" "-C" "/gnu/store/wsg7chjw2cg6xnp4il5caff5w0w69ikc-guile-sqlite3-0.1.3/lib/guile/3.0/site-ccache" "-C" "/gnu/store/wsg7chjw2cg6xnp4il5caff5w0w69ikc-guile-sqlite3-0.1.3/share/guile/site/3.0" "-C" "/gnu/store/8n90dzhz177l1lz8bjrxsgbiyh1kmjap-guile-zlib-0.2.2/lib/guile/3.0/site-ccache" "-C" "/gnu/store/8n90dzhz177l1lz8bjrxsgbiyh1kmjap-guile-zlib-0.2.2/share/guile/site/3.0" "-C" "/gnu/store/2qm9a3n19pnznv791jvglb4sgh1jda3s-guile-safsaf-0.5-1.8b35410/lib/guile/3.0/site-ccache" "-C" "/gnu/store/2qm9a3n19pnznv791jvglb4sgh1jda3s-guile-safsaf-0.5-1.8b35410/share/guile/site/3.0" "-C" "/gnu/store/9ia4lplmfhpdxnnkvk0zyhyainyn0r0q-guile-prometheus-0-11.8f70b4b/lib/guile/3.0/site-ccache" "-C" "/gnu/store/9ia4lplmfhpdxnnkvk0zyhyainyn0r0q-guile-prometheus-0-11.8f70b4b/share/guile/site/3.0" "-C" "/gnu/store/fp4rjwzvrm309wg11jahx8qcm7ypkai3-guile-ares-rs-0.9.8/lib/guile/3.0/site-ccache" "-C" "/gnu/store/fp4rjwzvrm309wg11jahx8qcm7ypkai3-guile-ares-rs-0.9.8/share/guile/site/3.0" "-C" "/gnu/store/hfx188ymz9y9ialr175lqifn3b6xfdnz-shepherd-1.0.9/lib/guile/3.0/site-ccache" "-C" "/gnu/store/hfx188ymz9y9ialr175lqifn3b6xfdnz-shepherd-1.0.9/share/guile/site/3.0" "-C" "/gnu/store/x9ypa71lzv9jrd5n0qxq51hxnra83z2x-guile-lib-0.2.8.1/lib/guile/3.0/site-ccache" "-C" "/gnu/store/x9ypa71lzv9jrd5n0qxq51hxnra83z2x-guile-lib-0.2.8.1/share/guile/site/3.0" "-C" "/gnu/store/9rd4c5w765bmsx0cimk0idpfasicvcdr-guile-config-0.5.1/lib/guile/3.0/site-ccache" "-C" "/gnu/store/9rd4c5w765bmsx0cimk0idpfasicvcdr-guile-config-0.5.1/share/guile/site/3.0" "-C" "/gnu/store/lsys62yw1wnmchmvv3q5x7bzkghyasil-guile-zstd-0.1.1/lib/guile/3.0/site-ccache" "-C" "/gnu/store/lsys62yw1wnmchmvv3q5x7bzkghyasil-guile-zstd-0.1.1/share/guile/site/3.0" "-C" "/gnu/store/gq36qbm22984252qxrzrgvrqzx807kd0-guile-lzlib-0.4.0/lib/guile/3.0/site-ccache" "-C" "/gnu/store/gq36qbm22984252qxrzrgvrqzx807kd0-guile-lzlib-0.4.0/share/guile/site/3.0" "-C" "/gnu/store/axcsnac5kji5p4apyf67jqgpbvs47hcm-guile-git-0.12.1/lib/guile/3.0/site-ccache" "-C" "/gnu/store/axcsnac5kji5p4apyf67jqgpbvs47hcm-guile-git-0.12.1/share/guile/site/3.0" "-C" "/gnu/store/3xl1r2ppwspvhrlv4rzdcw3izhnvlkzm-guile-ssh-1.0.0/lib/guile/3.0/site-ccache" "-C" "/gnu/store/3xl1r2ppwspvhrlv4rzdcw3izhnvlkzm-guile-ssh-1.0.0/share/guile/site/3.0" "-C" "/gnu/store/dkzraln87ih1cbl36npg9fgyfqnmpqhh-guile-semver-0.2.0/lib/guile/3.0/site-ccache" "-C" "/gnu/store/dkzraln87ih1cbl36npg9fgyfqnmpqhh-guile-semver-0.2.0/share/guile/site/3.0" "-C" "/gnu/store/06k0pq8d20w6f3ymkgdwkm6k6rf2v7yj-guile-lib-0.2.8.1/lib/guile/3.0/site-ccache" "-C" "/gnu/store/06k0pq8d20w6f3ymkgdwkm6k6rf2v7yj-guile-lib-0.2.8.1/share/guile/site/3.0" "-C" "/gnu/store/gl031z5csmpkyvicv8q4a3wjjgl5gqbi-guile-avahi-0.4.1/lib/guile/3.0/site-ccache" "-C" "/gnu/store/gl031z5csmpkyvicv8q4a3wjjgl5gqbi-guile-avahi-0.4.1/share/guile/site/3.0" "-C" "/gnu/store/k1yhnx32pjwr409ag3l25816ylasvzrf-guile-websocket-0.3.0/lib/guile/3.0/site-ccache" "-C" "/gnu/store/k1yhnx32pjwr409ag3l25816ylasvzrf-guile-websocket-0.3.0/share/guile/site/3.0" "-C" "/gnu/store/c7k95lcd985bph7kycpjcwsbw0ky0yw1-guile-bstructs-0.2.0/lib/guile/3.0/site-ccache" "-C" "/gnu/store/c7k95lcd985bph7kycpjcwsbw0ky0yw1-guile-bstructs-0.2.0/share/guile/site/3.0" "-C" "/gnu/store/a7k8b77qmv34vjbw5gkgm160zph4lxlg-guile-webutils-0.1-1.d309d65/share/guile/site/3.0" "-C" "/gnu/store/cjnz2ikdas5ih7x2gs95fgi9q6f376gk-guile-bytestructures-2.0.2/lib/guile/3.0/site-ccache" "-C" "/gnu/store/cjnz2ikdas5ih7x2gs95fgi9q6f376gk-guile-bytestructures-2.0.2/share/guile/site/3.0" "-C" "/gnu/store/kwd8v8nwvw00d6akyr58d5bjqjcmfy5d-guile-irregex-0.9.12/lib/guile/3.0/site-ccache" "-C" "/gnu/store/kwd8v8nwvw00d6akyr58d5bjqjcmfy5d-guile-irregex-0.9.12/share/guile/site/3.0" "-C" "/gnu/store/k7vkw9x3wl3lni6a0i2w8xz2z8ylrqyz-guile-3.0.11/lib/guile/3.0/ccache" "-C" "/gnu/store/k7vkw9x3wl3lni6a0i2w8xz2z8ylrqyz-guile-3.0.11/lib/guile/3.0/site-ccache" "/tmp/guix-build-guile-automate-0.0.0-dev.drv-0/automate-tests-B3XvhA/automate-ps-gOkOgQ/ps/bridge.scm")>. Service shepherd-bridge has been started. Successfully started 1 service in the background. Stopping service root... Exiting shepherd... Stopping service shepherd-bridge... Service shepherd-bridge stopped. Service shepherd-bridge is now stopped. Exiting. GNU Shepherd 1.0.9 (Guile 3.0.9, Fibers 1.4.3, x86_64-unknown-linux-gnu) Starting service root... Service root started. Service root running with value #<<process> id: 651 command: #f>. Service root has been started. Configuration successfully loaded from '/tmp/guix-build-guile-automate-0.0.0-dev.drv-0/automate-tests-B3XvhA/automate-ps-gOkOgQ/ps/shepherd.scm'. Starting service shepherd-bridge... Starting service sleeper... Service shepherd-bridge started. Service sleeper started. Service shepherd-bridge running with value #<<process> id: 657 command: ("/gnu/store/k7vkw9x3wl3lni6a0i2w8xz2z8ylrqyz-guile-3.0.11/bin/guile" "-L" "/tmp/guix-build-guile-automate-0.0.0-dev.drv-0/source" "-L" "/gnu/store/r5gafvw9iapq6173liw37bzxj40bslhs-guile-documenta-0.4.0/share/guile/site/3.0" "-L" "/gnu/store/qzml053shmjml5vj6rbcfss5247h20f6-guile-syntax-highlight-0.3.1/share/guile/site/3.0" "-L" "/gnu/store/7a6l3fzjvr3nvbnw579wdkhhszzzh3ql-guix-1.5.0-6.64d4de2/share/guile/site/3.0" "-L" "/gnu/store/zplkplr3qmp5dpvhcxpgqr1lg44wmxyk-guile-goblins-0.18.0/share/guile/site/3.0" "-L" "/gnu/store/5la7a0imnji190xnfmxf0jrsp82dn9hq-guile-fibers-1.4.3/share/guile/site/3.0" "-L" "/gnu/store/z4fnbwa7d6dprqvd7f89wcifq6ggr2wm-guile-gcrypt-0.5.0/share/guile/site/3.0" "-L" "/gnu/store/b9928rpaj24whj9cz36yd1h28w7pwphq-guile-gnutls-5.0.2/share/guile/site/3.0" "-L" "/gnu/store/nw7d5iijwm9sa16k2swxjalgp0vlm01v-guile-json-4.7.3/share/guile/site/3.0" "-L" "/gnu/store/gyf1hm3gzbq00aw3m9x1xickf3zs3pq8-guile-knots-0.1-39.3417d25/share/guile/site/3.0" "-L" "/gnu/store/wsg7chjw2cg6xnp4il5caff5w0w69ikc-guile-sqlite3-0.1.3/share/guile/site/3.0" "-L" "/gnu/store/8n90dzhz177l1lz8bjrxsgbiyh1kmjap-guile-zlib-0.2.2/share/guile/site/3.0" "-L" "/gnu/store/2qm9a3n19pnznv791jvglb4sgh1jda3s-guile-safsaf-0.5-1.8b35410/share/guile/site/3.0" "-L" "/gnu/store/9ia4lplmfhpdxnnkvk0zyhyainyn0r0q-guile-prometheus-0-11.8f70b4b/share/guile/site/3.0" "-L" "/gnu/store/fp4rjwzvrm309wg11jahx8qcm7ypkai3-guile-ares-rs-0.9.8/share/guile/site/3.0" "-L" "/gnu/store/hfx188ymz9y9ialr175lqifn3b6xfdnz-shepherd-1.0.9/share/guile/site/3.0" "-L" "/gnu/store/x9ypa71lzv9jrd5n0qxq51hxnra83z2x-guile-lib-0.2.8.1/share/guile/site/3.0" "-L" "/gnu/store/9rd4c5w765bmsx0cimk0idpfasicvcdr-guile-config-0.5.1/share/guile/site/3.0" "-L" "/gnu/store/lsys62yw1wnmchmvv3q5x7bzkghyasil-guile-zstd-0.1.1/share/guile/site/3.0" "-L" "/gnu/store/gq36qbm22984252qxrzrgvrqzx807kd0-guile-lzlib-0.4.0/share/guile/site/3.0" "-L" "/gnu/store/axcsnac5kji5p4apyf67jqgpbvs47hcm-guile-git-0.12.1/share/guile/site/3.0" "-L" "/gnu/store/3xl1r2ppwspvhrlv4rzdcw3izhnvlkzm-guile-ssh-1.0.0/share/guile/site/3.0" "-L" "/gnu/store/dkzraln87ih1cbl36npg9fgyfqnmpqhh-guile-semver-0.2.0/share/guile/site/3.0" "-L" "/gnu/store/06k0pq8d20w6f3ymkgdwkm6k6rf2v7yj-guile-lib-0.2.8.1/share/guile/site/3.0" "-L" "/gnu/store/gl031z5csmpkyvicv8q4a3wjjgl5gqbi-guile-avahi-0.4.1/share/guile/site/3.0" "-L" "/gnu/store/k1yhnx32pjwr409ag3l25816ylasvzrf-guile-websocket-0.3.0/share/guile/site/3.0" "-L" "/gnu/store/c7k95lcd985bph7kycpjcwsbw0ky0yw1-guile-bstructs-0.2.0/share/guile/site/3.0" "-L" "/gnu/store/a7k8b77qmv34vjbw5gkgm160zph4lxlg-guile-webutils-0.1-1.d309d65/share/guile/site/3.0" "-L" "/gnu/store/cjnz2ikdas5ih7x2gs95fgi9q6f376gk-guile-bytestructures-2.0.2/share/guile/site/3.0" "-L" "/gnu/store/kwd8v8nwvw00d6akyr58d5bjqjcmfy5d-guile-irregex-0.9.12/share/guile/site/3.0" "-L" "/gnu/store/k7vkw9x3wl3lni6a0i2w8xz2z8ylrqyz-guile-3.0.11/share/guile/3.0" "-L" "/gnu/store/k7vkw9x3wl3lni6a0i2w8xz2z8ylrqyz-guile-3.0.11/share/guile/site/3.0" "-L" "/gnu/store/k7vkw9x3wl3lni6a0i2w8xz2z8ylrqyz-guile-3.0.11/share/guile/site" "-L" "/gnu/store/k7vkw9x3wl3lni6a0i2w8xz2z8ylrqyz-guile-3.0.11/share/guile" "-C" "/gnu/store/b15fw4d7rnky701dgbn6w8dd5mmmzjwm-guile-automate-0.0.0-dev/lib/guile/3.0/site-ccache" "-C" "/gnu/store/b15fw4d7rnky701dgbn6w8dd5mmmzjwm-guile-automate-0.0.0-dev/lib/guile/3.0/site-ccache/" "-C" "/gnu/store/r5gafvw9iapq6173liw37bzxj40bslhs-guile-documenta-0.4.0/lib/guile/3.0/site-ccache" "-C" "/gnu/store/r5gafvw9iapq6173liw37bzxj40bslhs-guile-documenta-0.4.0/share/guile/site/3.0" "-C" "/gnu/store/qzml053shmjml5vj6rbcfss5247h20f6-guile-syntax-highlight-0.3.1/lib/guile/3.0/site-ccache" "-C" "/gnu/store/qzml053shmjml5vj6rbcfss5247h20f6-guile-syntax-highlight-0.3.1/share/guile/site/3.0" "-C" "/gnu/store/7a6l3fzjvr3nvbnw579wdkhhszzzh3ql-guix-1.5.0-6.64d4de2/lib/guile/3.0/site-ccache" "-C" "/gnu/store/7a6l3fzjvr3nvbnw579wdkhhszzzh3ql-guix-1.5.0-6.64d4de2/share/guile/site/3.0" "-C" "/gnu/store/zplkplr3qmp5dpvhcxpgqr1lg44wmxyk-guile-goblins-0.18.0/lib/guile/3.0/site-ccache" "-C" "/gnu/store/zplkplr3qmp5dpvhcxpgqr1lg44wmxyk-guile-goblins-0.18.0/share/guile/site/3.0" "-C" "/gnu/store/5la7a0imnji190xnfmxf0jrsp82dn9hq-guile-fibers-1.4.3/lib/guile/3.0/site-ccache" "-C" "/gnu/store/5la7a0imnji190xnfmxf0jrsp82dn9hq-guile-fibers-1.4.3/share/guile/site/3.0" "-C" "/gnu/store/z4fnbwa7d6dprqvd7f89wcifq6ggr2wm-guile-gcrypt-0.5.0/lib/guile/3.0/site-ccache" "-C" "/gnu/store/z4fnbwa7d6dprqvd7f89wcifq6ggr2wm-guile-gcrypt-0.5.0/share/guile/site/3.0" "-C" "/gnu/store/b9928rpaj24whj9cz36yd1h28w7pwphq-guile-gnutls-5.0.2/lib/guile/3.0/site-ccache" "-C" "/gnu/store/b9928rpaj24whj9cz36yd1h28w7pwphq-guile-gnutls-5.0.2/share/guile/site/3.0" "-C" "/gnu/store/nw7d5iijwm9sa16k2swxjalgp0vlm01v-guile-json-4.7.3/lib/guile/3.0/site-ccache" "-C" "/gnu/store/nw7d5iijwm9sa16k2swxjalgp0vlm01v-guile-json-4.7.3/share/guile/site/3.0" "-C" "/gnu/store/gyf1hm3gzbq00aw3m9x1xickf3zs3pq8-guile-knots-0.1-39.3417d25/lib/guile/3.0/site-ccache" "-C" "/gnu/store/gyf1hm3gzbq00aw3m9x1xickf3zs3pq8-guile-knots-0.1-39.3417d25/share/guile/site/3.0" "-C" "/gnu/store/wsg7chjw2cg6xnp4il5caff5w0w69ikc-guile-sqlite3-0.1.3/lib/guile/3.0/site-ccache" "-C" "/gnu/store/wsg7chjw2cg6xnp4il5caff5w0w69ikc-guile-sqlite3-0.1.3/share/guile/site/3.0" "-C" "/gnu/store/8n90dzhz177l1lz8bjrxsgbiyh1kmjap-guile-zlib-0.2.2/lib/guile/3.0/site-ccache" "-C" "/gnu/store/8n90dzhz177l1lz8bjrxsgbiyh1kmjap-guile-zlib-0.2.2/share/guile/site/3.0" "-C" "/gnu/store/2qm9a3n19pnznv791jvglb4sgh1jda3s-guile-safsaf-0.5-1.8b35410/lib/guile/3.0/site-ccache" "-C" "/gnu/store/2qm9a3n19pnznv791jvglb4sgh1jda3s-guile-safsaf-0.5-1.8b35410/share/guile/site/3.0" "-C" "/gnu/store/9ia4lplmfhpdxnnkvk0zyhyainyn0r0q-guile-prometheus-0-11.8f70b4b/lib/guile/3.0/site-ccache" "-C" "/gnu/store/9ia4lplmfhpdxnnkvk0zyhyainyn0r0q-guile-prometheus-0-11.8f70b4b/share/guile/site/3.0" "-C" "/gnu/store/fp4rjwzvrm309wg11jahx8qcm7ypkai3-guile-ares-rs-0.9.8/lib/guile/3.0/site-ccache" "-C" "/gnu/store/fp4rjwzvrm309wg11jahx8qcm7ypkai3-guile-ares-rs-0.9.8/share/guile/site/3.0" "-C" "/gnu/store/hfx188ymz9y9ialr175lqifn3b6xfdnz-shepherd-1.0.9/lib/guile/3.0/site-ccache" "-C" "/gnu/store/hfx188ymz9y9ialr175lqifn3b6xfdnz-shepherd-1.0.9/share/guile/site/3.0" "-C" "/gnu/store/x9ypa71lzv9jrd5n0qxq51hxnra83z2x-guile-lib-0.2.8.1/lib/guile/3.0/site-ccache" "-C" "/gnu/store/x9ypa71lzv9jrd5n0qxq51hxnra83z2x-guile-lib-0.2.8.1/share/guile/site/3.0" "-C" "/gnu/store/9rd4c5w765bmsx0cimk0idpfasicvcdr-guile-config-0.5.1/lib/guile/3.0/site-ccache" "-C" "/gnu/store/9rd4c5w765bmsx0cimk0idpfasicvcdr-guile-config-0.5.1/share/guile/site/3.0" "-C" "/gnu/store/lsys62yw1wnmchmvv3q5x7bzkghyasil-guile-zstd-0.1.1/lib/guile/3.0/site-ccache" "-C" "/gnu/store/lsys62yw1wnmchmvv3q5x7bzkghyasil-guile-zstd-0.1.1/share/guile/site/3.0" "-C" "/gnu/store/gq36qbm22984252qxrzrgvrqzx807kd0-guile-lzlib-0.4.0/lib/guile/3.0/site-ccache" "-C" "/gnu/store/gq36qbm22984252qxrzrgvrqzx807kd0-guile-lzlib-0.4.0/share/guile/site/3.0" "-C" "/gnu/store/axcsnac5kji5p4apyf67jqgpbvs47hcm-guile-git-0.12.1/lib/guile/3.0/site-ccache" "-C" "/gnu/store/axcsnac5kji5p4apyf67jqgpbvs47hcm-guile-git-0.12.1/share/guile/site/3.0" "-C" "/gnu/store/3xl1r2ppwspvhrlv4rzdcw3izhnvlkzm-guile-ssh-1.0.0/lib/guile/3.0/site-ccache" "-C" "/gnu/store/3xl1r2ppwspvhrlv4rzdcw3izhnvlkzm-guile-ssh-1.0.0/share/guile/site/3.0" "-C" "/gnu/store/dkzraln87ih1cbl36npg9fgyfqnmpqhh-guile-semver-0.2.0/lib/guile/3.0/site-ccache" "-C" "/gnu/store/dkzraln87ih1cbl36npg9fgyfqnmpqhh-guile-semver-0.2.0/share/guile/site/3.0" "-C" "/gnu/store/06k0pq8d20w6f3ymkgdwkm6k6rf2v7yj-guile-lib-0.2.8.1/lib/guile/3.0/site-ccache" "-C" "/gnu/store/06k0pq8d20w6f3ymkgdwkm6k6rf2v7yj-guile-lib-0.2.8.1/share/guile/site/3.0" "-C" "/gnu/store/gl031z5csmpkyvicv8q4a3wjjgl5gqbi-guile-avahi-0.4.1/lib/guile/3.0/site-ccache" "-C" "/gnu/store/gl031z5csmpkyvicv8q4a3wjjgl5gqbi-guile-avahi-0.4.1/share/guile/site/3.0" "-C" "/gnu/store/k1yhnx32pjwr409ag3l25816ylasvzrf-guile-websocket-0.3.0/lib/guile/3.0/site-ccache" "-C" "/gnu/store/k1yhnx32pjwr409ag3l25816ylasvzrf-guile-websocket-0.3.0/share/guile/site/3.0" "-C" "/gnu/store/c7k95lcd985bph7kycpjcwsbw0ky0yw1-guile-bstructs-0.2.0/lib/guile/3.0/site-ccache" "-C" "/gnu/store/c7k95lcd985bph7kycpjcwsbw0ky0yw1-guile-bstructs-0.2.0/share/guile/site/3.0" "-C" "/gnu/store/a7k8b77qmv34vjbw5gkgm160zph4lxlg-guile-webutils-0.1-1.d309d65/share/guile/site/3.0" "-C" "/gnu/store/cjnz2ikdas5ih7x2gs95fgi9q6f376gk-guile-bytestructures-2.0.2/lib/guile/3.0/site-ccache" "-C" "/gnu/store/cjnz2ikdas5ih7x2gs95fgi9q6f376gk-guile-bytestructures-2.0.2/share/guile/site/3.0" "-C" "/gnu/store/kwd8v8nwvw00d6akyr58d5bjqjcmfy5d-guile-irregex-0.9.12/lib/guile/3.0/site-ccache" "-C" "/gnu/store/kwd8v8nwvw00d6akyr58d5bjqjcmfy5d-guile-irregex-0.9.12/share/guile/site/3.0" "-C" "/gnu/store/k7vkw9x3wl3lni6a0i2w8xz2z8ylrqyz-guile-3.0.11/lib/guile/3.0/ccache" "-C" "/gnu/store/k7vkw9x3wl3lni6a0i2w8xz2z8ylrqyz-guile-3.0.11/lib/guile/3.0/site-ccache" "/tmp/guix-build-guile-automate-0.0.0-dev.drv-0/automate-tests-B3XvhA/automate-ps-gOkOgQ/ps/bridge.scm")>. Service sleeper running with value #<<process> id: 658 command: ("/gnu/store/k7vkw9x3wl3lni6a0i2w8xz2z8ylrqyz-guile-3.0.11/bin/guile" "--no-auto-compile" "/tmp/guix-build-guile-automate-0.0.0-dev.drv-0/automate-tests-B3XvhA/automate-ps-gOkOgQ/daemon.scm" "/tmp/guix-build-guile-automate-0.0.0-dev.drv-0/automate-tests-B3XvhA/automate-ps-gOkOgQ/marker" "--pumphouse=/tmp/guix-build-guile-automate-0.0.0-dev.drv-0/automate-tests-B3XvhA/automate-ps-gOkOgQ/ps/secrets/sleeper/pumphouse" "--secrets=/tmp/guix-build-guile-automate-0.0.0-dev.drv-0/automate-tests-B3XvhA/automate-ps-gOkOgQ/ps/secrets/sleeper" "--working-directory=/tmp/guix-build-guile-automate-0.0.0-dev.drv-0/automate-tests-B3XvhA/automate-ps-gOkOgQ/ps/work/sleeper")>. Service shepherd-bridge has been started. Service sleeper has been started. Successfully started 2 services in the background. Stopping service root... Exiting shepherd... Stopping service shepherd-bridge... Service shepherd-bridge stopped. Service shepherd-bridge is now stopped. Stopping service sleeper... Service sleeper stopped. Service sleeper is now stopped. Exiting. 20 passed, 0 failed == pipeline.scm ;;; compiling /tmp/guix-build-guile-automate-0.0.0-dev.drv-0/source/tests/pipeline.scm ;;; compiled /tmp/guix-build-guile-automate-0.0.0-dev.drv-0/source/.cache/guile/ccache/3.0-LE-8-4.7/tmp/guix-build-guile-automate-0.0.0-dev.drv-0/source/tests/pipeline.scm.go error: boom 1 two irritants: "boom" 1 two backtrace: automate/pipeline/step.scm:675:62 (_) ice-9/boot-9.scm:2058:7 (error) error: boom 1 two irritants: "boom" 1 two backtrace: automate/pipeline/step.scm:675:62 (_) ice-9/boot-9.scm:2058:7 (error) error: boom 1 two irritants: "boom" 1 two backtrace: automate/pipeline/step.scm:675:62 (_) ice-9/boot-9.scm:2058:7 (error) error: body ended without providing outputs kind: missing-outputs irritants: (count) backtrace: automate/model.scm:119:2 (raise-automate-error) Goblins exception: In message to #<local-object ^file-output>: (commit publish-nothing) ice-9/boot-9.scm:1705:22: In procedure raise-exception: ERROR: 1. &automate-error: kind: nothing-to-commit irritants: (site "/tmp/guix-build-guile-automate-0.0.0-dev.drv-0/automate-tests-B3XvhA/automate-output-w7hmic/.automate-site/staging-2BOCIj/site") 2. &message: "a file output is committed with nothing staged: the body makes the content at the path attach answered" 3. &irritants: (site "/tmp/guix-build-guile-automate-0.0.0-dev.drv-0/automate-tests-B3XvhA/automate-output-w7hmic/.automate-site/staging-2BOCIj/site") In goblins/core.scm: 1074:7 3 (syscaller-$ _ #<local-object ^file-output> (commit publish-nothing)) In automate/resources/file-output.scm: 173:6 2 (commit publish-nothing) In automate/model.scm: 119:2 1 (raise-automate-error _ _ . _) In ice-9/boot-9.scm: 1705:22 0 (raise-exception _ #:continuable? _) error: a file output is committed with nothing staged: the body makes the content at the path attach answered kind: nothing-to-commit irritants: site "/tmp/guix-build-guile-automate-0.0.0-dev.drv-0/automate-tests-B3XvhA/automate-output-w7hmic/.automate-site/staging-2BOCIj/site" backtrace: automate/pipeline/step.scm:675:62 (_) automate/utils/goblins.scm:277:20 (await-in-vat) Goblins exception: In message to #<local-object ^file-output>: (commit publish-twice) ice-9/boot-9.scm:1705:22: In procedure raise-exception: ERROR: 1. &automate-error: kind: already-committed irritants: (site "/tmp/guix-build-guile-automate-0.0.0-dev.drv-0/automate-tests-B3XvhA/automate-output-kaIggZ/site") 2. &message: "this file output was committed already" 3. &irritants: (site "/tmp/guix-build-guile-automate-0.0.0-dev.drv-0/automate-tests-B3XvhA/automate-output-kaIggZ/site") In goblins/core.scm: 1074:7 3 (syscaller-$ _ #<local-object ^file-output> (commit publish-twice)) In automate/resources/file-output.scm: 169:6 2 (commit publish-twice) In automate/model.scm: 119:2 1 (raise-automate-error _ _ . _) In ice-9/boot-9.scm: 1705:22 0 (raise-exception _ #:continuable? _) error: this file output was committed already kind: already-committed irritants: site "/tmp/guix-build-guile-automate-0.0.0-dev.drv-0/automate-tests-B3XvhA/automate-output-kaIggZ/site" backtrace: automate/pipeline/step.scm:675:62 (_) automate/utils/goblins.scm:277:20 (await-in-vat) `/tmp/guix-build-guile-automate-0.0.0-dev.drv-0/automate-tests-B3XvhA/automate-output-HkamcI/.automate-site/staging-mV3swq/site/index' -> `/tmp/guix-build-guile-automate-0.0.0-dev.drv-0/automate-tests-B3XvhA/automate-output-HkamcI/.automate-site/6acfd84f-124-78a32123/index' error: value cannot be masked kind: unmaskable irritants: too-short backtrace: automate/pipeline/step.scm:675:62 (_) automate/pipeline/step.scm:225:6 (mask) Goblins exception: In message to #<local-object ^file-input>: (attach read-only) ice-9/boot-9.scm:1705:22: In procedure raise-exception: ERROR: 1. &automate-error: kind: missing-file-input irritants: (sources "/nowhere-at-all") 2. &message: "no file or directory for this file input" 3. &irritants: (sources "/nowhere-at-all") In goblins/core.scm: 1074:7 3 (syscaller-$ _ #<local-object ^file-input> (attach read-only)) In automate/resources/materialise.scm: 98:6 2 (attach _) In automate/model.scm: 119:2 1 (raise-automate-error _ _ . _) In ice-9/boot-9.scm: 1705:22 0 (raise-exception _ #:continuable? _) error: no file or directory for this file input kind: missing-file-input irritants: sources "/nowhere-at-all" backtrace: automate/pipeline/step.scm:675:62 (_) ice-9/eval.scm:293:34 (_) automate/utils/goblins.scm:277:20 (await-in-vat) Goblins exception: In message to #<local-object ^secret>: (attach missing) ice-9/boot-9.scm:1705:22: In procedure raise-exception: ERROR: 1. &automate-error: kind: missing-secret irritants: (token "/tmp/guix-build-guile-automate-0.0.0-dev.drv-0/automate-tests-B3XvhA/automate-secrets-sMk9Lq/token") 2. &message: "no file for this secret" 3. &irritants: (token "/tmp/guix-build-guile-automate-0.0.0-dev.drv-0/automate-tests-B3XvhA/automate-secrets-sMk9Lq/token") In goblins/core.scm: 1074:7 3 (syscaller-$ _ #<local-object ^secret> (attach missing)) In automate/resources/materialise.scm: 76:6 2 (attach _) In automate/model.scm: 119:2 1 (raise-automate-error _ _ . _) In ice-9/boot-9.scm: 1705:22 0 (raise-exception _ #:continuable? _) error: no file for this secret kind: missing-secret irritants: token "/tmp/guix-build-guile-automate-0.0.0-dev.drv-0/automate-tests-B3XvhA/automate-secrets-sMk9Lq/token" backtrace: automate/pipeline/step.scm:675:62 (_) automate/utils/goblins.scm:277:20 (await-in-vat) warning: mutating the process environment while multiple threads are running; further behavior unspecified. warning: mutating the process environment while multiple threads are running; further behavior unspecified. warning: mutating the process environment while multiple threads are running; further behavior unspecified. warning: mutating the process environment while multiple threads are running; further behavior unspecified. warning: mutating the process environment while multiple threads are running; further behavior unspecified. warning: mutating the process environment while multiple threads are running; further behavior unspecified. warning: mutating the process environment while multiple threads are running; further behavior unspecified. guile: warning: failed to install locale warning: mutating the process environment while multiple threads are running; further behavior unspecified. warning: mutating the process environment while multiple threads are running; further behavior unspecified. warning: mutating the process environment while multiple threads are running; further behavior unspecified. warning: mutating the process environment while multiple threads are running; further behavior unspecified. warning: mutating the process environment while multiple threads are running; further behavior unspecified. Goblins exception: In message to #<local-object ^guix-daemon>: (keep keep-elsewhere "/tmp/thing") ice-9/boot-9.scm:1705:22: In procedure raise-exception: ERROR: 1. &automate-error: kind: not-a-store-item irritants: (daemon "/tmp/thing") 2. &message: "only a store path can be kept" 3. &irritants: (daemon "/tmp/thing") In goblins/core.scm: 1074:7 3 (syscaller-$ _ #<local-object ^guix-daemon> (keep keep-elsewhere "/tmp/thing")) In automate/resources/guix-daemon.scm: 212:7 2 (keep keep-elsewhere "/tmp/thing") In automate/model.scm: 119:2 1 (raise-automate-error _ _ . _) In ice-9/boot-9.scm: 1705:22 0 (raise-exception _ #:continuable? _) error: only a store path can be kept kind: not-a-store-item irritants: daemon "/tmp/thing" backtrace: automate/pipeline/step.scm:675:62 (_) automate/utils/goblins.scm:277:20 (await-in-vat) 184 passed, 0 failed == processes.scm ;;; compiling /tmp/guix-build-guile-automate-0.0.0-dev.drv-0/source/tests/processes.scm ;;; compiled /tmp/guix-build-guile-automate-0.0.0-dev.drv-0/source/.cache/guile/ccache/3.0-LE-8-4.7/tmp/guix-build-guile-automate-0.0.0-dev.drv-0/source/tests/processes.scm.go 4 passed, 0 failed == pumphouse-draining.scm ;;; compiling /tmp/guix-build-guile-automate-0.0.0-dev.drv-0/source/tests/pumphouse-draining.scm ;;; compiling ./tests/pumphouse/support.scm ;;; compiled /tmp/guix-build-guile-automate-0.0.0-dev.drv-0/source/.cache/guile/ccache/3.0-LE-8-4.7/tmp/guix-build-guile-automate-0.0.0-dev.drv-0/source/tests/pumphouse/support.scm.go ;;; compiled /tmp/guix-build-guile-automate-0.0.0-dev.drv-0/source/.cache/guile/ccache/3.0-LE-8-4.7/tmp/guix-build-guile-automate-0.0.0-dev.drv-0/source/tests/pumphouse-draining.scm.go http on port 45213 pumphouse listening on /tmp/guix-build-guile-automate-0.0.0-dev.drv-0/automate-tests-B3XvhA/automate-pumphouse-BtZUzY/socket admin: /tmp/guix-build-guile-automate-0.0.0-dev.drv-0/automate-tests-B3XvhA/automate-pumphouse-BtZUzY/admin remote admin: /tmp/guix-build-guile-automate-0.0.0-dev.drv-0/automate-tests-B3XvhA/automate-pumphouse-BtZUzY/remote-admin attached to the pumphouse of /tmp/guix-build-guile-automate-0.0.0-dev.drv-0/automate-tests-B3XvhA/automate-pumphouse-BtZUzY/any run 195a5a022a2a18c1 asked this process to drain and stop: upgraded stopping: taking no more runs; 1 in flight Goblins exception: In message to #<local-object ^pipeline-endpoint>: (run (run-request (id . "baf5e5d6500006cc") (parameters) (cause . #f) (ancestors))) ice-9/boot-9.scm:1705:22: In procedure raise-exception: ERROR: 1. &automate-error: kind: busy irritants: (tests/stopping/other) 2. &message: "this process is stopping" 3. &irritants: (tests/stopping/other) In goblins/core.scm: 1074:7 2 (syscaller-$ _ #<local-object ^pipeline-endpoint> (run (run-request (id . "baf5e5d6500006cc") (parameters) (cause . #f) (ancestors)))) In automate/model.scm: 119:2 1 (raise-automate-error _ _ . _) In ice-9/boot-9.scm: 1705:22 0 (raise-exception _ #:continuable? _) tests/stopping/other run: this process is stopping: tests/stopping/other Goblins exception: In message to #<local-object ^pipeline-endpoint>: (run (run-request (id . "baf5e5d6500006cc") (parameters) (cause . #f) (ancestors))) ice-9/boot-9.scm:1705:22: In procedure raise-exception: ERROR: 1. &automate-error: kind: busy irritants: (tests/stopping/other) 2. &message: "this process is stopping" 3. &irritants: (tests/stopping/other) In goblins/core.scm: 1074:7 2 (syscaller-$ _ #<local-object ^pipeline-endpoint> (run (run-request (id . "baf5e5d6500006cc") (parameters) (cause . #f) (ancestors)))) In automate/model.scm: 119:2 1 (raise-automate-error _ _ . _) In ice-9/boot-9.scm: 1705:22 0 (raise-exception _ #:continuable? _) tests/stopping/other run: this process is stopping: tests/stopping/other Goblins exception: In message to #<local-object ^pipeline-endpoint>: (run (run-request (id . "baf5e5d6500006cc") (parameters) (cause . #f) (ancestors))) ice-9/boot-9.scm:1705:22: In procedure raise-exception: ERROR: 1. &automate-error: kind: busy irritants: (tests/stopping/other) 2. &message: "this process is stopping" 3. &irritants: (tests/stopping/other) In goblins/core.scm: 1074:7 2 (syscaller-$ _ #<local-object ^pipeline-endpoint> (run (run-request (id . "baf5e5d6500006cc") (parameters) (cause . #f) (ancestors)))) In automate/model.scm: 119:2 1 (raise-automate-error _ _ . _) In ice-9/boot-9.scm: 1705:22 0 (raise-exception _ #:continuable? _) tests/stopping/other run: this process is stopping: tests/stopping/other Goblins exception: In message to #<local-object ^pipeline-endpoint>: (run (run-request (id . "baf5e5d6500006cc") (parameters) (cause . #f) (ancestors))) ice-9/boot-9.scm:1705:22: In procedure raise-exception: ERROR: 1. &automate-error: kind: busy irritants: (tests/stopping/other) 2. &message: "this process is stopping" 3. &irritants: (tests/stopping/other) In goblins/core.scm: 1074:7 2 (syscaller-$ _ #<local-object ^pipeline-endpoint> (run (run-request (id . "baf5e5d6500006cc") (parameters) (cause . #f) (ancestors)))) In automate/model.scm: 119:2 1 (raise-automate-error _ _ . _) In ice-9/boot-9.scm: 1705:22 0 (raise-exception _ #:continuable? _) tests/stopping/other run: this process is stopping: tests/stopping/other Goblins exception: In message to #<local-object ^pipeline-endpoint>: (run (run-request (id . "baf5e5d6500006cc") (parameters) (cause . #f) (ancestors))) ice-9/boot-9.scm:1705:22: In procedure raise-exception: ERROR: 1. &automate-error: kind: busy irritants: (tests/stopping/other) 2. &message: "this process is stopping" 3. &irritants: (tests/stopping/other) In goblins/core.scm: 1074:7 2 (syscaller-$ _ #<local-object ^pipeline-endpoint> (run (run-request (id . "baf5e5d6500006cc") (parameters) (cause . #f) (ancestors)))) In automate/model.scm: 119:2 1 (raise-automate-error _ _ . _) In ice-9/boot-9.scm: 1705:22 0 (raise-exception _ #:continuable? _) tests/stopping/other run: this process is stopping: tests/stopping/other Goblins exception: In message to #<local-object ^pipeline-endpoint>: (run (run-request (id . "baf5e5d6500006cc") (parameters) (cause . #f) (ancestors))) ice-9/boot-9.scm:1705:22: In procedure raise-exception: ERROR: 1. &automate-error: kind: busy irritants: (tests/stopping/other) 2. &message: "this process is stopping" 3. &irritants: (tests/stopping/other) In goblins/core.scm: 1074:7 2 (syscaller-$ _ #<local-object ^pipeline-endpoint> (run (run-request (id . "baf5e5d6500006cc") (parameters) (cause . #f) (ancestors)))) In automate/model.scm: 119:2 1 (raise-automate-error _ _ . _) In ice-9/boot-9.scm: 1705:22 0 (raise-exception _ #:continuable? _) tests/stopping/other run: this process is stopping: tests/stopping/other Goblins exception: In message to #<local-object fulfilled-handler>: (#t) ice-9/boot-9.scm:1705:22: In procedure raise-exception: ERROR: 1. &automate-error: kind: not-attached irritants: (tests/stopping/other 1) 2. &message: "no pipeline process serving the pipeline's definition is attached" 3. &irritants: (tests/stopping/other 1) In goblins/core.scm: 1074:7 3 (syscaller-$ _ #<local-object fulfilled-handler> (#t)) 2038:14 2 (_ . _) In automate/model.scm: 119:2 1 (raise-automate-error _ _ . _) In ice-9/boot-9.scm: 1705:22 0 (raise-exception _ #:continuable? _) admin run: no pipeline process serving the pipeline's definition is attached: tests/stopping/other, 1 fail: after which it takes no new run of any pipeline it serves expected: busy actual: not-attached attached to the pumphouse of /tmp/guix-build-guile-automate-0.0.0-dev.drv-0/automate-tests-B3XvhA/automate-pumphouse-BtZUzY/any aattached to the pumphouse of /tmp/guix-build-guile-automate-0.0.0-dev.drv-0/automate-tests-B3XvhA/automate-pumphouse-BtZUzY/any ttached to the pumphouse of /tmp/guix-build-guile-automate-0.0.0-dev.drv-0/automate-tests-B3XvhA/automate-pumphouse-BtZUzY/any the pumphouse asked this process to drain and stop: fleet upgrade stopping: taking no more runs; 0 in flight the pumphouse asked this process to drain and stop: operator stopping: taking no more runs; 0 in flight Goblins exception: In message to #<local-object ^admin>: (drain-and-stop tests/stopping/fleet #f "again") ice-9/boot-9.scm:1705:22: In procedure raise-exception: ERROR: 1. &automate-error: kind: not-attached irritants: (tests/stopping/fleet #f) 2. &message: "no pipeline process is attached under this name" 3. &irritants: (tests/stopping/fleet #f) In goblins/core.scm: 1074:7 3 (syscaller-$ _ #<local-object ^admin> (drain-and-stop tests/stopping/fleet #f "again")) In automate/pumphouse.scm: 110:6 2 (drain-processes! #<<pumphouse> records: #<local-object ^records> lives: #<hash-table 7ffff7806140 4/31> serving: #<hash-table 7ffff7806120 4/31> owners: #<hash-table 7ffff7806100 0/31> shared: #<hash-table 7ffff78060e0 0/31> gates: #<hash-table 7ffff78060c0 0/31> stopped: #<hash-table 7ffff78060a0 0/31> waiting: #<hash-table 7ffff7806080 0/31> timers: #<hash-table 7ffff7806060 0/31> tokens: #<hash-table 7ffff7806040 2/31> registrations: #<hash-table 7ffff7806020 1/31> registra…> …) In automate/model.scm: 119:2 1 (raise-automate-error _ _ . _) In ice-9/boot-9.scm: 1705:22 0 (raise-exception _ #:continuable? _) admin drain-and-stop: no pipeline process is attached under this name: tests/stopping/fleet, #f stop 1403: kill #<unspecified>, waitpid (1403 . 9) stop 1372: kill #<unspecified>, waitpid (1372 . 0) 18 passed, 1 failed == pumphouse-lost.scm ;;; compiling /tmp/guix-build-guile-automate-0.0.0-dev.drv-0/source/tests/pumphouse-lost.scm ;;; compiled /tmp/guix-build-guile-automate-0.0.0-dev.drv-0/source/.cache/guile/ccache/3.0-LE-8-4.7/tmp/guix-build-guile-automate-0.0.0-dev.drv-0/source/tests/pumphouse-lost.scm.go http on port 41987 pumphouse listening on /tmp/guix-build-guile-automate-0.0.0-dev.drv-0/automate-tests-B3XvhA/automate-pumphouse-n5KJpo/socket admin: /tmp/guix-build-guile-automate-0.0.0-dev.drv-0/automate-tests-B3XvhA/automate-pumphouse-n5KJpo/admin remote admin: /tmp/guix-build-guile-automate-0.0.0-dev.drv-0/automate-tests-B3XvhA/automate-pumphouse-n5KJpo/remote-admin attached to the pumphouse of /tmp/guix-build-guile-automate-0.0.0-dev.drv-0/automate-tests-B3XvhA/automate-pumphouse-n5KJpo/any stop 1440: kill #<unspecified>, waitpid (1440 . 0) lost the pumphouse; reconnecting cannot reach the pumphouse of /tmp/guix-build-guile-automate-0.0.0-dev.drv-0/automate-tests-B3XvhA/automate-pumphouse-n5KJpo/any; retrying every 1 seconds http on port 37463 pumphouse listening on /tmp/guix-build-guile-automate-0.0.0-dev.drv-0/automate-tests-B3XvhA/automate-pumphouse-n5KJpo/socket admin: /tmp/guix-build-guile-automate-0.0.0-dev.drv-0/automate-tests-B3XvhA/automate-pumphouse-n5KJpo/admin remote admin: /tmp/guix-build-guile-automate-0.0.0-dev.drv-0/automate-tests-B3XvhA/automate-pumphouse-n5KJpo/remote-admin registration (/): /tmp/guix-build-guile-automate-0.0.0-dev.drv-0/automate-tests-B3XvhA/automate-pumphouse-n5KJpo/any registration (tests/declared/): /tmp/guix-build-guile-automate-0.0.0-dev.drv-0/automate-tests-B3XvhA/automate-pumphouse-n5KJpo/declared Goblins exception: In message to #<local-object ^admin>: (registration (tests/only) #f) ice-9/boot-9.scm:1705:22: In procedure raise-exception: ERROR: 1. &automate-error: kind: declared-registrations irritants: () 2. &message: "this pumphouse's registrations are declared by its script, which is where to change them" 3. &irritants: () In goblins/core.scm: 1074:7 3 (syscaller-$ _ #<local-object ^admin> (registration (tests/only) #f)) In automate/pumphouse.scm: 603:4 2 (registration (tests/only) #f) In automate/model.scm: 119:2 1 (raise-automate-error _ _ . _) In ice-9/boot-9.scm: 1705:22 0 (raise-exception _ #:continuable? _) admin registration: this pumphouse's registrations are declared by its script, which is where to change them Goblins exception: In message to #<local-object ^admin>: (revoke (/) #f) ice-9/boot-9.scm:1705:22: In procedure raise-exception: ERROR: 1. &automate-error: kind: declared-registrations irritants: () 2. &message: "this pumphouse's registrations are declared by its script, which is where to change them" 3. &irritants: () In goblins/core.scm: 1074:7 3 (syscaller-$ _ #<local-object ^admin> (revoke (/) #f)) In automate/pumphouse.scm: 603:4 2 (revoke (/) #f) In automate/model.scm: 119:2 1 (raise-automate-error _ _ . _) In ice-9/boot-9.scm: 1705:22 0 (raise-exception _ #:continuable? _) admin revoke: this pumphouse's registrations are declared by its script, which is where to change them attached to the pumphouse of /tmp/guix-build-guile-automate-0.0.0-dev.drv-0/automate-tests-B3XvhA/automate-pumphouse-n5KJpo/any Goblins exception: In message to #<local-object ^admin>: (forget-pipeline tests/linger) ice-9/boot-9.scm:1705:22: In procedure raise-exception: ERROR: 1. &automate-error: kind: attached irritants: (tests/linger) 2. &message: "a pipeline process is attached under this name" 3. &irritants: (tests/linger) In goblins/core.scm: 1074:7 3 (syscaller-$ _ #<local-object ^admin> (forget-pipeline tests/linger)) In automate/pumphouse.scm: 64:4 2 (forget-pipeline! #<<pumphouse> records: #<local-object ^records> lives: #<hash-table 7ffff7819300 1/31> serving: #<hash-table 7ffff78192e0 1/31> owners: #<hash-table 7ffff78192c0 0/31> shared: #<hash-table 7ffff78192a0 0/31> gates: #<hash-table 7ffff7819280 0/31> stopped: #<hash-table 7ffff7819260 0/31> waiting: #<hash-table 7ffff7819240 0/31> timers: #<hash-table 7ffff7819220 0/31> tokens: #<hash-table 7ffff7819200 0/31> registrations: #<hash-table 7ffff78191e0 2/31> registra…> …) In automate/model.scm: 119:2 1 (raise-automate-error _ _ . _) In ice-9/boot-9.scm: 1705:22 0 (raise-exception _ #:continuable? _) admin forget-pipeline: a pipeline process is attached under this name: tests/linger stop 1450: kill #<unspecified>, waitpid (1450 . 9) Goblins exception: In message to #<local-object fulfilled-handler>: (#f) ice-9/boot-9.scm:1705:22: In procedure raise-exception: ERROR: 1. &automate-error: kind: no-such-pipeline irritants: (tests/linger) 2. &message: "no such pipeline" 3. &irritants: (tests/linger) In goblins/core.scm: 1074:7 4 (syscaller-$ _ #<local-object fulfilled-handler> (#f)) 2038:14 3 (_ . _) In automate/pumphouse.scm: 72:10 2 (_ #f) In automate/model.scm: 119:2 1 (raise-automate-error _ _ . _) In ice-9/boot-9.scm: 1705:22 0 (raise-exception _ #:continuable? _) admin forget-pipeline: no such pipeline: tests/linger attached to the pumphouse of /tmp/guix-build-guile-automate-0.0.0-dev.drv-0/automate-tests-B3XvhA/automate-pumphouse-n5KJpo/any attached to the pumphouse of /tmp/guix-build-guile-automate-0.0.0-dev.drv-0/automate-tests-B3XvhA/automate-pumphouse-n5KJpo/any Goblins exception: In message to #<local-object ^pipeline-endpoint>: (run (run-request (id . "a65b7cac5e5cb483") (parameters (marker . "/tmp/guix-build-guile-automate-0.0.0-dev.drv-0/automate-tests-B3XvhA/automate-pumphouse-n5KJpo/linger-5")) (cause . #f) (ancestors))) ice-9/boot-9.scm:1705:22: In procedure raise-exception: ERROR: 1. &automate-error: kind: busy irritants: (tests/pool 1) 2. &message: "as many runs are in flight as this process takes" 3. &irritants: (tests/pool 1) In goblins/core.scm: 1074:7 2 (syscaller-$ _ #<local-object ^pipeline-endpoint> (run (run-request (id . "a65b7cac5e5cb483") (parameters (marker . "/tmp/guix-build-guile-automate-0.0.0-dev.drv-0/automate-tests-B3XvhA/automate-pumphouse-n5KJpo/linger-5")) (cause . #f) (ancestors)))) In automate/model.scm: 119:2 1 (raise-automate-error _ _ . _) In ice-9/boot-9.scm: 1705:22 0 (raise-exception _ #:continuable? _) tests/pool run: as many runs are in flight as this process takes: tests/pool, 1 Goblins exception: In message to #<local-object ^pipeline-endpoint>: (run (run-request (id . "a65b7cac5e5cb483") (parameters (marker . "/tmp/guix-build-guile-automate-0.0.0-dev.drv-0/automate-tests-B3XvhA/automate-pumphouse-n5KJpo/linger-5")) (cause . #f) (ancestors))) ice-9/boot-9.scm:1705:22: In procedure raise-exception: ERROR: 1. &automate-error: kind: busy irritants: (tests/pool 1) 2. &message: "as many runs are in flight as this process takes" 3. &irritants: (tests/pool 1) In goblins/core.scm: 1074:7 2 (syscaller-$ _ #<local-object ^pipeline-endpoint> (run (run-request (id . "a65b7cac5e5cb483") (parameters (marker . "/tmp/guix-build-guile-automate-0.0.0-dev.drv-0/automate-tests-B3XvhA/automate-pumphouse-n5KJpo/linger-5")) (cause . #f) (ancestors)))) In automate/model.scm: 119:2 1 (raise-automate-error _ _ . _) In ice-9/boot-9.scm: 1705:22 0 (raise-exception _ #:continuable? _) tests/pool run: as many runs are in flight as this process takes: tests/pool, 1 Goblins exception: In message to #<local-object ^pipeline-endpoint>: (run (run-request (id . "a65b7cac5e5cb483") (parameters (marker . "/tmp/guix-build-guile-automate-0.0.0-dev.drv-0/automate-tests-B3XvhA/automate-pumphouse-n5KJpo/linger-5")) (cause . #f) (ancestors))) ice-9/boot-9.scm:1705:22: In procedure raise-exception: ERROR: 1. &automate-error: kind: busy irritants: (tests/pool 1) 2. &message: "as many runs are in flight as this process takes" 3. &irritants: (tests/pool 1) In goblins/core.scm: 1074:7 2 (syscaller-$ _ #<local-object ^pipeline-endpoint> (run (run-request (id . "a65b7cac5e5cb483") (parameters (marker . "/tmp/guix-build-guile-automate-0.0.0-dev.drv-0/automate-tests-B3XvhA/automate-pumphouse-n5KJpo/linger-5")) (cause . #f) (ancestors)))) In automate/model.scm: 119:2 1 (raise-automate-error _ _ . _) In ice-9/boot-9.scm: 1705:22 0 (raise-exception _ #:continuable? _) tests/pool run: as many runs are in flight as this process takes: tests/pool, 1 Goblins exception: In message to #<local-object ^pipeline-endpoint>: (run (run-request (id . "a65b7cac5e5cb483") (parameters (marker . "/tmp/guix-build-guile-automate-0.0.0-dev.drv-0/automate-tests-B3XvhA/automate-pumphouse-n5KJpo/linger-5")) (cause . #f) (ancestors))) ice-9/boot-9.scm:1705:22: In procedure raise-exception: ERROR: 1. &automate-error: kind: busy irritants: (tests/pool 1) 2. &message: "as many runs are in flight as this process takes" 3. &irritants: (tests/pool 1) In goblins/core.scm: 1074:7 2 (syscaller-$ _ #<local-object ^pipeline-endpoint> (run (run-request (id . "a65b7cac5e5cb483") (parameters (marker . "/tmp/guix-build-guile-automate-0.0.0-dev.drv-0/automate-tests-B3XvhA/automate-pumphouse-n5KJpo/linger-5")) (cause . #f) (ancestors)))) In automate/model.scm: 119:2 1 (raise-automate-error _ _ . _) In ice-9/boot-9.scm: 1705:22 0 (raise-exception _ #:continuable? _) tests/pool run: as many runs are in flight as this process takes: tests/pool, 1 Goblins exception: In message to #<local-object ^pipeline-endpoint>: (run (run-request (id . "a65b7cac5e5cb483") (parameters (marker . "/tmp/guix-build-guile-automate-0.0.0-dev.drv-0/automate-tests-B3XvhA/automate-pumphouse-n5KJpo/linger-5")) (cause . #f) (ancestors))) ice-9/boot-9.scm:1705:22: In procedure raise-exception: ERROR: 1. &automate-error: kind: busy irritants: (tests/pool 1) 2. &message: "as many runs are in flight as this process takes" 3. &irritants: (tests/pool 1) In goblins/core.scm: 1074:7 2 (syscaller-$ _ #<local-object ^pipeline-endpoint> (run (run-request (id . "a65b7cac5e5cb483") (parameters (marker . "/tmp/guix-build-guile-automate-0.0.0-dev.drv-0/automate-tests-B3XvhA/automate-pumphouse-n5KJpo/linger-5")) (cause . #f) (ancestors)))) In automate/model.scm: 119:2 1 (raise-automate-error _ _ . _) In ice-9/boot-9.scm: 1705:22 0 (raise-exception _ #:continuable? _) tests/pool run: as many runs are in flight as this process takes: tests/pool, 1 Goblins exception: In message to #<local-object ^pipeline-endpoint>: (run (run-request (id . "a65b7cac5e5cb483") (parameters (marker . "/tmp/guix-build-guile-automate-0.0.0-dev.drv-0/automate-tests-B3XvhA/automate-pumphouse-n5KJpo/linger-5")) (cause . #f) (ancestors))) ice-9/boot-9.scm:1705:22: In procedure raise-exception: ERROR: 1. &automate-error: kind: busy irritants: (tests/pool 1) 2. &message: "as many runs are in flight as this process takes" 3. &irritants: (tests/pool 1) In goblins/core.scm: 1074:7 2 (syscaller-$ _ #<local-object ^pipeline-endpoint> (run (run-request (id . "a65b7cac5e5cb483") (parameters (marker . "/tmp/guix-build-guile-automate-0.0.0-dev.drv-0/automate-tests-B3XvhA/automate-pumphouse-n5KJpo/linger-5")) (cause . #f) (ancestors)))) In automate/model.scm: 119:2 1 (raise-automate-error _ _ . _) In ice-9/boot-9.scm: 1705:22 0 (raise-exception _ #:continuable? _) tests/pool run: as many runs are in flight as this process takes: tests/pool, 1 Goblins exception: In message to #<local-object ^pipeline-endpoint>: (run (run-request (id . "a65b7cac5e5cb483") (parameters (marker . "/tmp/guix-build-guile-automate-0.0.0-dev.drv-0/automate-tests-B3XvhA/automate-pumphouse-n5KJpo/linger-5")) (cause . #f) (ancestors))) ice-9/boot-9.scm:1705:22: In procedure raise-exception: ERROR: 1. &automate-error: kind: busy irritants: (tests/pool 1) 2. &message: "as many runs are in flight as this process takes" 3. &irritants: (tests/pool 1) In goblins/core.scm: 1074:7 2 (syscaller-$ _ #<local-object ^pipeline-endpoint> (run (run-request (id . "a65b7cac5e5cb483") (parameters (marker . "/tmp/guix-build-guile-automate-0.0.0-dev.drv-0/automate-tests-B3XvhA/automate-pumphouse-n5KJpo/linger-5")) (cause . #f) (ancestors)))) In automate/model.scm: 119:2 1 (raise-automate-error _ _ . _) In ice-9/boot-9.scm: 1705:22 0 (raise-exception _ #:continuable? _) tests/pool run: as many runs are in flight as this process takes: tests/pool, 1 Goblins exception: In message to #<local-object ^pipeline-endpoint>: (run (run-request (id . "a65b7cac5e5cb483") (parameters (marker . "/tmp/guix-build-guile-automate-0.0.0-dev.drv-0/automate-tests-B3XvhA/automate-pumphouse-n5KJpo/linger-5")) (cause . #f) (ancestors))) ice-9/boot-9.scm:1705:22: In procedure raise-exception: ERROR: 1. &automate-error: kind: busy irritants: (tests/pool 1) 2. &message: "as many runs are in flight as this process takes" 3. &irritants: (tests/pool 1) In goblins/core.scm: 1074:7 2 (syscaller-$ _ #<local-object ^pipeline-endpoint> (run (run-request (id . "a65b7cac5e5cb483") (parameters (marker . "/tmp/guix-build-guile-automate-0.0.0-dev.drv-0/automate-tests-B3XvhA/automate-pumphouse-n5KJpo/linger-5")) (cause . #f) (ancestors)))) In automate/model.scm: 119:2 1 (raise-automate-error _ _ . _) In ice-9/boot-9.scm: 1705:22 0 (raise-exception _ #:continuable? _) tests/pool run: as many runs are in flight as this process takes: tests/pool, 1 Goblins exception: In message to #<local-object ^pipeline-endpoint>: (run (run-request (id . "a65b7cac5e5cb483") (parameters (marker . "/tmp/guix-build-guile-automate-0.0.0-dev.drv-0/automate-tests-B3XvhA/automate-pumphouse-n5KJpo/linger-5")) (cause . #f) (ancestors))) ice-9/boot-9.scm:1705:22: In procedure raise-exception: ERROR: 1. &automate-error: kind: busy irritants: (tests/pool 1) 2. &message: "as many runs are in flight as this process takes" 3. &irritants: (tests/pool 1) In goblins/core.scm: 1074:7 2 (syscaller-$ _ #<local-object ^pipeline-endpoint> (run (run-request (id . "a65b7cac5e5cb483") (parameters (marker . "/tmp/guix-build-guile-automate-0.0.0-dev.drv-0/automate-tests-B3XvhA/automate-pumphouse-n5KJpo/linger-5")) (cause . #f) (ancestors)))) In automate/model.scm: 119:2 1 (raise-automate-error _ _ . _) In ice-9/boot-9.scm: 1705:22 0 (raise-exception _ #:continuable? _) tests/pool run: as many runs are in flight as this process takes: tests/pool, 1 Goblins exception: In message to #<local-object ^pipeline-endpoint>: (run (run-request (id . "a65b7cac5e5cb483") (parameters (marker . "/tmp/guix-build-guile-automate-0.0.0-dev.drv-0/automate-tests-B3XvhA/automate-pumphouse-n5KJpo/linger-5")) (cause . #f) (ancestors))) ice-9/boot-9.scm:1705:22: In procedure raise-exception: ERROR: 1. &automate-error: kind: busy irritants: (tests/pool 1) 2. &message: "as many runs are in flight as this process takes" 3. &irritants: (tests/pool 1) In goblins/core.scm: 1074:7 2 (syscaller-$ _ #<local-object ^pipeline-endpoint> (run (run-request (id . "a65b7cac5e5cb483") (parameters (marker . "/tmp/guix-build-guile-automate-0.0.0-dev.drv-0/automate-tests-B3XvhA/automate-pumphouse-n5KJpo/linger-5")) (cause . #f) (ancestors)))) In automate/model.scm: 119:2 1 (raise-automate-error _ _ . _) In ice-9/boot-9.scm: 1705:22 0 (raise-exception _ #:continuable? _) tests/pool run: as many runs are in flight as this process takes: tests/pool, 1 Goblins exception: In message to #<local-object ^pipeline-endpoint>: (run (run-request (id . "a65b7cac5e5cb483") (parameters (marker . "/tmp/guix-build-guile-automate-0.0.0-dev.drv-0/automate-tests-B3XvhA/automate-pumphouse-n5KJpo/linger-5")) (cause . #f) (ancestors))) ice-9/boot-9.scm:1705:22: In procedure raise-exception: ERROR: 1. &automate-error: kind: busy irritants: (tests/pool 1) 2. &message: "as many runs are in flight as this process takes" 3. &irritants: (tests/pool 1) In goblins/core.scm: 1074:7 2 (syscaller-$ _ #<local-object ^pipeline-endpoint> (run (run-request (id . "a65b7cac5e5cb483") (parameters (marker . "/tmp/guix-build-guile-automate-0.0.0-dev.drv-0/automate-tests-B3XvhA/automate-pumphouse-n5KJpo/linger-5")) (cause . #f) (ancestors)))) In automate/model.scm: 119:2 1 (raise-automate-error _ _ . _) In ice-9/boot-9.scm: 1705:22 0 (raise-exception _ #:continuable? _) tests/pool run: as many runs are in flight as this process takes: tests/pool, 1 Goblins exception: In message to #<local-object ^pipeline-endpoint>: (run (run-request (id . "a65b7cac5e5cb483") (parameters (marker . "/tmp/guix-build-guile-automate-0.0.0-dev.drv-0/automate-tests-B3XvhA/automate-pumphouse-n5KJpo/linger-5")) (cause . #f) (ancestors))) ice-9/boot-9.scm:1705:22: In procedure raise-exception: ERROR: 1. &automate-error: kind: busy irritants: (tests/pool 1) 2. &message: "as many runs are in flight as this process takes" 3. &irritants: (tests/pool 1) In goblins/core.scm: 1074:7 2 (syscaller-$ _ #<local-object ^pipeline-endpoint> (run (run-request (id . "a65b7cac5e5cb483") (parameters (marker . "/tmp/guix-build-guile-automate-0.0.0-dev.drv-0/automate-tests-B3XvhA/automate-pumphouse-n5KJpo/linger-5")) (cause . #f) (ancestors)))) In automate/model.scm: 119:2 1 (raise-automate-error _ _ . _) In ice-9/boot-9.scm: 1705:22 0 (raise-exception _ #:continuable? _) tests/pool run: as many runs are in flight as this process takes: tests/pool, 1 Goblins exception: In message to #<local-object ^pipeline-endpoint>: (run (run-request (id . "a65b7cac5e5cb483") (parameters (marker . "/tmp/guix-build-guile-automate-0.0.0-dev.drv-0/automate-tests-B3XvhA/automate-pumphouse-n5KJpo/linger-5")) (cause . #f) (ancestors))) ice-9/boot-9.scm:1705:22: In procedure raise-exception: ERROR: 1. &automate-error: kind: busy irritants: (tests/pool 1) 2. &message: "as many runs are in flight as this process takes" 3. &irritants: (tests/pool 1) In goblins/core.scm: 1074:7 2 (syscaller-$ _ #<local-object ^pipeline-endpoint> (run (run-request (id . "a65b7cac5e5cb483") (parameters (marker . "/tmp/guix-build-guile-automate-0.0.0-dev.drv-0/automate-tests-B3XvhA/automate-pumphouse-n5KJpo/linger-5")) (cause . #f) (ancestors)))) In automate/model.scm: 119:2 1 (raise-automate-error _ _ . _) In ice-9/boot-9.scm: 1705:22 0 (raise-exception _ #:continuable? _) tests/pool run: as many runs are in flight as this process takes: tests/pool, 1 Goblins exception: In message to #<local-object ^pipeline-endpoint>: (run (run-request (id . "a65b7cac5e5cb483") (parameters (marker . "/tmp/guix-build-guile-automate-0.0.0-dev.drv-0/automate-tests-B3XvhA/automate-pumphouse-n5KJpo/linger-5")) (cause . #f) (ancestors))) ice-9/boot-9.scm:1705:22: In procedure raise-exception: ERROR: 1. &automate-error: kind: busy irritants: (tests/pool 1) 2. &message: "as many runs are in flight as this process takes" 3. &irritants: (tests/pool 1) In goblins/core.scm: 1074:7 2 (syscaller-$ _ #<local-object ^pipeline-endpoint> (run (run-request (id . "a65b7cac5e5cb483") (parameters (marker . "/tmp/guix-build-guile-automate-0.0.0-dev.drv-0/automate-tests-B3XvhA/automate-pumphouse-n5KJpo/linger-5")) (cause . #f) (ancestors)))) In automate/model.scm: 119:2 1 (raise-automate-error _ _ . _) In ice-9/boot-9.scm: 1705:22 0 (raise-exception _ #:continuable? _) tests/pool run: as many runs are in flight as this process takes: tests/pool, 1 Goblins exception: In message to #<local-object broken-handler>: ((automate-error busy "as many runs are in flight as this process takes" ("tests/pool" "1") "#<&compound-exception components: (#<&automate-error kind: busy irritants: (tests/pool 1)> #<&message message: \"as many runs are in flight as this process takes\"> #<&irritants irritants: (tests/pool 1)>)>" "")) ice-9/boot-9.scm:1705:22: In procedure raise-exception: ERROR: 1. &automate-error: kind: busy irritants: (tests/pool) 2. &message: "every pipeline process serving the pipeline is busy" 3. &irritants: (tests/pool) In goblins/core.scm: 1074:7 3 (syscaller-$ _ #<local-object broken-handler> ((automate-error busy "as many runs are in flight as this process takes" ("tests/pool" "1") "#<&compound-exception components: (#<&automate-error kind: busy irritants: (tests/pool 1)> #<&message message: \"as many runs are in flight as this process takes\"> #<&irritants irritants: (tests/pool 1)>)>" ""))) 2038:14 2 (_ . _) In automate/model.scm: 119:2 1 (raise-automate-error _ _ . _) In ice-9/boot-9.scm: 1705:22 0 (raise-exception _ #:continuable? _) admin run: every pipeline process serving the pipeline is busy: tests/pool stop 1479: kill #<unspecified>, waitpid (1479 . 9) attached to the pumphouse of /tmp/guix-build-guile-automate-0.0.0-dev.drv-0/automate-tests-B3XvhA/automate-pumphouse-n5KJpo/any Goblins exception: In message to #<local-object ^pipeline-endpoint>: (run (run-request (id . "55bcfef2655d4604") (parameters (marker . "/tmp/guix-build-guile-automate-0.0.0-dev.drv-0/automate-tests-B3XvhA/automate-pumphouse-n5KJpo/linger-7")) (cause . #f) (ancestors))) ice-9/boot-9.scm:1705:22: In procedure raise-exception: ERROR: 1. &automate-error: kind: busy irritants: (tests/pool 1) 2. &message: "as many runs are in flight as this process takes" 3. &irritants: (tests/pool 1) In goblins/core.scm: 1074:7 2 (syscaller-$ _ #<local-object ^pipeline-endpoint> (run (run-request (id . "55bcfef2655d4604") (parameters (marker . "/tmp/guix-build-guile-automate-0.0.0-dev.drv-0/automate-tests-B3XvhA/automate-pumphouse-n5KJpo/linger-7")) (cause . #f) (ancestors)))) In automate/model.scm: 119:2 1 (raise-automate-error _ _ . _) In ice-9/boot-9.scm: 1705:22 0 (raise-exception _ #:continuable? _) tests/pool run: as many runs are in flight as this process takes: tests/pool, 1 Goblins exception: In message to #<local-object ^pipeline-endpoint>: (run (run-request (id . "55bcfef2655d4604") (parameters (marker . "/tmp/guix-build-guile-automate-0.0.0-dev.drv-0/automate-tests-B3XvhA/automate-pumphouse-n5KJpo/linger-7")) (cause . #f) (ancestors))) ice-9/boot-9.scm:1705:22: In procedure raise-exception: ERROR: 1. &automate-error: kind: busy irritants: (tests/pool 1) 2. &message: "as many runs are in flight as this process takes" 3. &irritants: (tests/pool 1) In goblins/core.scm: 1074:7 2 (syscaller-$ _ #<local-object ^pipeline-endpoint> (run (run-request (id . "55bcfef2655d4604") (parameters (marker . "/tmp/guix-build-guile-automate-0.0.0-dev.drv-0/automate-tests-B3XvhA/automate-pumphouse-n5KJpo/linger-7")) (cause . #f) (ancestors)))) In automate/model.scm: 119:2 1 (raise-automate-error _ _ . _) In ice-9/boot-9.scm: 1705:22 0 (raise-exception _ #:continuable? _) tests/pool run: as many runs are in flight as this process takes: tests/pool, 1 Goblins exception: In message to #<local-object ^pipeline-endpoint>: (run (run-request (id . "55bcfef2655d4604") (parameters (marker . "/tmp/guix-build-guile-automate-0.0.0-dev.drv-0/automate-tests-B3XvhA/automate-pumphouse-n5KJpo/linger-7")) (cause . #f) (ancestors))) ice-9/boot-9.scm:1705:22: In procedure raise-exception: ERROR: 1. &automate-error: kind: busy irritants: (tests/pool 1) 2. &message: "as many runs are in flight as this process takes" 3. &irritants: (tests/pool 1) In goblins/core.scm: 1074:7 2 (syscaller-$ _ #<local-object ^pipeline-endpoint> (run (run-request (id . "55bcfef2655d4604") (parameters (marker . "/tmp/guix-build-guile-automate-0.0.0-dev.drv-0/automate-tests-B3XvhA/automate-pumphouse-n5KJpo/linger-7")) (cause . #f) (ancestors)))) In automate/model.scm: 119:2 1 (raise-automate-error _ _ . _) In ice-9/boot-9.scm: 1705:22 0 (raise-exception _ #:continuable? _) tests/pool run: as many runs are in flight as this process takes: tests/pool, 1 Goblins exception: In message to #<local-object ^pipeline-endpoint>: (run (run-request (id . "55bcfef2655d4604") (parameters (marker . "/tmp/guix-build-guile-automate-0.0.0-dev.drv-0/automate-tests-B3XvhA/automate-pumphouse-n5KJpo/linger-7")) (cause . #f) (ancestors))) ice-9/boot-9.scm:1705:22: In procedure raise-exception: ERROR: 1. &automate-error: kind: busy irritants: (tests/pool 1) 2. &message: "as many runs are in flight as this process takes" 3. &irritants: (tests/pool 1) In goblins/core.scm: 1074:7 2 (syscaller-$ _ #<local-object ^pipeline-endpoint> (run (run-request (id . "55bcfef2655d4604") (parameters (marker . "/tmp/guix-build-guile-automate-0.0.0-dev.drv-0/automate-tests-B3XvhA/automate-pumphouse-n5KJpo/linger-7")) (cause . #f) (ancestors)))) In automate/model.scm: 119:2 1 (raise-automate-error _ _ . _) In ice-9/boot-9.scm: 1705:22 0 (raise-exception _ #:continuable? _) tests/pool run: as many runs are in flight as this process takes: tests/pool, 1 Goblins exception: In message to #<local-object ^pipeline-endpoint>: (run (run-request (id . "55bcfef2655d4604") (parameters (marker . "/tmp/guix-build-guile-automate-0.0.0-dev.drv-0/automate-tests-B3XvhA/automate-pumphouse-n5KJpo/linger-7")) (cause . #f) (ancestors))) ice-9/boot-9.scm:1705:22: In procedure raise-exception: ERROR: 1. &automate-error: kind: busy irritants: (tests/pool 1) 2. &message: "as many runs are in flight as this process takes" 3. &irritants: (tests/pool 1) In goblins/core.scm: 1074:7 2 (syscaller-$ _ #<local-object ^pipeline-endpoint> (run (run-request (id . "55bcfef2655d4604") (parameters (marker . "/tmp/guix-build-guile-automate-0.0.0-dev.drv-0/automate-tests-B3XvhA/automate-pumphouse-n5KJpo/linger-7")) (cause . #f) (ancestors)))) In automate/model.scm: 119:2 1 (raise-automate-error _ _ . _) In ice-9/boot-9.scm: 1705:22 0 (raise-exception _ #:continuable? _) tests/pool run: as many runs are in flight as this process takes: tests/pool, 1 Goblins exception: In message to #<local-object ^pipeline-endpoint>: (run (run-request (id . "55bcfef2655d4604") (parameters (marker . "/tmp/guix-build-guile-automate-0.0.0-dev.drv-0/automate-tests-B3XvhA/automate-pumphouse-n5KJpo/linger-7")) (cause . #f) (ancestors))) ice-9/boot-9.scm:1705:22: In procedure raise-exception: ERROR: 1. &automate-error: kind: busy irritants: (tests/pool 1) 2. &message: "as many runs are in flight as this process takes" 3. &irritants: (tests/pool 1) In goblins/core.scm: 1074:7 2 (syscaller-$ _ #<local-object ^pipeline-endpoint> (run (run-request (id . "55bcfef2655d4604") (parameters (marker . "/tmp/guix-build-guile-automate-0.0.0-dev.drv-0/automate-tests-B3XvhA/automate-pumphouse-n5KJpo/linger-7")) (cause . #f) (ancestors)))) In automate/model.scm: 119:2 1 (raise-automate-error _ _ . _) In ice-9/boot-9.scm: 1705:22 0 (raise-exception _ #:continuable? _) tests/pool run: as many runs are in flight as this process takes: tests/pool, 1 Goblins exception: In message to #<local-object ^pipeline-endpoint>: (run (run-request (id . "55bcfef2655d4604") (parameters (marker . "/tmp/guix-build-guile-automate-0.0.0-dev.drv-0/automate-tests-B3XvhA/automate-pumphouse-n5KJpo/linger-7")) (cause . #f) (ancestors))) ice-9/boot-9.scm:1705:22: In procedure raise-exception: ERROR: 1. &automate-error: kind: busy irritants: (tests/pool 1) 2. &message: "as many runs are in flight as this process takes" 3. &irritants: (tests/pool 1) In goblins/core.scm: 1074:7 2 (syscaller-$ _ #<local-object ^pipeline-endpoint> (run (run-request (id . "55bcfef2655d4604") (parameters (marker . "/tmp/guix-build-guile-automate-0.0.0-dev.drv-0/automate-tests-B3XvhA/automate-pumphouse-n5KJpo/linger-7")) (cause . #f) (ancestors)))) In automate/model.scm: 119:2 1 (raise-automate-error _ _ . _) In ice-9/boot-9.scm: 1705:22 0 (raise-exception _ #:continuable? _) tests/pool run: as many runs are in flight as this process takes: tests/pool, 1 Goblins exception: In message to #<local-object broken-handler>: ((automate-error busy "as many runs are in flight as this process takes" ("tests/pool" "1") "#<&compound-exception components: (#<&automate-error kind: busy irritants: (tests/pool 1)> #<&message message: \"as many runs are in flight as this process takes\"> #<&irritants irritants: (tests/pool 1)>)>" "")) ice-9/boot-9.scm:1705:22: In procedure raise-exception: ERROR: 1. &automate-error: kind: busy irritants: (tests/pool) 2. &message: "every pipeline process serving the pipeline is busy" 3. &irritants: (tests/pool) In goblins/core.scm: 1074:7 3 (syscaller-$ _ #<local-object broken-handler> ((automate-error busy "as many runs are in flight as this process takes" ("tests/pool" "1") "#<&compound-exception components: (#<&automate-error kind: busy irritants: (tests/pool 1)> #<&message message: \"as many runs are in flight as this process takes\"> #<&irritants irritants: (tests/pool 1)>)>" ""))) 2038:14 2 (_ . _) In automate/model.scm: 119:2 1 (raise-automate-error _ _ . _) In ice-9/boot-9.scm: 1705:22 0 (raise-exception _ #:continuable? _) admin run: every pipeline process serving the pipeline is busy: tests/pool stop 1517: kill #<unspecified>, waitpid (1517 . 9) stop 1480: kill #<unspecified>, waitpid (1480 . 9) stop 1460: kill #<unspecified>, waitpid (1460 . 0) 37 passed, 0 failed == pumphouse-replay.scm ;;; compiling /tmp/guix-build-guile-automate-0.0.0-dev.drv-0/source/tests/pumphouse-replay.scm ;;; compiled /tmp/guix-build-guile-automate-0.0.0-dev.drv-0/source/.cache/guile/ccache/3.0-LE-8-4.7/tmp/guix-build-guile-automate-0.0.0-dev.drv-0/source/tests/pumphouse-replay.scm.go http on port 38899 pumphouse listening on /tmp/guix-build-guile-automate-0.0.0-dev.drv-0/automate-tests-B3XvhA/automate-pumphouse-u87vbK/socket admin: /tmp/guix-build-guile-automate-0.0.0-dev.drv-0/automate-tests-B3XvhA/automate-pumphouse-u87vbK/admin remote admin: /tmp/guix-build-guile-automate-0.0.0-dev.drv-0/automate-tests-B3XvhA/automate-pumphouse-u87vbK/remote-admin attached to the pumphouse of /tmp/guix-build-guile-automate-0.0.0-dev.drv-0/automate-tests-B3XvhA/automate-pumphouse-u87vbK/any lost the pumphouse; reconnecting stop 1536: kill #<unspecified>, waitpid (1536 . 0) cannot reach the pumphouse of /tmp/guix-build-guile-automate-0.0.0-dev.drv-0/automate-tests-B3XvhA/automate-pumphouse-u87vbK/any; retrying every 1 seconds http on port 37835 pumphouse listening on /tmp/guix-build-guile-automate-0.0.0-dev.drv-0/automate-tests-B3XvhA/automate-pumphouse-u87vbK/socket admin: /tmp/guix-build-guile-automate-0.0.0-dev.drv-0/automate-tests-B3XvhA/automate-pumphouse-u87vbK/admin remote admin: /tmp/guix-build-guile-automate-0.0.0-dev.drv-0/automate-tests-B3XvhA/automate-pumphouse-u87vbK/remote-admin attached to the pumphouse of /tmp/guix-build-guile-automate-0.0.0-dev.drv-0/automate-tests-B3XvhA/automate-pumphouse-u87vbK/any stop 1546: kill #<unspecified>, waitpid (1546 . 9) attached to the pumphouse of /tmp/guix-build-guile-automate-0.0.0-dev.drv-0/automate-tests-B3XvhA/automate-pumphouse-u87vbK/any stop 1584: kill #<unspecified>, waitpid (1584 . 9) stop 1561: kill #<unspecified>, waitpid (1561 . 0) 14 passed, 0 failed == pumphouse-restart.scm ;;; compiling /tmp/guix-build-guile-automate-0.0.0-dev.drv-0/source/tests/pumphouse-restart.scm ;;; compiled /tmp/guix-build-guile-automate-0.0.0-dev.drv-0/source/.cache/guile/ccache/3.0-LE-8-4.7/tmp/guix-build-guile-automate-0.0.0-dev.drv-0/source/tests/pumphouse-restart.scm.go http on port 46663 pumphouse listening on /tmp/guix-build-guile-automate-0.0.0-dev.drv-0/automate-tests-B3XvhA/automate-pumphouse-CpitVP/socket admin: /tmp/guix-build-guile-automate-0.0.0-dev.drv-0/automate-tests-B3XvhA/automate-pumphouse-CpitVP/admin remote admin: /tmp/guix-build-guile-automate-0.0.0-dev.drv-0/automate-tests-B3XvhA/automate-pumphouse-CpitVP/remote-admin attached to the pumphouse of /tmp/guix-build-guile-automate-0.0.0-dev.drv-0/automate-tests-B3XvhA/automate-pumphouse-CpitVP/any attached to the pumphouse lost the pumphouse; reconnecting clost the pumphouse; reconanencntoit nrge ach the pumphouse of /tmp/guix-build-guile-automate-0.0.0-dev.drv-0/automate-tests-B3XvhA/automate-pumphouse-CpitVP/any; retrying every 1 seconds http on port 33189 pumphouse listening on /tmp/guix-build-guile-automate-0.0.0-dev.drv-0/automate-tests-B3XvhA/automate-pumphouse-CpitVP/socket admin: /tmp/guix-build-guile-automate-0.0.0-dev.drv-0/automate-tests-B3XvhA/automate-pumphouse-CpitVP/admin remote admin: /tmp/guix-build-guile-automate-0.0.0-dev.drv-0/automate-tests-B3XvhA/automate-pumphouse-CpitVP/remote-admin attached to the pumphouse of /tmp/guix-build-guile-automate-0.0.0-dev.drv-0/automate-tests-B3XvhA/automate-pumphouse-CpitVP/any attached to the pumphouse stop 1613: kill #<unspecified>, waitpid (1613 . 9) stop 1614: kill #<unspecified>, waitpid (1614 . 9) stop 1660: kill #<unspecified>, waitpid (1660 . 0) 19 passed, 0 failed == pumphouse-shepherd.scm ;;; compiling /tmp/guix-build-guile-automate-0.0.0-dev.drv-0/source/tests/pumphouse-shepherd.scm ;;; compiled /tmp/guix-build-guile-automate-0.0.0-dev.drv-0/source/.cache/guile/ccache/3.0-LE-8-4.7/tmp/guix-build-guile-automate-0.0.0-dev.drv-0/source/tests/pumphouse-shepherd.scm.go http on port 33637 pumphouse listening on /tmp/guix-build-guile-automate-0.0.0-dev.drv-0/automate-tests-B3XvhA/automate-pumphouse-ximQo0/socket admin: /tmp/guix-build-guile-automate-0.0.0-dev.drv-0/automate-tests-B3XvhA/automate-pumphouse-ximQo0/admin remote admin: /tmp/guix-build-guile-automate-0.0.0-dev.drv-0/automate-tests-B3XvhA/automate-pumphouse-ximQo0/remote-admin registration (/): /tmp/guix-build-guile-automate-0.0.0-dev.drv-0/automate-tests-B3XvhA/automate-pumphouse-ximQo0/any registration (tests/registered): /tmp/guix-build-guile-automate-0.0.0-dev.drv-0/automate-tests-B3XvhA/ps-daqkg6/secrets/registered/pumphouse GNU Shepherd 1.0.9 (Guile 3.0.9, Fibers 1.4.3, x86_64-unknown-linux-gnu) Starting service root... Service root started. Service root running with value #<<process> id: 1707 command: #f>. Service root has been started. Configuration successfully loaded from '/tmp/guix-build-guile-automate-0.0.0-dev.drv-0/automate-tests-B3XvhA/ps-daqkg6/shepherd.scm'. Starting service shepherd-bridge... Service shepherd-bridge started. Service shepherd-bridge running with value #<<process> id: 1713 command: ("/gnu/store/k7vkw9x3wl3lni6a0i2w8xz2z8ylrqyz-guile-3.0.11/bin/guile" "-L" "/tmp/guix-build-guile-automate-0.0.0-dev.drv-0/source" "-L" "/gnu/store/r5gafvw9iapq6173liw37bzxj40bslhs-guile-documenta-0.4.0/share/guile/site/3.0" "-L" "/gnu/store/qzml053shmjml5vj6rbcfss5247h20f6-guile-syntax-highlight-0.3.1/share/guile/site/3.0" "-L" "/gnu/store/7a6l3fzjvr3nvbnw579wdkhhszzzh3ql-guix-1.5.0-6.64d4de2/share/guile/site/3.0" "-L" "/gnu/store/zplkplr3qmp5dpvhcxpgqr1lg44wmxyk-guile-goblins-0.18.0/share/guile/site/3.0" "-L" "/gnu/store/5la7a0imnji190xnfmxf0jrsp82dn9hq-guile-fibers-1.4.3/share/guile/site/3.0" "-L" "/gnu/store/z4fnbwa7d6dprqvd7f89wcifq6ggr2wm-guile-gcrypt-0.5.0/share/guile/site/3.0" "-L" "/gnu/store/b9928rpaj24whj9cz36yd1h28w7pwphq-guile-gnutls-5.0.2/share/guile/site/3.0" "-L" "/gnu/store/nw7d5iijwm9sa16k2swxjalgp0vlm01v-guile-json-4.7.3/share/guile/site/3.0" "-L" "/gnu/store/gyf1hm3gzbq00aw3m9x1xickf3zs3pq8-guile-knots-0.1-39.3417d25/share/guile/site/3.0" "-L" "/gnu/store/wsg7chjw2cg6xnp4il5caff5w0w69ikc-guile-sqlite3-0.1.3/share/guile/site/3.0" "-L" "/gnu/store/8n90dzhz177l1lz8bjrxsgbiyh1kmjap-guile-zlib-0.2.2/share/guile/site/3.0" "-L" "/gnu/store/2qm9a3n19pnznv791jvglb4sgh1jda3s-guile-safsaf-0.5-1.8b35410/share/guile/site/3.0" "-L" "/gnu/store/9ia4lplmfhpdxnnkvk0zyhyainyn0r0q-guile-prometheus-0-11.8f70b4b/share/guile/site/3.0" "-L" "/gnu/store/fp4rjwzvrm309wg11jahx8qcm7ypkai3-guile-ares-rs-0.9.8/share/guile/site/3.0" "-L" "/gnu/store/hfx188ymz9y9ialr175lqifn3b6xfdnz-shepherd-1.0.9/share/guile/site/3.0" "-L" "/gnu/store/x9ypa71lzv9jrd5n0qxq51hxnra83z2x-guile-lib-0.2.8.1/share/guile/site/3.0" "-L" "/gnu/store/9rd4c5w765bmsx0cimk0idpfasicvcdr-guile-config-0.5.1/share/guile/site/3.0" "-L" "/gnu/store/lsys62yw1wnmchmvv3q5x7bzkghyasil-guile-zstd-0.1.1/share/guile/site/3.0" "-L" "/gnu/store/gq36qbm22984252qxrzrgvrqzx807kd0-guile-lzlib-0.4.0/share/guile/site/3.0" "-L" "/gnu/store/axcsnac5kji5p4apyf67jqgpbvs47hcm-guile-git-0.12.1/share/guile/site/3.0" "-L" "/gnu/store/3xl1r2ppwspvhrlv4rzdcw3izhnvlkzm-guile-ssh-1.0.0/share/guile/site/3.0" "-L" "/gnu/store/dkzraln87ih1cbl36npg9fgyfqnmpqhh-guile-semver-0.2.0/share/guile/site/3.0" "-L" "/gnu/store/06k0pq8d20w6f3ymkgdwkm6k6rf2v7yj-guile-lib-0.2.8.1/share/guile/site/3.0" "-L" "/gnu/store/gl031z5csmpkyvicv8q4a3wjjgl5gqbi-guile-avahi-0.4.1/share/guile/site/3.0" "-L" "/gnu/store/k1yhnx32pjwr409ag3l25816ylasvzrf-guile-websocket-0.3.0/share/guile/site/3.0" "-L" "/gnu/store/c7k95lcd985bph7kycpjcwsbw0ky0yw1-guile-bstructs-0.2.0/share/guile/site/3.0" "-L" "/gnu/store/a7k8b77qmv34vjbw5gkgm160zph4lxlg-guile-webutils-0.1-1.d309d65/share/guile/site/3.0" "-L" "/gnu/store/cjnz2ikdas5ih7x2gs95fgi9q6f376gk-guile-bytestructures-2.0.2/share/guile/site/3.0" "-L" "/gnu/store/kwd8v8nwvw00d6akyr58d5bjqjcmfy5d-guile-irregex-0.9.12/share/guile/site/3.0" "-L" "/gnu/store/k7vkw9x3wl3lni6a0i2w8xz2z8ylrqyz-guile-3.0.11/share/guile/3.0" "-L" "/gnu/store/k7vkw9x3wl3lni6a0i2w8xz2z8ylrqyz-guile-3.0.11/share/guile/site/3.0" "-L" "/gnu/store/k7vkw9x3wl3lni6a0i2w8xz2z8ylrqyz-guile-3.0.11/share/guile/site" "-L" "/gnu/store/k7vkw9x3wl3lni6a0i2w8xz2z8ylrqyz-guile-3.0.11/share/guile" "-C" "/gnu/store/b15fw4d7rnky701dgbn6w8dd5mmmzjwm-guile-automate-0.0.0-dev/lib/guile/3.0/site-ccache" "-C" "/gnu/store/b15fw4d7rnky701dgbn6w8dd5mmmzjwm-guile-automate-0.0.0-dev/lib/guile/3.0/site-ccache/" "-C" "/gnu/store/r5gafvw9iapq6173liw37bzxj40bslhs-guile-documenta-0.4.0/lib/guile/3.0/site-ccache" "-C" "/gnu/store/r5gafvw9iapq6173liw37bzxj40bslhs-guile-documenta-0.4.0/share/guile/site/3.0" "-C" "/gnu/store/qzml053shmjml5vj6rbcfss5247h20f6-guile-syntax-highlight-0.3.1/lib/guile/3.0/site-ccache" "-C" "/gnu/store/qzml053shmjml5vj6rbcfss5247h20f6-guile-syntax-highlight-0.3.1/share/guile/site/3.0" "-C" "/gnu/store/7a6l3fzjvr3nvbnw579wdkhhszzzh3ql-guix-1.5.0-6.64d4de2/lib/guile/3.0/site-ccache" "-C" "/gnu/store/7a6l3fzjvr3nvbnw579wdkhhszzzh3ql-guix-1.5.0-6.64d4de2/share/guile/site/3.0" "-C" "/gnu/store/zplkplr3qmp5dpvhcxpgqr1lg44wmxyk-guile-goblins-0.18.0/lib/guile/3.0/site-ccache" "-C" "/gnu/store/zplkplr3qmp5dpvhcxpgqr1lg44wmxyk-guile-goblins-0.18.0/share/guile/site/3.0" "-C" "/gnu/store/5la7a0imnji190xnfmxf0jrsp82dn9hq-guile-fibers-1.4.3/lib/guile/3.0/site-ccache" "-C" "/gnu/store/5la7a0imnji190xnfmxf0jrsp82dn9hq-guile-fibers-1.4.3/share/guile/site/3.0" "-C" "/gnu/store/z4fnbwa7d6dprqvd7f89wcifq6ggr2wm-guile-gcrypt-0.5.0/lib/guile/3.0/site-ccache" "-C" "/gnu/store/z4fnbwa7d6dprqvd7f89wcifq6ggr2wm-guile-gcrypt-0.5.0/share/guile/site/3.0" "-C" "/gnu/store/b9928rpaj24whj9cz36yd1h28w7pwphq-guile-gnutls-5.0.2/lib/guile/3.0/site-ccache" "-C" "/gnu/store/b9928rpaj24whj9cz36yd1h28w7pwphq-guile-gnutls-5.0.2/share/guile/site/3.0" "-C" "/gnu/store/nw7d5iijwm9sa16k2swxjalgp0vlm01v-guile-json-4.7.3/lib/guile/3.0/site-ccache" "-C" "/gnu/store/nw7d5iijwm9sa16k2swxjalgp0vlm01v-guile-json-4.7.3/share/guile/site/3.0" "-C" "/gnu/store/gyf1hm3gzbq00aw3m9x1xickf3zs3pq8-guile-knots-0.1-39.3417d25/lib/guile/3.0/site-ccache" "-C" "/gnu/store/gyf1hm3gzbq00aw3m9x1xickf3zs3pq8-guile-knots-0.1-39.3417d25/share/guile/site/3.0" "-C" "/gnu/store/wsg7chjw2cg6xnp4il5caff5w0w69ikc-guile-sqlite3-0.1.3/lib/guile/3.0/site-ccache" "-C" "/gnu/store/wsg7chjw2cg6xnp4il5caff5w0w69ikc-guile-sqlite3-0.1.3/share/guile/site/3.0" "-C" "/gnu/store/8n90dzhz177l1lz8bjrxsgbiyh1kmjap-guile-zlib-0.2.2/lib/guile/3.0/site-ccache" "-C" "/gnu/store/8n90dzhz177l1lz8bjrxsgbiyh1kmjap-guile-zlib-0.2.2/share/guile/site/3.0" "-C" "/gnu/store/2qm9a3n19pnznv791jvglb4sgh1jda3s-guile-safsaf-0.5-1.8b35410/lib/guile/3.0/site-ccache" "-C" "/gnu/store/2qm9a3n19pnznv791jvglb4sgh1jda3s-guile-safsaf-0.5-1.8b35410/share/guile/site/3.0" "-C" "/gnu/store/9ia4lplmfhpdxnnkvk0zyhyainyn0r0q-guile-prometheus-0-11.8f70b4b/lib/guile/3.0/site-ccache" "-C" "/gnu/store/9ia4lplmfhpdxnnkvk0zyhyainyn0r0q-guile-prometheus-0-11.8f70b4b/share/guile/site/3.0" "-C" "/gnu/store/fp4rjwzvrm309wg11jahx8qcm7ypkai3-guile-ares-rs-0.9.8/lib/guile/3.0/site-ccache" "-C" "/gnu/store/fp4rjwzvrm309wg11jahx8qcm7ypkai3-guile-ares-rs-0.9.8/share/guile/site/3.0" "-C" "/gnu/store/hfx188ymz9y9ialr175lqifn3b6xfdnz-shepherd-1.0.9/lib/guile/3.0/site-ccache" "-C" "/gnu/store/hfx188ymz9y9ialr175lqifn3b6xfdnz-shepherd-1.0.9/share/guile/site/3.0" "-C" "/gnu/store/x9ypa71lzv9jrd5n0qxq51hxnra83z2x-guile-lib-0.2.8.1/lib/guile/3.0/site-ccache" "-C" "/gnu/store/x9ypa71lzv9jrd5n0qxq51hxnra83z2x-guile-lib-0.2.8.1/share/guile/site/3.0" "-C" "/gnu/store/9rd4c5w765bmsx0cimk0idpfasicvcdr-guile-config-0.5.1/lib/guile/3.0/site-ccache" "-C" "/gnu/store/9rd4c5w765bmsx0cimk0idpfasicvcdr-guile-config-0.5.1/share/guile/site/3.0" "-C" "/gnu/store/lsys62yw1wnmchmvv3q5x7bzkghyasil-guile-zstd-0.1.1/lib/guile/3.0/site-ccache" "-C" "/gnu/store/lsys62yw1wnmchmvv3q5x7bzkghyasil-guile-zstd-0.1.1/share/guile/site/3.0" "-C" "/gnu/store/gq36qbm22984252qxrzrgvrqzx807kd0-guile-lzlib-0.4.0/lib/guile/3.0/site-ccache" "-C" "/gnu/store/gq36qbm22984252qxrzrgvrqzx807kd0-guile-lzlib-0.4.0/share/guile/site/3.0" "-C" "/gnu/store/axcsnac5kji5p4apyf67jqgpbvs47hcm-guile-git-0.12.1/lib/guile/3.0/site-ccache" "-C" "/gnu/store/axcsnac5kji5p4apyf67jqgpbvs47hcm-guile-git-0.12.1/share/guile/site/3.0" "-C" "/gnu/store/3xl1r2ppwspvhrlv4rzdcw3izhnvlkzm-guile-ssh-1.0.0/lib/guile/3.0/site-ccache" "-C" "/gnu/store/3xl1r2ppwspvhrlv4rzdcw3izhnvlkzm-guile-ssh-1.0.0/share/guile/site/3.0" "-C" "/gnu/store/dkzraln87ih1cbl36npg9fgyfqnmpqhh-guile-semver-0.2.0/lib/guile/3.0/site-ccache" "-C" "/gnu/store/dkzraln87ih1cbl36npg9fgyfqnmpqhh-guile-semver-0.2.0/share/guile/site/3.0" "-C" "/gnu/store/06k0pq8d20w6f3ymkgdwkm6k6rf2v7yj-guile-lib-0.2.8.1/lib/guile/3.0/site-ccache" "-C" "/gnu/store/06k0pq8d20w6f3ymkgdwkm6k6rf2v7yj-guile-lib-0.2.8.1/share/guile/site/3.0" "-C" "/gnu/store/gl031z5csmpkyvicv8q4a3wjjgl5gqbi-guile-avahi-0.4.1/lib/guile/3.0/site-ccache" "-C" "/gnu/store/gl031z5csmpkyvicv8q4a3wjjgl5gqbi-guile-avahi-0.4.1/share/guile/site/3.0" "-C" "/gnu/store/k1yhnx32pjwr409ag3l25816ylasvzrf-guile-websocket-0.3.0/lib/guile/3.0/site-ccache" "-C" "/gnu/store/k1yhnx32pjwr409ag3l25816ylasvzrf-guile-websocket-0.3.0/share/guile/site/3.0" "-C" "/gnu/store/c7k95lcd985bph7kycpjcwsbw0ky0yw1-guile-bstructs-0.2.0/lib/guile/3.0/site-ccache" "-C" "/gnu/store/c7k95lcd985bph7kycpjcwsbw0ky0yw1-guile-bstructs-0.2.0/share/guile/site/3.0" "-C" "/gnu/store/a7k8b77qmv34vjbw5gkgm160zph4lxlg-guile-webutils-0.1-1.d309d65/share/guile/site/3.0" "-C" "/gnu/store/cjnz2ikdas5ih7x2gs95fgi9q6f376gk-guile-bytestructures-2.0.2/lib/guile/3.0/site-ccache" "-C" "/gnu/store/cjnz2ikdas5ih7x2gs95fgi9q6f376gk-guile-bytestructures-2.0.2/share/guile/site/3.0" "-C" "/gnu/store/kwd8v8nwvw00d6akyr58d5bjqjcmfy5d-guile-irregex-0.9.12/lib/guile/3.0/site-ccache" "-C" "/gnu/store/kwd8v8nwvw00d6akyr58d5bjqjcmfy5d-guile-irregex-0.9.12/share/guile/site/3.0" "-C" "/gnu/store/k7vkw9x3wl3lni6a0i2w8xz2z8ylrqyz-guile-3.0.11/lib/guile/3.0/ccache" "-C" "/gnu/store/k7vkw9x3wl3lni6a0i2w8xz2z8ylrqyz-guile-3.0.11/lib/guile/3.0/site-ccache" "/tmp/guix-build-guile-automate-0.0.0-dev.drv-0/automate-tests-B3XvhA/ps-daqkg6/bridge.scm")>. Service shepherd-bridge has been started. Successfully started 1 service in the background. attached to the pumphouse of /tmp/guix-build-guile-automate-0.0.0-dev.drv-0/automate-tests-B3XvhA/automate-pumphouse-ximQo0/any stop 1722: kill #<unspecified>, waitpid (1722 . 9) Stopping service root... Exiting shepherd... Stopping service shepherd-bridge... Service shepherd-bridge stopped. Service shepherd-bridge is now stopped. Exiting. (started quick) run 9860118bb0daa20e reported to the pumphouse (launched quick 1798) (provided quick value) (output quick value done) (finished quick succeeded) (retired quick) (exited quick 0) run succeeded quick: succeeded run-pipeline-daemon: error: --once names no pipeline of this program's definitions: "tests/absent" stop 1697: kill #<unspecified>, waitpid (1697 . 0) 17 passed, 0 failed == pumphouse-stopping.scm ;;; compiling /tmp/guix-build-guile-automate-0.0.0-dev.drv-0/source/tests/pumphouse-stopping.scm ;;; compiled /tmp/guix-build-guile-automate-0.0.0-dev.drv-0/source/.cache/guile/ccache/3.0-LE-8-4.7/tmp/guix-build-guile-automate-0.0.0-dev.drv-0/source/tests/pumphouse-stopping.scm.go http on port 41729 pumphouse listening on /tmp/guix-build-guile-automate-0.0.0-dev.drv-0/automate-tests-B3XvhA/automate-pumphouse-lRAFaR/socket admin: /tmp/guix-build-guile-automate-0.0.0-dev.drv-0/automate-tests-B3XvhA/automate-pumphouse-lRAFaR/admin remote admin: /tmp/guix-build-guile-automate-0.0.0-dev.drv-0/automate-tests-B3XvhA/automate-pumphouse-lRAFaR/remote-admin attached to the pumphouse of /tmp/guix-build-guile-automate-0.0.0-dev.drv-0/automate-tests-B3XvhA/automate-pumphouse-lRAFaR/any stopping: taking no more runs; 1 in flight attached to the pumphouse of /tmp/guix-build-guile-automate-0.0.0-dev.drv-0/automate-tests-B3XvhA/automate-pumphouse-lRAFaR/any stopping: taking no more runs; 1 in flight stopping: 1 still in flight at the deadline; aborting Goblins exception: In message to #<local-object ^pipeline-endpoint>: (run (run-request (id . "f2712a4cf871dc57") (parameters) (cause . #f) (ancestors))) ice-9/boot-9.scm:1705:22: In procedure raise-exception: ERROR: 1. &automate-error: kind: busy irritants: (tests/stopping/nap) 2. &message: "this process is stopping" 3. &irritants: (tests/stopping/nap) In goblins/core.scm: 1074:7 2 (syscaller-$ _ #<local-object ^pipeline-endpoint> (run (run-request (id . "f2712a4cf871dc57") (parameters) (cause . #f) (ancestors)))) In automate/model.scm: 119:2 1 (raise-automate-error _ _ . _) In ice-9/boot-9.scm: 1705:22 0 (raise-exception _ #:continuable? _) tests/stopping/nap run: this process is stopping: tests/stopping/nap Goblins exception: In message to #<local-object ^pipeline-endpoint>: (run (run-request (id . "f2712a4cf871dc57") (parameters) (cause . #f) (ancestors))) ice-9/boot-9.scm:1705:22: In procedure raise-exception: ERROR: 1. &automate-error: kind: busy irritants: (tests/stopping/nap) 2. &message: "this process is stopping" 3. &irritants: (tests/stopping/nap) In goblins/core.scm: 1074:7 2 (syscaller-$ _ #<local-object ^pipeline-endpoint> (run (run-request (id . "f2712a4cf871dc57") (parameters) (cause . #f) (ancestors)))) In automate/model.scm: 119:2 1 (raise-automate-error _ _ . _) In ice-9/boot-9.scm: 1705:22 0 (raise-exception _ #:continuable? _) tests/stopping/nap run: this process is stopping: tests/stopping/nap Goblins exception: In message to #<local-object fulfilled-handler>: (#t) ice-9/boot-9.scm:1705:22: In procedure raise-exception: ERROR: 1. &automate-error: kind: not-attached irritants: (tests/stopping/nap 1) 2. &message: "no pipeline process serving the pipeline's definition is attached" 3. &irritants: (tests/stopping/nap 1) In goblins/core.scm: 1074:7 3 (syscaller-$ _ #<local-object fulfilled-handler> (#t)) 2038:14 2 (_ . _) In automate/model.scm: 119:2 1 (raise-automate-error _ _ . _) In ice-9/boot-9.scm: 1705:22 0 (raise-exception _ #:continuable? _) admin run: no pipeline process serving the pipeline's definition is attached: tests/stopping/nap, 1 stop 1858: kill #<unspecified>, waitpid (1858 . 9) removstop 1867: kill #<unspecified>, waitpid (1867 . 9) run 407e8502d0a52398 reported to the pumphouse run errored linger: abandoned stop 1810: kill #<unspecified>, waitpid (1810 . 0) 20 passed, 0 failed == pumphouse-timers.scm ;;; compiling /tmp/guix-build-guile-automate-0.0.0-dev.drv-0/source/tests/pumphouse-timers.scm ;;; compiled /tmp/guix-build-guile-automate-0.0.0-dev.drv-0/source/.cache/guile/ccache/3.0-LE-8-4.7/tmp/guix-build-guile-automate-0.0.0-dev.drv-0/source/tests/pumphouse-timers.scm.go http on port 38737 pumphouse listening on /tmp/guix-build-guile-automate-0.0.0-dev.drv-0/automate-tests-B3XvhA/automate-pumphouse-SJGlaV/socket admin: /tmp/guix-build-guile-automate-0.0.0-dev.drv-0/automate-tests-B3XvhA/automate-pumphouse-SJGlaV/admin remote admin: /tmp/guix-build-guile-automate-0.0.0-dev.drv-0/automate-tests-B3XvhA/automate-pumphouse-SJGlaV/remote-admin attached to the pumphouse of /tmp/guix-build-guile-automate-0.0.0-dev.drv-0/automate-tests-B3XvhA/automate-pumphouse-SJGlaV/any 2026-10-14 19:32:13 (with-exception-handler) INFO: POST /output/0d7856d1779f531c/tick 200 7ms 2026-10-14 19:32:13 (with-exception-handler) INFO: POST /output/9b8744c1ed27d80b/tick 200 2ms Goblins exception: In message to #<local-object ^admin>: (pause tests/no-such-timer) ice-9/boot-9.scm:1705:22: In procedure raise-exception: ERROR: 1. &automate-error: kind: no-timer irritants: (tests/no-such-timer) 2. &message: "no timer of this name" 3. &irritants: (tests/no-such-timer) In goblins/core.scm: 1074:7 3 (syscaller-$ _ #<local-object ^admin> (pause tests/no-such-timer)) In automate/pumphouse.scm: 695:6 2 (pause _) In automate/model.scm: 119:2 1 (raise-automate-error _ _ . _) In ice-9/boot-9.scm: 1705:22 0 (raise-exception _ #:continuable? _) admin pause: no timer of this name: tests/no-such-timer Goblins exception: In message to #<local-object ^admin>: (pause tests/no-such-timer) ice-9/boot-9.scm:1705:22: In procedure raise-exception: ERROR: 1. &automate-error: kind: no-timer irritants: (tests/no-such-timer) 2. &message: "no timer of this name" 3. &irritants: (tests/no-such-timer) In goblins/core.scm: 1074:7 3 (syscaller-$ _ #<local-object ^admin> (pause tests/no-such-timer)) In automate/pumphouse.scm: 695:6 2 (pause _) In automate/model.scm: 119:2 1 (raise-automate-error _ _ . _) In ice-9/boot-9.scm: 1705:22 0 (raise-exception _ #:continuable? _) admin pause: no timer of this name: tests/no-such-timer Goblins exception: In message to #<local-object ^pipeline-endpoint>: (run (run-request (id . "e2cf6a394391bc3b") (parameters) (cause . #f) (ancestors))) ice-9/boot-9.scm:1705:22: In procedure raise-exception: ERROR: 1. &automate-error: kind: missing-parameter irritants: (n) 2. &message: "run request lacks a parameter" 3. &irritants: (n) In goblins/core.scm: 1074:7 4 (syscaller-$ _ #<local-object ^pipeline-endpoint> (run (run-request (id . "e2cf6a394391bc3b") (parameters) (cause . #f) (ancestors)))) In automate/pipeline/daemon.scm: 491:7 3 (run (run-request (id . "e2cf6a394391bc3b") (parameters) (cause . #f) (ancestors))) In srfi/srfi-1.scm: 750:9 2 (for-each #<procedure 7ffff42fbac0 at automate/pipeline.scm:1103:12 (entry)> ((param (name n)))) In automate/model.scm: 119:2 1 (raise-automate-error _ _ . _) In ice-9/boot-9.scm: 1705:22 0 (raise-exception _ #:continuable? _) tests/tick run: run request lacks a parameter: n admin run: run request lacks a parameter: n admin run: no answer in time: tests/hook lost the pumphouse; reconnecting attached to the pumphouse of /tmp/guix-build-guile-automate-0.0.0-dev.drv-0/automate-tests-B3XvhA/automate-pumphouse-SJGlaV/any stop 1899: kill #<unspecified>, waitpid (1899 . 9) stop 1889: kill #<unspecified>, waitpid (1889 . 0) 15 passed, 0 failed == pumphouse.scm ;;; compiling /tmp/guix-build-guile-automate-0.0.0-dev.drv-0/source/tests/pumphouse.scm ;;; compiled /tmp/guix-build-guile-automate-0.0.0-dev.drv-0/source/.cache/guile/ccache/3.0-LE-8-4.7/tmp/guix-build-guile-automate-0.0.0-dev.drv-0/source/tests/pumphouse.scm.go http on port 35027 pumphouse listening on /tmp/guix-build-guile-automate-0.0.0-dev.drv-0/automate-tests-B3XvhA/automate-pumphouse-zWaIYM/socket admin: /tmp/guix-build-guile-automate-0.0.0-dev.drv-0/automate-tests-B3XvhA/automate-pumphouse-zWaIYM/admin remote admin: /tmp/guix-build-guile-automate-0.0.0-dev.drv-0/automate-tests-B3XvhA/automate-pumphouse-zWaIYM/remote-admin attached to the pumphouse of /tmp/guix-build-guile-automate-0.0.0-dev.drv-0/automate-tests-B3XvhA/automate-pumphouse-zWaIYM/any Goblins exception: In message to #<local-object fulfilled-handler>: (((pipeline . tests/sum) (outcome . succeeded) (instance . "localhost"))) ice-9/boot-9.scm:1705:22: In procedure raise-exception: ERROR: 1. &automate-error: kind: invalid-request irritants: ("c57fb8aece61a3e1" tests/sum) 2. &message: "the run is of another pipeline" 3. &irritants: ("c57fb8aece61a3e1" tests/sum) In goblins/core.scm: 1074:7 3 (syscaller-$ _ #<local-object fulfilled-handler> (((pipeline . tests/sum) (outcome . succeeded) (instance . "localhost")))) 2038:14 2 (_ . _) In automate/model.scm: 119:2 1 (raise-automate-error _ _ . _) In ice-9/boot-9.scm: 1705:22 0 (raise-exception _ #:continuable? _) admin run: the run is of another pipeline: "c57fb8aece61a3e1", tests/sum Goblins exception: In message to #<local-object ^pipeline-endpoint>: (run (run-request (id . "93b60e64a647704c") (parameters) (cause . #f) (ancestors))) ice-9/boot-9.scm:1705:22: In procedure raise-exception: ERROR: 1. &automate-error: kind: missing-parameter irritants: (n) 2. &message: "run request lacks a parameter" 3. &irritants: (n) In goblins/core.scm: 1074:7 4 (syscaller-$ _ #<local-object ^pipeline-endpoint> (run (run-request (id . "93b60e64a647704c") (parameters) (cause . #f) (ancestors)))) In automate/pipeline/daemon.scm: 491:7 3 (run (run-request (id . "93b60e64a647704c") (parameters) (cause . #f) (ancestors))) In srfi/srfi-1.scm: 750:9 2 (for-each #<procedure 7fffe8e75940 at automate/pipeline.scm:1103:12 (entry)> ((param (name n)))) In automate/model.scm: 119:2 1 (raise-automate-error _ _ . _) In ice-9/boot-9.scm: 1705:22 0 (raise-exception _ #:continuable? _) tests/sum run: run request lacks a parameter: n admin run: run request lacks a parameter: n Goblins exception: In message to #<local-object ^call-with-vat>: ice-9/boot-9.scm:1705:22: In procedure raise-exception: ERROR: 1. &automate-error: kind: no-unix-socket irritants: ("/tmp/guix-build-guile-automate-0.0.0-dev.drv-0/automate-tests-B3XvhA/automate-pumphouse-zWaIYM/no-socket") 2. &message: "no pumphouse socket here; --unix-socket names another" 3. &irritants: ("/tmp/guix-build-guile-automate-0.0.0-dev.drv-0/automate-tests-B3XvhA/automate-pumphouse-zWaIYM/no-socket") In goblins/core.scm: 1074:7 4 (syscaller-$ _ #<local-object ^call-with-vat> ()) In unknown file: 3 (_ #<procedure list _>) In automate/pumphouse/client.scm: 168:7 2 (spawn-pumphouse-netlayer _ "/tmp/guix-build-guile-automate-0.0.0-dev.drv-0/automate-tests-B3XvhA/automate-pumphouse-zWaIYM/no-socket") In automate/model.scm: 119:2 1 (raise-automate-error _ _ . _) In ice-9/boot-9.scm: 1705:22 0 (raise-exception _ #:continuable? _) 2026-10-14 19:32:29 INFO: dropping a connection that failed to hand shake: #<&compound-exception components: (#<&error> #<&irritants irritants: (#<gnutls-error-enum The TLS connection was non-properly terminated.> handshake)> #<&exception-with-kind-and-args kind: gnutls-error args: (#<gnutls-error-enum The TLS connection was non-properly terminated.> handshake)>)> 2026-10-14 19:32:29 INFO: dropping a connection that failed to hand shake: #<&compound-exception components: (#<&external-error> #<&origin origin: "fport_write"> #<&message message: "~A"> #<&irritants irritants: ("Broken pipe")> #<&exception-with-kind-and-args kind: system-error args: ("fport_write" "~A" ("Broken pipe") (32))>)> 2026-10-14 19:32:29 INFO: dropping a connection that failed to hand shake: #<&compound-exception components: (#<&error> #<&irritants irritants: (#<gnutls-error-enum The TLS connection was non-properly terminated.> handshake)> #<&exception-with-kind-and-args kind: gnutls-error args: (#<gnutls-error-enum The TLS connection was non-properly terminated.> handshake)>)> Goblins exception: In message to #<local-object ^scoped-registrar>: (register tests/nap "localhost" "/tmp/guix-build-guile-automate-0.0.0-dev.drv-0/automate-tests-B3XvhA/automate-def-Uc7rgl" (structure (version 3) (name tests/nap) (steps ((step (name nap) (label #f) (group #f) (timeout #f) (error-permitted #f) (outputs (value)) (inputs ())))) (resources ()) (params ()) (outputs ()) (web-ui-options ())) #<remote-object> "ocapn://74zdwgwo7huas7ac5nzhjqjhnd2bsy7twswvzeqopju6vpka5ujq.tcp-tls/s/J-Jpp6vNAXRss50SQTAA-L_h5Q4aLek4OvfoUaGqJXs?" ()) ice-9/boot-9.scm:1705:22: In procedure raise-exception: ERROR: 1. &automate-error: kind: not-permitted irritants: (tests/nap (tests/only tests/scoped/)) 2. &message: "this registration does not cover the pipeline" 3. &irritants: (tests/nap (tests/only tests/scoped/)) In goblins/core.scm: 1074:7 3 (syscaller-$ _ #<local-object ^scoped-registrar> (register tests/nap "localhost" "/tmp/guix-build-guile-automate-0.0.0-dev.drv-0/automate-tests-B3XvhA/automate-def-Uc7rgl" (structure (version 3) (name tests/nap) (steps ((step (name nap) (label #f) (group #f) (timeout #f) (error-permitted #f) (outputs (value)) (inputs ())))) (resources ()) (params ()) (outputs ()) (web-ui-options ())) #<remote-object> "ocapn://74zdwgwo7huas7ac5nzhjqjhnd2bsy7twswvzeqopju6vpka5ujq.tcp-tls/s/J-Jp…" …)) In automate/pumphouse.scm: 552:6 2 (register tests/nap "localhost" "/tmp/guix-build-guile-automate-0.0.0-dev.drv-0/automate-tests-B3XvhA/automate-def-Uc7rgl" (structure (version 3) (name tests/nap) (steps ((step (name nap) (label #f) (group #f) (timeout #f) (error-permitted #f) (outputs (value)) (inputs ())))) (resources ()) (params ()) (outputs ()) (web-ui-options ())) #<remote-object> "ocapn://74zdwgwo7huas7ac5nzhjqjhnd2bsy7twswvzeqopju6vpka5ujq.tcp-tls/s/J-Jpp6vNAXRss50SQTAA-L_h5Q4aLek4OvfoUaGqJXs?" ()) In automate/model.scm: 119:2 1 (raise-automate-error _ _ . _) In ice-9/boot-9.scm: 1705:22 0 (raise-exception _ #:continuable? _) pumphouse refused tests/nap: Unknown error occurred with remote object attached to the pumphouse Goblins exception: In message to #<local-object ^admin>: (revoke (tests/nowhere) #f) ice-9/boot-9.scm:1705:22: In procedure raise-exception: ERROR: 1. &automate-error: kind: no-registration irritants: ((tests/nowhere) #f) 2. &message: "no registration of this scope" 3. &irritants: ((tests/nowhere) #f) In goblins/core.scm: 1074:7 2 (syscaller-$ _ #<local-object ^admin> (revoke (tests/nowhere) #f)) In automate/model.scm: 119:2 1 (raise-automate-error _ _ . _) In ice-9/boot-9.scm: 1705:22 0 (raise-exception _ #:continuable? _) admin revoke: no registration of this scope: (tests/nowhere), #f Goblins exception: In message to #<local-object fulfilled-handler>: (#t) ice-9/boot-9.scm:1705:22: In procedure raise-exception: ERROR: 1. &automate-error: kind: not-attached irritants: (tests/nowhere #f) 2. &message: "no pipeline process serving the pipeline's definition is attached" 3. &irritants: (tests/nowhere #f) In goblins/core.scm: 1074:7 3 (syscaller-$ _ #<local-object fulfilled-handler> (#t)) 2038:14 2 (_ . _) In automate/model.scm: 119:2 1 (raise-automate-error _ _ . _) In ice-9/boot-9.scm: 1705:22 0 (raise-exception _ #:continuable? _) admin run: no pipeline process serving the pipeline's definition is attached: tests/nowhere, #f 2026-10-14 19:32:37 (with-exception-handler) INFO: POST /output/5d305cde2b1a9f62/chatty 200 11ms 2026-10-14 19:32:38 (with-exception-handler) INFO: POST /output/197c1bdb25bce6a0/chatty 200 3ms run 197c1bdb25bce6a0 reported to the pumphouse run succeeded chatty: succeeded 2026-10-14 19:32:39 (with-exception-handler) INFO: GET /events/runs/7ea8d8b363c6de12 200 55ms 2026-10-14 19:32:39 (with-exception-handler) INFO: GET /events/runs/nothing 404 1ms 2026-10-14 19:32:39 (with-exception-handler) INFO: GET /health 200 3ms 2026-10-14 19:32:39 (with-exception-handler) INFO: GET / 200 27ms 2026-10-14 19:32:39 (with-exception-handler) INFO: GET /runs/5d305cde2b1a9f62 200 7ms 2026-10-14 19:32:39 (with-exception-handler) INFO: GET /runs/5d305cde2b1a9f62/steps/chatty 200 9ms GET /events/pumphouse: error replying to client 2026-10-14 19:32:39 (with-exception-handler) INFO: GET /events/pumphouse 200 incomplete 2026-10-14 19:32:41 (with-exception-handler) INFO: POST /output/395648aeba3ce79b/after 200 8ms 2026-10-14 19:32:46 (with-exception-handler) INFO: POST /webhook 202 28ms 2026-10-14 19:32:46 (with-exception-handler) INFO: POST /webhook 202 60ms 2026-10-14 19:32:46 (with-exception-handler) INFO: POST /hooks/other 202 3ms 2026-10-14 19:32:46 (with-exception-handler) INFO: POST /hooks/other 403 0ms 2026-10-14 19:32:46 (with-exception-handler) INFO: POST /webhook 403 0ms Goblins exception: In message to #<local-object ^session>: (abort "2b12ca8b1b3455de" "2b12ca8b1b3455de" "aborted") ice-9/boot-9.scm:1705:22: In procedure raise-exception: ERROR: 1. &automate-error: kind: not-permitted irritants: ("2b12ca8b1b3455de") 2. &message: "a run may not abort itself" 3. &irritants: ("2b12ca8b1b3455de") In goblins/core.scm: 1074:7 3 (syscaller-$ _ #<local-object ^session> (abort "2b12ca8b1b3455de" "2b12ca8b1b3455de" "aborted")) In automate/pumphouse.scm: 412:6 2 (abort "2b12ca8b1b3455de" "2b12ca8b1b3455de" "aborted") In automate/model.scm: 119:2 1 (raise-automate-error _ _ . _) In ice-9/boot-9.scm: 1705:22 0 (raise-exception _ #:continuable? _) session tests/stopper on localhost abort: a run may not abort itself: "2b12ca8b1b3455de" Goblins exception: In message to #<local-object ^session>: (abort "9db7c4f2bfd66d11" "9db7c4f2bfd66d11" "aborted") ice-9/boot-9.scm:1705:22: In procedure raise-exception: ERROR: 1. &automate-error: kind: not-permitted irritants: ("9db7c4f2bfd66d11") 2. &message: "a run may not abort itself" 3. &irritants: ("9db7c4f2bfd66d11") In goblins/core.scm: 1074:7 3 (syscaller-$ _ #<local-object ^session> (abort "9db7c4f2bfd66d11" "9db7c4f2bfd66d11" "aborted")) In automate/pumphouse.scm: 412:6 2 (abort "9db7c4f2bfd66d11" "9db7c4f2bfd66d11" "aborted") In automate/model.scm: 119:2 1 (raise-automate-error _ _ . _) In ice-9/boot-9.scm: 1705:22 0 (raise-exception _ #:continuable? _) session tests/stopper on localhost abort: a run may not abort itself: "9db7c4f2bfd66d11" stop 1992: kill #<unspecified>, waitpid (1992 . 9) stop 1955: kill #<unspecified>, waitpid (1955 . 9) stop 1945: kill #<unspecified>, waitpid (1945 . 0) 135 passed, 0 failed == reconnect.scm ;;; compiling /tmp/guix-build-guile-automate-0.0.0-dev.drv-0/source/tests/reconnect.scm ;;; compiled /tmp/guix-build-guile-automate-0.0.0-dev.drv-0/source/.cache/guile/ccache/3.0-LE-8-4.7/tmp/guix-build-guile-automate-0.0.0-dev.drv-0/source/tests/reconnect.scm.go pumphouse refused tests/one: not-permitted attached to the pumphouse lost the pumphouse; reconnecting attached to the pumphouse attached to the pumphouse lost the pumphouse; reconnecting attached to the pumphouse cannot reach the pumphouse; retrying every 0.1 seconds cannot reach the pumphouse; retrying every 0.1 seconds attached to the pumphouse cannot reach the pumphouse; retrying every 1 seconds not attached to the pumphouse for 1.5 seconds; giving up warning: mutating the process environment while multiple threads are running; further behavior unspecified. warning: mutating the process environment while multiple threads are running; further behavior unspecified. 29 passed, 0 failed == records.scm ;;; compiling /tmp/guix-build-guile-automate-0.0.0-dev.drv-0/source/tests/records.scm Error in IO handling wrapped resource #<input-output: socket 754>: #<&compound-exception components: (#<&external-error> #<&origin origin: "fport_read"> #<&message message: "~A"> #<&irritants irritants: ("Connection reset by peer")> #<&exception-with-kind-and-args kind: system-error args: ("fport_read" "~A" ("Connection reset by peer") (104))>)> In ice-9/boot-9.scm: 1778:15 22 (with-exception-handler #<procedure 7ffff577d810 at ice-9/boot-9.scm:1882:7 (exn)> _ #:unwind? _ #:unwind-for-type _) In fibers.scm: 164:13 21 (run-fibers _ #:hz _ #:scheduler _ #:parallelism _ #:cpus _ #:install-suspendable-ports? _ #:drain? _) 85:4 20 (%run-fibers _ _ _ _) In fibers/interrupts.scm: 98:4 19 (with-interrupts/thread-cputime _ _ _ _) In fibers/scheduler.scm: 380:26 18 (run-scheduler #<scheduler 7ffff0fb8f50 (remote-peers: (7ffff0fb8af0))> _) In ice-9/boot-9.scm: 1778:15 17 (with-exception-handler #<procedure 7ffff1224030 at ice-9/boot-9.scm:1882:7 (exn)> _ #:unwind? _ #:unwind-for-type _) 1784:12 16 (with-exception-handler _ _ #:unwind? _ #:unwind-for-type _) In fibers/scheduler.scm: 344:10 15 (next-task) In fibers.scm: 179:8 14 (_) In goblins/actor-lib/io.scm: 60:10 13 (_) 85:15 12 (_ _) In ice-9/boot-9.scm: 1784:12 11 (with-exception-handler _ _ #:unwind? _ #:unwind-for-type _) In goblins/actor-lib/io.scm: 70:18 10 (run-and-send) In ice-9/control.scm: 91:24 9 (call-with-escape-continuation _) In goblins/contrib/syrup.scm: 306:7 8 (read-next) In ice-9/suspendable-ports.scm: 558:2 7 (peek-char _) 159:2 6 (fill-input #<input-output: socket 754> _ _) 124:14 5 (maybe-consume-bom #vu8(239 187 191)) 221:2 4 (peek-byte _) 184:27 3 (fill-input #<input-output: socket 754> _ _) 72:4 2 (read-bytes #<input-output: socket 754> #vu8(46) 0 1) In unknown file: 1 (port-read #<input-output: socket 754> #vu8(46) 0 1) In ice-9/boot-9.scm: 1705:22 0 (raise-exception _ #:continuable? _) Uncaught exception in task: In fibers.scm: 179:8 15 (_) In goblins/actor-lib/io.scm: 60:10 14 (_) 85:15 13 (_ _) In ice-9/boot-9.scm: 1784:12 12 (with-exception-handler _ _ #:unwind? _ #:unwind-for-type _) In goblins/actor-lib/io.scm: 70:18 11 (run-and-send) In ice-9/control.scm: 91:24 10 (call-with-escape-continuation _) In goblins/contrib/syrup.scm: 306:7 9 (read-next) In ice-9/suspendable-ports.scm: 558:2 8 (peek-char _) 159:2 7 (fill-input #<input-output: socket 754> _ _) 124:14 6 (maybe-consume-bom #vu8(239 187 191)) 221:2 5 (peek-byte _) 184:27 4 (fill-input #<input-output: socket 754> _ _) 72:4 3 (read-bytes #<input-output: socket 754> #vu8(46) 0 1) In unknown file: 2 (port-read #<input-output: socket 754> #vu8(46) 0 1) In ice-9/boot-9.scm: 1706:22 1 (raise-exception _ #:continuable? _) 1705:22 0 (raise-exception _ #:continuable? _) ice-9/boot-9.scm:1705:22: In procedure raise-exception: ERROR: 1. &non-continuable ;;; compiled /tmp/guix-build-guile-automate-0.0.0-dev.drv-0/source/.cache/guile/ccache/3.0-LE-8-4.7/tmp/guix-build-guile-automate-0.0.0-dev.drv-0/source/tests/records.scm.go Goblins exception: In message to #<local-object ^records>: (pipelines) ice-9/boot-9.scm:1705:22: In procedure raise-exception: ERROR: 1. &automate-error: kind: records-closed irritants: (pipelines) 2. &message: "the pumphouse's records are closed" 3. &irritants: (pipelines) In goblins/core.scm: 1074:7 2 (syscaller-$ _ #<local-object ^records> (pipelines)) In automate/model.scm: 119:2 1 (raise-automate-error _ _ . _) In ice-9/boot-9.scm: 1705:22 0 (raise-exception _ #:continuable? _) 201 passed, 0 failed == relay.scm ;;; compiling /tmp/guix-build-guile-automate-0.0.0-dev.drv-0/source/tests/relay.scm ;;; compiled /tmp/guix-build-guile-automate-0.0.0-dev.drv-0/source/.cache/guile/ccache/3.0-LE-8-4.7/tmp/guix-build-guile-automate-0.0.0-dev.drv-0/source/tests/relay.scm.go Goblins exception: In message to #<local-object ^admin>: (repl relayed rollback start "other") ice-9/boot-9.scm:1705:22: In procedure raise-exception: ERROR: 1. &automate-error: kind: already-armed irritants: (relayed rollback) 2. &message: "a request for this step is armed already" 3. &irritants: (relayed rollback) In goblins/core.scm: 1074:7 3 (syscaller-$ _ #<local-object ^admin> (repl relayed rollback start "other")) In automate/pumphouse.scm: 859:4 2 (arm-repl! #<<pumphouse> records: #<local-object ^records> lives: #<hash-table 7fffb72286a0 1/31> serving: #<hash-table 7fffb7228680 1/31> owners: #<hash-table 7fffb7228660 0/31> shared: #<hash-table 7fffb7228640 0/31> gates: #<hash-table 7fffb7228620 0/31> stopped: #<hash-table 7fffb7228600 0/31> waiting: #<hash-table 7fffb72285e0 1/31> timers: #<hash-table 7fffb72285c0 0/31> tokens: #<hash-table 7fffb72285a0 0/31> registrations: #<hash-table 7fffb7228580 0/31> registrations-d…> …) In automate/model.scm: 119:2 1 (raise-automate-error _ _ . _) In ice-9/boot-9.scm: 1705:22 0 (raise-exception _ #:continuable? _) stopped at the start of this step resumed 15 passed, 0 failed == repl.scm ;;; compiling /tmp/guix-build-guile-automate-0.0.0-dev.drv-0/source/tests/repl.scm pipeline process gone: #<&compound-exception components: (#<&external-error> #<&origin origin: "connect"> #<&message message: "~A"> #<&irritants irritants: ("No such file or directory")> #<&exception-with-kind-and-args kind: system-error args: ("connect" "~A" ("No such file or directory") (2))>)>; exiting In goblins/vat.scm: 955:4 1 (call-with-vat #<vat id: 188 name: pipeline> #<procedure 7fffc4fbbf00 at automate/pipeline.scm:1057:10 ()>) In ice-9/boot-9.scm: 1705:22 0 (raise-exception _ #:continuable? _) ice-9/boot-9.scm:1705:22: In procedure raise-exception: vat is not running #<vat id: 188 name: pipeline> ;;; compiled /tmp/guix-build-guile-automate-0.0.0-dev.drv-0/source/.cache/guile/ccache/3.0-LE-8-4.7/tmp/guix-build-guile-automate-0.0.0-dev.drv-0/source/tests/repl.scm.go stopped at the start of this step resumed stopped at the start of this step resumed 17 passed, 0 failed == run-query.scm ;;; compiling /tmp/guix-build-guile-automate-0.0.0-dev.drv-0/source/tests/run-query.scm ;;; compiled /tmp/guix-build-guile-automate-0.0.0-dev.drv-0/source/.cache/guile/ccache/3.0-LE-8-4.7/tmp/guix-build-guile-automate-0.0.0-dev.drv-0/source/tests/run-query.scm.go 33 passed, 0 failed == scope.scm ;;; compiling /tmp/guix-build-guile-automate-0.0.0-dev.drv-0/source/tests/scope.scm ;;; compiled /tmp/guix-build-guile-automate-0.0.0-dev.drv-0/source/.cache/guile/ccache/3.0-LE-8-4.7/tmp/guix-build-guile-automate-0.0.0-dev.drv-0/source/tests/scope.scm.go 18 passed, 0 failed == shepherd-bridge.scm ;;; compiling /tmp/guix-build-guile-automate-0.0.0-dev.drv-0/source/tests/shepherd-bridge.scm ;;; compiled /tmp/guix-build-guile-automate-0.0.0-dev.drv-0/source/.cache/guile/ccache/3.0-LE-8-4.7/tmp/guix-build-guile-automate-0.0.0-dev.drv-0/source/tests/shepherd-bridge.scm.go shepherd client /tmp/guix-build-guile-automate-0.0.0-dev.drv-0/automate-tests-B3XvhA/automate-bridge-iqnSmE/daemon: (status register unregister) on (web-daemon other-daemon) shepherd client /tmp/guix-build-guile-automate-0.0.0-dev.drv-0/automate-tests-B3XvhA/automate-bridge-iqnSmE/secrets/web: (status restart) on (nginx) shepherd client /tmp/guix-build-guile-automate-0.0.0-dev.drv-0/automate-tests-B3XvhA/automate-bridge-iqnSmE/all: (status start stop restart load) on (nginx postgres ghost) shepherd bridge: listening on /tmp/guix-build-guile-automate-0.0.0-dev.drv-0/automate-tests-B3XvhA/automate-bridge-iqnSmE/bridge.sock for the Shepherd at /tmp/guix-build-guile-automate-0.0.0-dev.drv-0/automate-tests-B3XvhA/automate-bridge-iqnSmE/shepherd.sock web: status nginx web: restart nginx web: shepherd: restart nginx Goblins exception: In message to #<local-object ^shepherd-client>: (stop nginx) ice-9/boot-9.scm:1705:22: In procedure raise-exception: ERROR: 1. &automate-error: kind: not-permitted irritants: ("web" stop) 2. &message: "this shepherd client does not offer that action" 3. &irritants: ("web" stop) In goblins/core.scm: 1074:7 3 (syscaller-$ _ #<local-object ^shepherd-client> (stop nginx)) In automate/shepherd/bridge.scm: 223:6 2 (stop nginx) In automate/model.scm: 119:2 1 (raise-automate-error _ _ . _) In ice-9/boot-9.scm: 1705:22 0 (raise-exception _ #:continuable? _) shepherd client web stop: this shepherd client does not offer that action: "web", stop Goblins exception: In message to #<local-object ^shepherd-client>: (status postgres) ice-9/boot-9.scm:1705:22: In procedure raise-exception: ERROR: 1. &automate-error: kind: not-permitted irritants: ("web" postgres) 2. &message: "this shepherd client does not reach that service" 3. &irritants: ("web" postgres) all: status ghost In goblins/core.scm: 1074:7 3 (syscaller-$ _ #<local-object ^shepherd-client> (status postgres)) In automate/shepherd/bridge.scm: 227:6 2 (status postgres) In automate/model.scm: 119:2 1 (raise-automate-error _ _ . _) In ice-9/boot-9.scm: 1705:22 0 (raise-exception _ #:continuable? _) shepherd client web status: this shepherd client does not reach that service: "web", postgres Goblins exception: In message to #<local-object ^herd>: (action ghost status ()) ice-9/boot-9.scm:1705:22: In procedure raise-exception: ERROR: 1. &automate-error: kind: shepherd-error irritants: (ghost status (error (version 0) service-not-found ghost)) 2. &message: "the Shepherd has no service ghost" 3. &irritants: (ghost status (error (version 0) service-not-found ghost)) In goblins/core.scm: 1074:7 4 (syscaller-$ _ #<local-object ^herd> (action ghost status ())) In automate/shepherd/bridge.scm: 188:28 3 (action _ _ _) In automate/shepherd/herd.scm: 124:11 2 (herd-action _ _ _ _) In automate/model.scm: 119:2 1 (raise-automate-error _ _ . _) In ice-9/boot-9.scm: 1705:22 0 (raise-exception _ #:continuable? _) shepherd client all status: the Shepherd has no service ghost: ghost, status, (error (version 0) service-not-found ghost) Goblins exception: In message to #<local-object ^shepherd-client>: (load "/tmp/guix-build-guile-automate-0.0.0-dev.drv-0/automate-tests-B3XvhA/automate-bridge-iqnSmE/store/x.scm") ice-9/boot-9.scm:1705:22: In procedure raise-exception: ERROR: 1. &automate-error: kind: not-permitted irritants: ("web") 2. &message: "this shepherd client does not offer loading" 3. &irritants: ("web") In goblins/core.scm: 1074:7 3 (syscaller-$ _ #<local-object ^shepherd-client> (load "/tmp/guix-build-guile-automate-0.0.0-dev.drv-0/automate-tests-B3XvhA/automate-bridge-iqnSmE/store/x.scm")) In automate/shepherd/bridge.scm: 253:6 2 (load "/tmp/guix-build-guile-automate-0.0.0-dev.drv-0/automate-tests-B3XvhA/automate-bridge-iqnSmE/store/x.scm") In automate/model.scm: 119:2 1 (raise-automate-error _ _ . _) In ice-9/boot-9.scm: 1705:22 0 (raise-exception _ #:continuable? _) shepherd client web load: this shepherd client does not offer loading: "web" Goblins exception: In message to #<local-object ^shepherd-client>: (load "/etc/shepherd.scm") ice-9/boot-9.scm:1705:22: In procedure raise-exception: ERROR: 1. &automate-error: kind: not-permitted irritants: ("/etc/shepherd.scm" "/tmp/guix-build-guile-automate-0.0.0-dev.drv-0/automate-tests-B3XvhA/automate-bridge-iqnSmE/store") 2. &message: "a shepherd client loads files in the store alone" 3. &irritants: ("/etc/shepherd.scm" "/tmp/guix-build-guile-automate-0.0.0-dev.drv-0/automate-tests-B3XvhA/automate-bridge-iqnSmE/store") all: load root ("/tmp/guix-build-guile-automate-0.0.0-dev.drv-0/automate-tests-B3XvhA/automate-bridge-iqnSmE/store/services.scm") all: shepherd: loaded daemon: load root ("/tmp/guix-build-guile-automate-0.0.0-dev.drv-0/automate-tests-B3XvhA/automate-bridge-iqnSmE/services/web-daemon.scm") daemon: shepherd: loaded daemon: status web-daemon daemon: start web-daemon daemon: status web-daemon daemon: status web-daemon daemon: load root ("/tmp/guix-build-guile-automate-0.0.0-dev.drv-0/automate-tests-B3XvhA/automate-bridge-iqnSmE/services/web-daemon.scm") daemon: shepherd: loaded daemon: status web-daemon daemon: load root ("/tmp/guix-build-guile-automate-0.0.0-dev.drv-0/automate-tests-B3XvhA/automate-bridge-iqnSmE/services/web-daemon.scm") daemon: shepherd: loaded daemon: status web-daemon daemon: load root ("/tmp/guix-build-guile-automate-0.0.0-dev.drv-0/automate-tests-B3XvhA/automate-bridge-iqnSmE/services/web-daemon.scm") daemon: shepherd: loaded daemon: status web-daemon In goblins/core.scm: 1074:7 3 (syscaller-$ _ #<local-object ^shepherd-client> (load "/etc/shepherd.scm")) In automate/shepherd/bridge.scm: 205:4 2 (load "/etc/shepherd.scm") In automate/model.scm: 119:2 1 (raise-automate-error _ _ . _) In ice-9/boot-9.scm: 1705:22 0 (raise-exception _ #:continuable? _) shepherd client all load: a shepherd client loads files in the store alone: "/etc/shepherd.scm", "/tmp/guix-build-guile-automate-0.0.0-dev.drv-0/automate-tests-B3XvhA/automate-bridge-iqnSmE/store" Goblins exception: In message to #<local-object ^shepherd-client>: (register nginx "/gnu/store/x" #f) ice-9/boot-9.scm:1705:22: In procedure raise-exception: ERROR: 1. &automate-error: kind: not-permitted irritants: ("daemon" nginx) 2. &message: "this shepherd client does not reach that service" 3. &irritants: ("daemon" nginx) In goblins/core.scm: 1074:7 3 (syscaller-$ _ #<local-object ^shepherd-client> (register nginx "/gnu/store/x" #f)) In automate/shepherd/bridge.scm: 227:6 2 (register nginx "/gnu/store/x" #f) In automate/model.scm: 119:2 1 (raise-automate-error _ _ . _) In ice-9/boot-9.scm: 1705:22 0 (raise-exception _ #:continuable? _) shepherd client daemon register: this shepherd client does not reach that service: "daemon", nginx Goblins exception: In message to #<local-object ^shepherd-client>: (register web-daemon "/gnu/store/x" #f) ice-9/boot-9.scm:1705:22: In procedure raise-exception: ERROR: 1. &automate-error: kind: not-permitted irritants: ("all" register) 2. &message: "this shepherd client does not offer that action" 3. &irritants: ("all" register) daemon: unload root ("web-daemon") In goblins/core.scm: 1074:7 3 (syscaller-$ _ #<local-object ^shepherd-client> (register web-daemon "/gnu/store/x" #f)) In automate/shepherd/bridge.scm: 223:6 2 (register web-daemon "/gnu/store/x" #f) In automate/model.scm: 119:2 1 (raise-automate-error _ _ . _) In ice-9/boot-9.scm: 1705:22 0 (raise-exception _ #:continuable? _) shepherd client all register: this shepherd client does not offer that action: "all", register Goblins exception: In message to #<local-object ^shepherd-client>: (stop nginx) ice-9/boot-9.scm:1705:22: In procedure raise-exception: ERROR: 1. &automate-error: kind: not-permitted irritants: ("web" stop) 2. &message: "this shepherd client does not offer that action" 3. &irritants: ("web" stop) web: restart nginx web: shepherd: restart nginx web: status nginx stopping In goblins/core.scm: 1074:7 3 (syscaller-$ _ #<local-object ^shepherd-client> (stop nginx)) In automate/shepherd/bridge.scm: 223:6 2 (stop nginx) In automate/model.scm: 119:2 1 (raise-automate-error _ _ . _) In ice-9/boot-9.scm: 1705:22 0 (raise-exception _ #:continuable? _) shepherd client web stop: this shepherd client does not offer that action: "web", stop 44 passed, 0 failed == source.scm ;;; compiling /tmp/guix-build-guile-automate-0.0.0-dev.drv-0/source/tests/source.scm ;;; compiled /tmp/guix-build-guile-automate-0.0.0-dev.drv-0/source/.cache/guile/ccache/3.0-LE-8-4.7/tmp/guix-build-guile-automate-0.0.0-dev.drv-0/source/tests/source.scm.go In execvp of git: No such file or directory git is not installed, so the resolving tests are skipped 20 passed, 0 failed == step-scheduling.scm ;;; compiling /tmp/guix-build-guile-automate-0.0.0-dev.drv-0/source/tests/step-scheduling.scm ;;; compiled /tmp/guix-build-guile-automate-0.0.0-dev.drv-0/source/.cache/guile/ccache/3.0-LE-8-4.7/tmp/guix-build-guile-automate-0.0.0-dev.drv-0/source/tests/step-scheduling.scm.go 45 passed, 0 failed == uploader.scm ;;; compiling /tmp/guix-build-guile-automate-0.0.0-dev.drv-0/source/tests/uploader.scm ;;; compiled /tmp/guix-build-guile-automate-0.0.0-dev.drv-0/source/.cache/guile/ccache/3.0-LE-8-4.7/tmp/guix-build-guile-automate-0.0.0-dev.drv-0/source/tests/uploader.scm.go 2026-10-14 19:33:18 (with-exception-handler) INFO: POST /output/run-1/build 200 1ms 2026-10-14 19:33:18 (with-exception-handler) INFO: POST /output/run-1/build 200 1ms 2026-10-14 19:33:18 (with-exception-handler) INFO: POST /output/run-2/zz-tail 200 2ms 2026-10-14 19:33:18 (with-exception-handler) INFO: POST /output/run-2/a-last 200 2ms 2026-10-14 19:33:19 (with-exception-handler) INFO: POST /output/run-3/timed 200 1ms 2026-10-14 19:33:19 (with-exception-handler) INFO: POST /output/run-3/untimed 200 1ms 2026-10-14 19:33:19 (with-exception-handler) INFO: POST /output/run-3/timed 200 0ms 15 passed, 0 failed error: in phase 'check': uncaught exception: %exception #<&invoke-error program: "guile" arguments: ("-L" "." "tests/run.scm") exit-status: 1 term-signal: #f stop-signal: #f> phase `check' failed after 307.7 seconds sh: warning: setlocale: LC_ALL: cannot change locale (C.UTF-8): No such file or directory command "guile" "-L" "." "tests/run.scm" failed with status 1 build process 4 exited with status 256 builder for `/gnu/store/rdb144ix3dpqw15ffyyksvqsw818pfhj-guile-automate-0.0.0-dev.drv' failed with exit code 1 build of /gnu/store/rdb144ix3dpqw15ffyyksvqsw818pfhj-guile-automate-0.0.0-dev.drv failed Could not find build log for '/gnu/store/rdb144ix3dpqw15ffyyksvqsw818pfhj-guile-automate-0.0.0-dev.drv'. guix build: error: build of `/gnu/store/rdb144ix3dpqw15ffyyksvqsw818pfhj-guile-automate-0.0.0-dev.drv' failed error: the package did not build, or the channel has no package of that name; Guix's messages are in the step's log kind: build-failed irritants: "guile-automate" "/home/chris/pipeline-shepherd/state/work/automate-pipelines/automate-tbdYWg/automate-work-Bdjwb0/workspace/channel" backtrace: automate/pipeline/step.scm:675:62 (_) automate/helpers/guix.scm:259:17 (build-channel-package) automate/helpers/guix.scm:224:6 (build-in-channel)