fd653eb4351ee6b9 / check errored

Defined at .automate/pipelines.scm:154

Making check in .
make[1]: Entering directory '/home/chris/automate.cbaines.net/guile-automate/checks/workspace/fd653eb4351ee6b9/work/source'
make  check-TESTS
make[2]: Entering directory '/home/chris/automate.cbaines.net/guile-automate/checks/workspace/fd653eb4351ee6b9/work/source'
make[3]: Entering directory '/home/chris/automate.cbaines.net/guile-automate/checks/workspace/fd653eb4351ee6b9/work/source'
PASS: tests/check.scm
PASS: tests/contain.scm
PASS: tests/errors.scm
PASS: tests/events.scm
PASS: tests/forgejo.scm
PASS: tests/http.scm
PASS: tests/layout.scm
PASS: tests/masking.scm
PASS: tests/metrics.scm
PASS: tests/pages.scm
PASS: tests/model.scm
PASS: tests/pipeline.scm
FAIL: tests/pumphouse.scm
PASS: tests/records.scm
PASS: tests/scope.scm
PASS: tests/source.scm
PASS: tests/step-scheduling.scm
PASS: tests/uploader.scm
================================================
   guile-automate 0.0.0-dev: ./test-suite.log
================================================

# TOTAL: 18
# PASS:  17
# SKIP:  0
# XFAIL: 0
# FAIL:  1
# XPASS: 0
# ERROR: 0

System information (uname -a): Linux 6.18.13-gnu #1 SMP PREEMPT_DYNAMIC 1 x86_64

.. contents:: :depth: 2

FAIL: tests/pumphouse
=====================

http on port 46075
pumphouse address: /tmp/automate-pumphouse-AeNLGO/address
remote registrar: ocapn://impgavhtqi3p34u76pd4ncqbpwfy26cbt7x46erwt4qruuaahhha.tcp-tls/s/frhDru5vg_dZ7aHfUMx6TYLnCnnhVCi23-Vy31jFTjk?port=60217&host=%3A%3A1
remote admin: ocapn://impgavhtqi3p34u76pd4ncqbpwfy26cbt7x46erwt4qruuaahhha.tcp-tls/s/Udj9GgJ8f2cz7ig-VDH0L9hiVXlOvElBJSCovBtitFo?port=60217&host=%3A%3A1
warning: steps run unconfined: this command cannot run itself again as guile
attached to pumphouse /tmp/automate-pumphouse-AeNLGO/address
2026-09-20 22:48:44 (with-exception-handler) INFO: POST /output/4e6b6b908b5dbfaa/tick 200 54ms

Goblins exception:
In message to #<local-object ^admin>:
  (run tests/nothing (run-request (id . "09617bbb6b362abf") (parameters (n . 5)) (cause . #f) (ancestors)))
ice-9/boot-9.scm:1705:22: In procedure raise-exception:
ERROR:
  1. &automate-error:
      kind: not-attached
      irritants: (tests/nothing #f)
  2. &message: "no pipeline process is attached under this name"
  3. &irritants: (tests/nothing #f)
warning: mutating the process environment while multiple threads are running;
         further behavior unspecified.
In goblins/core.scm:
   1074:7  4 (syscaller-$ _ #<local-object ^admin> (run tests/nothing (run-request (id . "09617bbb6b362abf") (parameters (n . 5)) (cause . #f) (ancestors))))
In automate/pumphouse.scm:
   136:15  3 (request-run! #<<pumphouse> records: #<local-object ^records> lives: #<hash-table 7febbd29cca0 9/31> shared: #<hash-table 7febbd29cc80 0/31> gates: #<hash-table 7febbd29cc60 0/31> timers: #<hash-table 7febbd29cc40 1/31> tokens: #<hash-table 7febbd29cc20 9/31> registrations: #<hash-table 7febbd29cc00 0/31> sink: "http://127.0.0.1:46075/output" web: "http://127.0.0.1:46075" publish: #<procedure 7febbd3cbe80 at automate/pumphouse/process.scm:129:2 (object swiss-num)>> tests/nothing #)
     99:6  2 (live-of _ _)
In automate/model.scm:
     83:2  1 (raise-automate-error _ _ . _)
In ice-9/boot-9.scm:
  1705:22  0 (raise-exception _ #:continuable? _)

2026-09-20 22:48:45 (with-exception-handler) INFO: POST /output/fb627a445ff5a942/tick 200 10ms
2026-09-20 22:48:45 (with-exception-handler) INFO: POST /output/e5345ef0d5733cbf/tick 200 13ms
2026-09-20 22:48:45 (with-exception-handler) INFO: POST /output/94740dcecf42e174/tick 200 12ms
2026-09-20 22:48:45 (with-exception-handler) INFO: POST /output/1d0ead7d59e57ba5/tick 200 7ms
2026-09-20 22:48:45 (with-exception-handler) INFO: POST /output/df08edd009e52b8b/tick 200 3ms
2026-09-20 22:48:45 INFO: dropping a connection that failed to hand shake: #<&compound-exception components: (#<&error> #<&irritants irritants: (#<gnutls-error-enum Error in the pull function.> handshake)> #<&exception-with-kind-and-args kind: gnutls-error args: (#<gnutls-error-enum Error in the pull function.> handshake)>)>
2026-09-20 22:48:46 INFO: dropping a connection that failed to hand shake: #<&compound-exception components: (#<&external-error> #<&origin origin: "fport_write"> #<&message message: "~A"> #<&irritants irritants: ("Broken pipe")> #<&exception-with-kind-and-args kind: system-error args: ("fport_write" "~A" ("Broken pipe") (32))>)>
2026-09-20 22:48:46 INFO: dropping a connection that failed to hand shake: #<&compound-exception components: (#<&error> #<&irritants irritants: (#<gnutls-error-enum The TLS connection was non-properly terminated.> handshake)> #<&exception-with-kind-and-args kind: gnutls-error args: (#<gnutls-error-enum The TLS connection was non-properly terminated.> handshake)>)>

Goblins exception:
In message to #<local-object ^records>:
  (registration (/) 1789940926)
ice-9/boot-9.scm:1705:22: In procedure raise-exception:
ERROR:
  1. &automate-error:
      kind: invalid-scope
      irritants: ((/))
  2. &message: "not a list of pipeline names and prefixes"
  3. &irritants: ((/))
In goblins/core.scm:
   1074:7  5 (syscaller-$ _ #<local-object ^records> (registration (/) 1789940926))
In unknown file:
           4 (_ #<procedure cons (_ _)>)
In automate/pumphouse/datastore.scm:
   335:15  3 (datastore-registration! #<<datastore> directory: "/tmp/automate-pumphouse-AeNLGO" pumphouse: #<<sqlite-db> pointer: #<pointer 0x7febb0001818> open?: #t stmts: #<hash-table 7febbd2e5d40 17/31>> pipelines: #<hash-table 7febbd2e5860 9/31>> (/) 1789940926)
In automate/pumphouse/scope.scm:
     44:4  2 (canonical-scope (/))
In automate/model.scm:
     83:2  1 (raise-automate-error _ _ . _)
In ice-9/boot-9.scm:
  1705:22  0 (raise-exception _ #:continuable? _)

2026-09-20 22:48:46 (with-exception-handler) INFO: POST /output/bbbaeab135552cd1/tick 200 26ms
2026-09-20 22:48:46 (with-exception-handler) INFO: POST /output/f055c53aef4e853d/tick 200 11ms
2026-09-20 22:48:46 (with-exception-handler) INFO: POST /output/b7ddc68aa85596bc/tick 200 9ms
2026-09-20 22:48:47 (with-exception-handler) INFO: POST /output/810708b0efc97545/tick 200 15ms
2026-09-20 22:48:47 (with-exception-handler) INFO: POST /output/1a55df24a07c020e/tick 200 7ms
2026-09-20 22:48:47 (with-exception-handler) INFO: POST /output/3df98cad523e9bc1/tick 200 8ms
warning: steps run unconfined: this command cannot run itself again as guile
2026-09-20 22:48:48 (with-exception-handler) INFO: POST /output/81bef443597f95ca/tick 200 13ms
2026-09-20 22:48:48 (with-exception-handler) INFO: POST /output/6559579ed2436adc/tick 200 11ms
2026-09-20 22:48:48 (with-exception-handler) INFO: POST /output/818d6ff0e9ba18f4/tick 200 8ms
2026-09-20 22:48:48 (with-exception-handler) INFO: POST /output/6224d9d66cfda345/tick 200 15ms

Goblins exception:
In message to #<local-object ^scoped-registrar>:
  (register tests/nap "/tmp/automate-def-zH1zEr" (structure (version 2) (name tests/nap) (steps ((step (name nap) (label #f) (group #f) (timeout #f) (error-permitted #f) (outputs (value)) (inputs ())))) (resources ()) (params ()) (web-ui-options ())) #<remote-object> "ocapn://zf6dl6eslbm2mmrdvbhphbg4wb4guvyamein3myejxlwwdoyzu7q.tcp-tls/s/RQKYSO12fXnfUqzzjlzPVCA5sXrbfjKRn_sfkGQDTro?" ())
ice-9/boot-9.scm:1705:22: In procedure raise-exception:
ERROR:
  1. &automate-error:
      kind: not-permitted
      irritants: (tests/nap (tests/only tests/scoped/))
  2. &message: "this registration does not cover the pipeline"
  3. &irritants: (tests/nap (tests/only tests/scoped/))
In goblins/core.scm:
   1074:7  3 (syscaller-$ _ #<local-object ^scoped-registrar> (register tests/nap "/tmp/automate-def-zH1zEr" (structure (version 2) (name tests/nap) (steps ((step (name nap) (label #f) (group #f) (timeout #f) (error-permitted #f) (outputs (value)) (inputs ())))) (resources ()) (params ()) (web-ui-options ())) #<remote-object> "ocapn://zf6dl6eslbm2mmrdvbhphbg4wb4guvyamein3myejxlwwdoyzu7q.tcp-tls/s/RQKYSO12fXnfUqzzjlzPVCA5sXrbfjKRn_sfkGQDTro?" ()))
In automate/pumphouse.scm:
    296:6  2 (register tests/nap "/tmp/automate-def-zH1zEr" (structure (version 2) (name tests/nap) (steps ((step (name nap) (label #f) (group #f) (timeout #f) (error-permitted #f) (outputs (value)) (inputs ())))) (resources ()) (params ()) (web-ui-options ())) #<remote-object> "ocapn://zf6dl6eslbm2mmrdvbhphbg4wb4guvyamein3myejxlwwdoyzu7q.tcp-tls/s/RQKYSO12fXnfUqzzjlzPVCA5sXrbfjKRn_sfkGQDTro?" ())
In automate/model.scm:
     83:2  1 (raise-automate-error _ _ . _)
In ice-9/boot-9.scm:
  1705:22  0 (raise-exception _ #:continuable? _)

pumphouse refused tests/nap: Unknown error occurred with remote object
attached to pumphouse ocapn://impgavhtqi3p34u76pd4ncqbpwfy26cbt7x46erwt4qruuaahhha.tcp-tls/s/Jqy16tS9fn6PIw81zO-3DC-idz8E1a-wt1ektM9wYP0?port=60217&host=%3A%3A1
2026-09-20 22:48:49 (with-exception-handler) INFO: POST /output/01b91f1e86f25855/tick 200 4ms
2026-09-20 22:48:49 (with-exception-handler) INFO: POST /output/46c1fa9ebefdc741/tick 200 11ms
2026-09-20 22:48:49 (with-exception-handler) INFO: POST /output/17e18d08bc5d1126/tick 200 12ms
2026-09-20 22:48:49 (with-exception-handler) INFO: POST /output/45f5bddab0688e71/tick 200 19ms
2026-09-20 22:48:49 (with-exception-handler) INFO: POST /output/83791164889200a6/tick 200 4ms
2026-09-20 22:48:49 (with-exception-handler) INFO: POST /output/4c34d44d629b5382/tick 200 12ms
2026-09-20 22:48:50 (with-exception-handler) INFO: POST /output/761e2f4c4d2b6da9/tick 200 18ms
2026-09-20 22:48:50 (with-exception-handler) INFO: POST /output/1dc73a371111bd1b/tick 200 13ms
2026-09-20 22:48:50 (with-exception-handler) INFO: POST /output/9829bc6e1a87be87/tick 200 11ms
2026-09-20 22:48:50 (with-exception-handler) INFO: POST /output/1c6d9416401d2b5f/tick 200 18ms
2026-09-20 22:48:51 (with-exception-handler) INFO: POST /output/fa24b9472ca09559/tick 200 18ms
2026-09-20 22:48:51 (with-exception-handler) INFO: POST /output/f652e8f728998a92/tick 200 20ms
2026-09-20 22:48:51 (with-exception-handler) INFO: POST /output/5429ac60004634d5/tick 200 8ms
2026-09-20 22:48:51 (with-exception-handler) INFO: POST /output/36a6387ae3de264d/tick 200 3ms
2026-09-20 22:48:51 (with-exception-handler) INFO: POST /output/b48f31695c790aa3/tick 200 9ms
2026-09-20 22:48:52 (with-exception-handler) INFO: POST /output/68e75812933be5f4/tick 200 11ms
2026-09-20 22:48:52 (with-exception-handler) INFO: POST /output/b1ecd1e46e1d5dbb/tick 200 27ms
2026-09-20 22:48:52 (with-exception-handler) INFO: POST /output/7a53a0ecf5baf01f/tick 200 8ms
2026-09-20 22:48:52 (with-exception-handler) INFO: POST /output/683b1c232a5bac5d/tick 200 9ms
2026-09-20 22:48:52 (with-exception-handler) INFO: POST /output/d37654a2cdefedc7/tick 200 14ms
2026-09-20 22:48:52 (with-exception-handler) INFO: POST /output/60f88ab3150c56f2/tick 200 17ms
2026-09-20 22:48:52 (with-exception-handler) INFO: POST /output/6fbe4706dc7c5793/tick 200 68ms
2026-09-20 22:48:53 (with-exception-handler) INFO: POST /output/fc967640769dd751/tick 200 30ms
2026-09-20 22:48:53 (with-exception-handler) INFO: POST /output/00cd272485fd1da0/tick 200 14ms
2026-09-20 22:48:53 (with-exception-handler) INFO: POST /output/dd54a0b0edf32a94/chatty 200 10ms
2026-09-20 22:48:53 (with-exception-handler) INFO: POST /output/cde7c798bc79e2f6/tick 200 2ms
2026-09-20 22:48:53 (with-exception-handler) INFO: POST /output/fbca7526fc8d1d0a/tick 200 17ms
2026-09-20 22:48:54 (with-exception-handler) INFO: POST /output/e0fa49f91b599553/tick 200 3ms
2026-09-20 22:48:54 (with-exception-handler) INFO: POST /output/f7c1109e3682fb9d/tick 200 14ms
2026-09-20 22:48:54 (with-exception-handler) INFO: POST /output/53ba9eee20848d7d/tick 200 8ms
2026-09-20 22:48:54 (with-exception-handler) INFO: POST /output/1f6fd286167173c5/tick 200 5ms
2026-09-20 22:48:54 (with-exception-handler) INFO: POST /output/27d1c7c28d417b25/tick 200 9ms
2026-09-20 22:48:54 (with-exception-handler) INFO: POST /output/664cc44320447f44/tick 200 6ms
2026-09-20 22:48:55 (with-exception-handler) INFO: POST /output/1095be8930e89373/chatty 200 20ms
run 1095be8930e89373 reported to /tmp/automate-pumphouse-AeNLGO/address
run succeeded
  chatty: succeeded
2026-09-20 22:48:56 (with-exception-handler) INFO: POST /output/235423ef34852c85/tick 200 5ms
2026-09-20 22:48:56 (with-exception-handler) INFO: POST /output/5859a0e1f13659a8/tick 200 3ms
2026-09-20 22:48:56 (with-exception-handler) INFO: POST /output/75e7b31806d47932/tick 200 2ms
2026-09-20 22:48:56 (with-exception-handler) INFO: POST /output/6e6b188ca8f1fb47/tick 200 81ms
2026-09-20 22:48:56 (with-exception-handler) INFO: POST /output/7ee94652f797a133/tick 200 14ms
2026-09-20 22:48:56 (with-exception-handler) INFO: POST /output/4ca9fd523d435d57/tick 200 9ms
2026-09-20 22:48:57 (with-exception-handler) INFO: GET /events/runs/e5e0dab9af4aacea 200 190ms
GET /events/pumphouse: error replying to client
2026-09-20 22:48:57 (with-exception-handler) INFO: GET /events/pumphouse 200 incomplete
2026-09-20 22:48:57 (with-exception-handler) INFO: GET /events/runs/nothing 404 4ms
2026-09-20 22:48:57 (with-exception-handler) INFO: POST /output/0dbe9f853fe1b690/tick 200 81ms
2026-09-20 22:48:57 (with-exception-handler) INFO: GET / 200 253ms
2026-09-20 22:48:57 (with-exception-handler) INFO: POST /output/79bce2b122111dcb/tick 200 22ms
2026-09-20 22:48:57 (with-exception-handler) INFO: GET /runs/dd54a0b0edf32a94 200 13ms
2026-09-20 22:48:57 (with-exception-handler) INFO: POST /output/f8d2647c46fd6c8a/tick 200 17ms
2026-09-20 22:48:57 (with-exception-handler) INFO: POST /output/cac041c094f06d40/tick 200 12ms
2026-09-20 22:48:57 (with-exception-handler) INFO: GET /runs/dd54a0b0edf32a94/steps/chatty 200 17ms
2026-09-20 22:48:57 (with-exception-handler) INFO: POST /output/3c5fef60bfdbf212/tick 200 5ms
2026-09-20 22:48:57 (with-exception-handler) INFO: POST /output/e6fb0c7f6ea4031e/tick 200 9ms
2026-09-20 22:48:58 (with-exception-handler) INFO: POST /output/1db89a64459ad7cf/tick 200 5ms
2026-09-20 22:48:58 (with-exception-handler) INFO: POST /output/d91f5ec89426e831/tick 200 6ms
2026-09-20 22:48:58 (with-exception-handler) INFO: POST /output/40906623d5812c35/tick 200 6ms
2026-09-20 22:48:58 (with-exception-handler) INFO: POST /output/371f7c7ffa583bb1/tick 200 17ms
2026-09-20 22:48:58 (with-exception-handler) INFO: POST /output/46470bd10d9b0b0f/tick 200 2ms
2026-09-20 22:48:59 (with-exception-handler) INFO: POST /output/8f2067b3946f811a/tick 200 3ms
2026-09-20 22:48:59 (with-exception-handler) INFO: POST /output/0123f6895349d441/tick 200 1ms
2026-09-20 22:48:59 (with-exception-handler) INFO: POST /output/9f45cdd3f88ea08d/tick 200 4ms
2026-09-20 22:48:59 (with-exception-handler) INFO: POST /output/c71f7be266a5564a/tick 200 4ms
2026-09-20 22:48:59 (with-exception-handler) INFO: POST /output/8d1ab70fb10242d6/tick 200 15ms
2026-09-20 22:49:00 (with-exception-handler) INFO: POST /output/3c812b6c333e2ccb/tick 200 9ms
2026-09-20 22:49:00 (with-exception-handler) INFO: POST /output/8c283aed3f88a6ff/after 200 3ms
2026-09-20 22:49:00 (with-exception-handler) INFO: POST /output/594920be2a529951/tick 200 7ms
2026-09-20 22:49:01 (with-exception-handler) INFO: POST /output/32f23bb1b20fb512/tick 200 30ms
2026-09-20 22:49:01 (with-exception-handler) INFO: POST /output/fd92f486ecd41761/tick 200 19ms
2026-09-20 22:49:02 (with-exception-handler) INFO: POST /output/2207f2c1328a148a/tick 200 49ms
2026-09-20 22:49:02 (with-exception-handler) INFO: POST /output/f792e70de4582edc/tick 200 41ms
2026-09-20 22:49:02 (with-exception-handler) INFO: POST /output/1e6a29e3fe8dfe06/tick 200 32ms
lost the pumphouse; reconnecting
2026-09-20 22:49:03 (with-exception-handler) INFO: POST /output/f751b646a1693a9b/tick 200 2ms
2026-09-20 22:49:03 (with-exception-handler) INFO: POST /output/cde14c939f16c99c/tick 200 11ms
2026-09-20 22:49:03 (with-exception-handler) INFO: POST /output/806ff0f84851745a/tick 200 10ms
2026-09-20 22:49:03 (with-exception-handler) INFO: POST /output/a2f90e4c2456fccc/tick 200 4ms
2026-09-20 22:49:03 (with-exception-handler) INFO: POST /output/1b10d2dca59e32f5/tick 200 58ms
2026-09-20 22:49:03 (with-exception-handler) INFO: POST /output/2ceb17fc5766be51/tick 200 18ms
2026-09-20 22:49:03 (with-exception-handler) INFO: POST /output/599e4c0077daf1a2/tick 200 16ms
2026-09-20 22:49:04 (with-exception-handler) INFO: POST /webhook 202 132ms
Error in IO handling wrapped resource #<input-output: file 494>:
#<&compound-exception components: (#<&external-error> #<&origin origin: "fport_read"> #<&message message: "~A"> #<&irritants irritants: ("Connection reset by peer")> #<&exception-with-kind-and-args kind: system-error args: ("fport_read" "~A" ("Connection reset by peer") (104))>)>
warning: mutating the process environment while multiple threads are running;
         further behavior unspecified.
In fibers.scm:
     85:4 17 (%run-fibers _ _ _ _)
In fibers/interrupts.scm:
     98:4 16 (with-interrupts/thread-cputime _ _ _ _)
In fibers/scheduler.scm:
   380:26 15 (run-scheduler #<scheduler 7f7c78370930 (remote-peers: (7f7c78370c40))> _)
In ice-9/boot-9.scm:
  1778:15 14 (with-exception-handler #<procedure 7f7c7836af00 at ice-9/boot-9.scm:1882:7 (exn)> _ #:unwind? _ #:unwind-for-type _)
  1784:12 13 (with-exception-handler _ _ #:unwind? _ #:unwind-for-type _)
In fibers/scheduler.scm:
   344:10 12 (next-task)
In fibers.scm:
    179:8 11 (_)
In goblins/actor-lib/io.scm:
    60:10 10 (_)
    85:15  9 (_ _)
In ice-9/boot-9.scm:
  1784:12  8 (with-exception-handler _ _ #:unwind? _ #:unwind-for-type _)
In goblins/actor-lib/io.scm:
    70:18  7 (run-and-send)
In ice-9/control.scm:
    91:24  6 (call-with-escape-continuation _)
In goblins/contrib/syrup.scm:
    306:7  5 (read-next)
In ice-9/suspendable-ports.scm:
    558:2  4 (peek-char _)
   184:27  3 (fill-input #<input-output: file 494> _ _)
     72:4  2 (read-bytes #<input-output: file 494> #vu8(60 49 48 39 111 112 58 100 101 108 105 118 101 114 60 49 49 39 100 101 115 99 58 101 120 112 111 114 116 50 43 62 91 56 39 102 105 110 105 115 104 101 100 55 39 101 114 114 111 114 101 100 93 51 43 60 49 56 39 100 101 115 99 58 105 109 112 111 114 116 45 111 98 106 101 99 116 52 43 62 62 103 32 116 121 112 101 32 116 111 32 97 112 112 108 121 58 32 35 102 91 50 34 35 102 93 50 53 56 34 35 60 38 99 111 109 112 111 117 110 100 45 101 # …) …)
In unknown file:
           1 (port-read #<input-output: file 494> #vu8(60 49 48 39 111 112 58 100 101 108 105 118 101 114 60 49 49 39 100 101 115 99 58 101 120 112 111 114 116 50 43 62 91 56 39 102 105 110 105 115 104 101 100 55 39 101 114 114 111 114 101 100 93 51 43 60 49 56 39 100 101 115 99 58 105 109 112 111 114 116 45 111 98 106 101 99 116 52 43 62 62 103 32 116 121 112 101 32 116 111 32 97 112 112 108 121 58 32 35 102 91 50 34 35 102 93 50 53 56 34 35 60 38 99 111 109 112 111 117 110 100 45 101 120 …) …)
In ice-9/boot-9.scm:
  1705:22  0 (raise-exception _ #:continuable? _)

Uncaught exception in task:
In fibers.scm:
    179:8 15 (_)
In goblins/actor-lib/io.scm:
    60:10 14 (_)
    85:15 13 (_ _)
In ice-9/boot-9.scm:
  1784:12 12 (with-exception-handler _ _ #:unwind? _ #:unwind-for-type _)
In goblins/actor-lib/io.scm:
    70:18 11 (run-and-send)
In ice-9/control.scm:
    91:24 10 (call-with-escape-continuation _)
In goblins/contrib/syrup.scm:
    306:7  9 (read-next)
In ice-9/suspendable-ports.scm:
    558:2  8 (peek-char _)
   184:27  7 (fill-input #<input-output: file 494> _ _)
     72:4  6 (read-bytes #<input-output: file 494> #vu8(60 49 48 39 111 112 58 100 101 108 105 118 101 114 60 49 49 39 100 101 115 99 58 101 120 112 111 114 116 50 43 62 91 56 39 102 105 110 105 115 104 101 100 55 39 101 114 114 111 114 101 100 93 51 43 60 49 56 39 100 101 115 99 58 105 109 112 111 114 116 45 111 98 106 101 99 116 52 43 62 62 103 32 116 121 112 101 32 116 111 32 97 112 112 108 121 58 32 35 102 91 50 34 35 102 93 50 53 56 34 35 60 38 99 111 109 112 111 117 110 100 45 101 # …) …)
In unknown file:
           5 (port-read #<input-output: file 494> #vu8(60 49 48 39 111 112 58 100 101 108 105 118 101 114 60 49 49 39 100 101 115 99 58 101 120 112 111 114 116 50 43 62 91 56 39 102 105 110 105 115 104 101 100 55 39 101 114 114 111 114 101 100 93 51 43 60 49 56 39 100 101 115 99 58 105 109 112 111 114 116 45 111 98 106 101 99 116 52 43 62 62 103 32 116 121 112 101 32 116 111 32 97 112 112 108 121 58 32 35 102 91 50 34 35 102 93 50 53 56 34 35 60 38 99 111 109 112 111 117 110 100 45 101 120 …) …)
In ice-9/boot-9.scm:
  1705:22  4 (raise-exception _ #:continuable? _)
In goblins/core.scm:
   1987:7  3 (<-np-extern _ . _)
In fibers/operations.scm:
   200:10  2 (perform-operation _)
In fibers/scheduler.scm:
    461:6  1 (suspend-current-task _)
In ice-9/boot-9.scm:
  1705:22  0 (raise-exception _ #:continuable? _)
ice-9/boot-9.scm:1705:22: In procedure raise-exception:
Attempt to suspend fiber within continuation barrier
Error in IO handling wrapped resource #<input-output: file 94>:
#<&compound-exception components: (#<&external-error> #<&origin origin: "fport_read"> #<&message message: "~A"> #<&irritants irritants: ("Connection reset by peer")> #<&exception-with-kind-and-args kind: system-error args: ("fport_read" "~A" ("Connection reset by peer") (104))>)>
In fibers.scm:
     85:4 17 Error in IO handling wrapped resource #<input-output: file 49>:
#<&compound-exception components: (#<&external-error> #<&origin origin: "fport_read"> #<&message message: "~A"> #<&irritants irritants: ("Connection reset by peer")> #<&exception-with-kind-and-args kind: system-error args: ("fport_read" "~A" ("Connection reset by peer") (104))>)>
In ice-9/boot-9.scm:
(%run-fibers _ _ _ _)
  1778:15
Inn  19 fibers/interrupts.scm:
     98:4 16 (with-interrupts/thread-cputime _ _ _ _)
In fibers/scheduler.scm:
(with-exception-handler #<procedure 7febb9f38a20 at ice-9/boot-9.scm:1882:7 (exn)> _ #:unwind? _ #:unwind-for-type _)
   380:26 15 (run-scheduler #<scheduler 7febb8b13e00 (remote-peers: (7febb8b13e70))> _)
In fibers.scm:
In ice-9/boot-9.scm:
   164:13 18 (run-fibers _ #:hz _ #:scheduler _ #:parallelism _ #:cpus _ #:install-suspendable-ports? _ #:drain? _)
     85:4 17 (%run-fibers _ _ _ _)
In fibers/interrupts.scm:
     98:4 16 (with-interrupts/thread-cputime _ _ _ _)
In fibers/scheduler.scm:
   380:26 15 (run-scheduler #<scheduler 7febb8b13e70 (remote-peers: (7febb8b13e00))> _)
In ice-9/boot-9.scm:
  1778:15 14   1778:15 14 (with-exception-handler #<program 7febb93116c0 7febbd163bf8> _ #:unwind? _ #:unwind-for-type _)
(with-exception-handler #<procedure 7febb9336ed0 at ice-9/boot-9.scm:1882:7 (exn)> _ #:unwind? _ #:unwind-for-type _)
  1784:12 13 (with-exception-handler _ _ #:unwind? _ #:unwind-for-type _)
  1784:12 13 
In fibers/scheduler.scm:
   344:10 12 (next-task)
In fibers.scm:
    179:8 11 (_)
In goblins/actor-lib/io.scm:
    60:10 10 (_)
    85:15  9 (_ _)
(with-exception-handler _ _ #:unwind? _ #:unwind-for-type _)

In ice-9/boot-9.scm:
  1784:12  8 (with-exception-handler _ _ #:unwind? _ #:unwind-for-type _)
In fibers/scheduler.scm:
In goblins/actor-lib/io.scm:
   344:10 12 (next-task)
    70:18  7 (run-and-send)
In ice-9/control.scm:
In fibers.scm:
    179:8 11 (_)
_)    
91:24  6 (call-with-escape-continuation _)
In goblins/actor-lib/io.scm:

In goblins/contrib/syrup.scm:
    60:10 10 (_)
    306:7  5 (read-next)
In ice-9/suspendable-ports.scm:
    558:2  4 (peek-char _)
   184:27 85:15785:15      99  (_ _)
(fill-input #<input-output: file 49> _ _)
     72:4  2 
In ice-9/boot-9.scm:
  1784:12  8 (with-exception-handler _ _ #:unwind? _ #:unwind-for-type _)
In goblins/actor-lib/io.scm:
(read-bytes #<input-output: file 49> #vu8(60 49 48 39 111 112 58 100 101 108 105 118 101 114 60 49 49 39 100 101 115 99 58 101 120 112 111 114 116 49 50 55 43 62 91 55 39 102 117 108 102 105 108 108 49 54 34 101 100 57 97 49 49 57 54 57 52 50 57 99 52 53 102 93 102 102 62 60 49 51 39 111 112 58 103 99 45 101 120 112 111 114 116 115 91 49 50 52 43 93 91 49 43 93 62 91 49 53 53 49 43 93 62 60 49 51 39 111 112 58 103 99 45 97 110 115 119 101 114 115 91 49 53 53 52 43 93 62 57 55 …) …)
In unknown file:
    70:18  7            1 (run-and-send)
In ice-9/control.scm:
    91:24  6 (call-with-escape-continuation _)
In goblins/contrib/syrup.scm:
(port-read #<input-output: file 49> #vu8(60 49 48 39 111 112 58 100 101 108 105 118 101 114 60 49 49 39 100 101 115 99 58 101 120 112 111 114 116 49 50 55 43 62 91 55 39 102 117 108 102 105 108 108 49 54 34 101 100 57 97 49 49 57 54 57 52 50 57 99 52 53 102 93 102 102 62 60 49 51 39 111 112 58 103 99 45 101 120 112 111 114 116 115 91 49 50 52 43 93 91 49 43 93 62 91 49 53 53 49 43 93 62 60 49 51 39 111 112 58 103 99 45 97 110 115 119 101 114 115 91 49 53 53 52 43 …) …)
In ice-9/boot-9.scm:
      1705306:7306:722  0   5 (read-next)
(raise-exception _ #:continuable? _)

Uncaught exception i
IInn  task:
ice-9/suspendable-ports.scm:
In fibers.scm:
    179:8 12 (_)
In goblins/actor-lib/io.scm:
    60:10 11 (_)
    85:15 10 (_ _)
    558:2  4 (peek-char _)
In ice-9/boot-9.scm:
  1784:12  9 (with-exception-handler _ _ #:unwind? _ #:unwind-for-type _)
   184:27  3 (fill-input #<input-output: file 94> _ _)
In goblins/actor-lib/io.scm:
    70:18  8 (run-and-send)
In ice-9/control.scm:
    91:24  7 (call-with-escape-continuation _)
In goblins/contrib/syrup.scm:
    306:7  6 (read-next)
In ice-9/suspendable-ports.scm:
    558:2  5 (peek-char _)
     72:4  2    184:27  4 (fill-input #<input-output: file 49> _ _)
     72:4  3 (read-bytes #<input-output: file 94> #vu8(60 49 51 39 111 112 58 103 99 45 97 110 115 119 101 114 115 91 54 51 43 93 62 60 49 51 39 111 112 58 103 99 45 97 110 115 119 101 114 115 91 54 53 43 93 62 60 49 51 39 111 112 58 103 99 45 97 110 115 119 101 114 115 91 54 54 43 93 62 60 49 51 39 111 112 58 103 99 45 97 110 115 119 101 114 115 91 54 55 43 93 62 60 49 51 39 111 112 58 103 99 45 97 110 115 119 101 114 115 91 51 49 43 93 62 60 49 51 39 111 112 58 103 99 45 97 110 115 119 # …) …)(read-bytes #<input-output: file 49> #vu8(60 49 48 39 111 112 58 100 101 108 105 118 101 114 60 49 49 39 100 101 115 99 58 101 120 112 111 114 116 49 50 55 43 62 91 55 39 102 117 108 102 105 108 108 49 54 34 101 100 57 97 49 49 57 54 57 52 50 57 99 52 53 102 93 102 102 62 60 49 51 39 111 112 58 103 99 45 101 120 112 111 114 116 115 91 49 50 52 43 93 91 49 43 93 62 91 49 53 53 49 43 93 62 60 49 51 39 111 112 58 103 99 45 97 110 115 119 101 114 115 91 49 53 53 52 43 93 62 57 55 …) …)
In unknown file:
           2 (port-read #<input-output: file 49> #vu8(60 49 48 39 111 112 58 100 101 108 105 118 101 114 60 49 49 39 100 101 115 99 58 101 120 112 111 114 116 49 50 55 43 62 91 55 39 102 117 108 102 105 108 108 49 54 34 101 100 57 97 49 49 57 54 57 52 50 57 99 52 53 102 93 102 102 62 60 49 51 39 111 112 58 103 99 45 101 120 112 111 114 116 115 91 49 50 52 43 93 91 49 43 93 62 91 49 53 53 49 43 93 62 60 49 51 39 111 112 58 103 99 45 97 110 115 119 101 114 115 91 49 53 53 52 43 93 62 57 55 # …) …)
In ice-9/boot-9.scm:
  1706:22  1 (raise-exception _ #:continuable? _)

In unknown file:
           1   1705:22  0 (raise-exception _ #:continuable? _)
ice-9/boot-9.scm:1705:22: In procedure raise-exception:
ERROR:
  1. &non-continuable
(port-read #<input-output: file 94> #vu8(60 49 51 39 111 112 58 103 99 45 97 110 115 119 101 114 115 91 54 51 43 93 62 60 49 51 39 111 112 58 103 99 45 97 110 115 119 101 114 115 91 54 53 43 93 62 60 49 51 39 111 112 58 103 99 45 97 110 115 119 101 114 115 91 54 54 43 93 62 60 49 51 39 111 112 58 103 99 45 97 110 115 119 101 114 115 91 54 55 43 93 62 60 49 51 39 111 112 58 103 99 45 97 110 115 119 101 114 115 91 51 49 43 93 62 60 49 51 39 111 112 58 103 99 45 97 110 115 119 # …) …)
In ice-9/boot-9.scm:
  1705:22  0 (raise-exception _ #:continuable? _)

Uncaught exception in task:
In fibers.scm:
    179:8 15 (_)
In goblins/actor-lib/io.scm:
    60:10 14 (_)
    85:15 13 (_ _)
In ice-9/boot-9.scm:
  1784:12 12 (with-exception-handler _ _ #:unwind? _ #:unwind-for-type _)
In goblins/actor-lib/io.scm:
    70:18 11 (run-and-send)
In ice-9/control.scm:
    91:24 10 (call-with-escape-continuation _)
In goblins/contrib/syrup.scm:
    306:7  9 (read-next)
In ice-9/suspendable-ports.scm:
    558:2  8 (peek-char _)
   184:27  7 (fill-input #<input-output: file 94> _ _)
     72:4  6 (read-bytes #<input-output: file 94> #vu8(60 49 51 39 111 112 58 103 99 45 97 110 115 119 101 114 115 91 54 51 43 93 62 60 49 51 39 111 112 58 103 99 45 97 110 115 119 101 114 115 91 54 53 43 93 62 60 49 51 39 111 112 58 103 99 45 97 110 115 119 101 114 115 91 54 54 43 93 62 60 49 51 39 111 112 58 103 99 45 97 110 115 119 101 114 115 91 54 55 43 93 62 60 49 51 39 111 112 58 103 99 45 97 110 115 119 101 114 115 91 51 49 43 93 62 60 49 51 39 111 112 58 103 99 45 97 110 115 119 # …) …)
In unknown file:
           5 (port-read #<input-output: file 94> #vu8(60 49 51 39 111 112 58 103 99 45 97 110 115 119 101 114 115 91 54 51 43 93 62 60 49 51 39 111 112 58 103 99 45 97 110 115 119 101 114 115 91 54 53 43 93 62 60 49 51 39 111 112 58 103 99 45 97 110 115 119 101 114 115 91 54 54 43 93 62 60 49 51 39 111 112 58 103 99 45 97 110 115 119 101 114 115 91 54 55 43 93 62 60 49 51 39 111 112 58 103 99 45 97 110 115 119 101 114 115 91 51 49 43 93 62 60 49 51 39 111 112 58 103 99 45 97 110 115 119 # …) …)
In ice-9/boot-9.scm:
  1705:22  4 (raise-exception _ #:continuable? _)
In goblins/core.scm:
   1987:7  3 (<-np-extern _ . _)
In fibers/operations.scm:
   200:10  2 (perform-operation _)
In fibers/scheduler.scm:
    461:6  1 (suspend-current-task _)
In ice-9/boot-9.scm:
  1705:22  0 (raise-exception _ #:continuable? _)
ice-9/boot-9.scm:1705:22: In procedure raise-exception:
Attempt to suspend fiber within continuation barrier
Error in IO handling wrapped resource #<input-output: file 49>:
#<&compound-exception components: (#<&external-error> #<&origin origin: "fport_write"> #<&message message: "~A"> #<&irritants irritants: ("Broken pipe")> #<&exception-with-kind-and-args kind: system-error args: ("fport_write" "~A" ("Broken pipe") (32))>)>
In ice-9/boot-9.scm:
  1778:15 15 (with-exception-handler #<procedure 7febb9f38a20 at ice-9/boot-9.scm:1882:7 (exn)> _ #:unwind? _ #:unwind-for-type _)
In fibers.scm:
   164:13 14 (run-fibers _ #:hz _ #:scheduler _ #:parallelism _ #:cpus _ #:install-suspendable-ports? _ #:drain? _)
     85:4 13 (%run-fibers _ _ _ _)
In fibers/interrupts.scm:
     98:4 12 (with-interrupts/thread-cputime _ _ _ _)
In fibers/scheduler.scm:
   380:26 11 (run-scheduler #<scheduler 7febb8b13e70 (remote-peers: (7febb8b13e00))> _)
In ice-9/boot-9.scm:
  1778:15 10 (with-exception-handler #<procedure 7febb4e3f240 at ice-9/boot-9.scm:1882:7 (exn)> _ #:unwind? _ #:unwind-for-type _)
  1784:12  9 (with-exception-handler _ _ #:unwind? _ #:unwind-for-type _)
In fibers/scheduler.scm:
   344:10  8 (next-task)
In fibers.scm:
    179:8  7 (_)
In goblins/actor-lib/io.scm:
    60:10  6 (_)
    85:15  5 (_ _)
In ice-9/boot-9.scm:
  1784:12  4 (with-exception-handler _ _ #:unwind? _ #:unwind-for-type _)
In goblins/actor-lib/io.scm:
    70:18  3 (run-and-send)
In ice-9/suspendable-ports.scm:
     83:4  2 (write-bytes #<input-output: file 49> #vu8(60 49 48 39 111 112 58 100 101 108 105 118 101 114 60 49 49 39 100 101 115 99 58 101 120 112 111 114 116 50 54 43 62 91 51 39 114 117 110 91 49 49 39 114 117 110 45 114 101 113 117 101 115 116 60 52 39 112 97 105 114 50 39 105 100 49 54 34 50 97 57 97 102 98 102 53 99 53 55 49 55 50 55 57 62 91 49 48 39 112 97 114 97 109 101 116 101 114 115 60 52 39 112 97 105 114 49 39 110 51 43 62 93 91 53 39 99 97 117 115 101 60 52 39 112 97 105 # …) …)
In unknown file:
           1 (port-write #<input-output: file 49> #vu8(60 49 48 39 111 112 58 100 101 108 105 118 101 114 60 49 49 39 100 101 115 99 58 101 120 112 111 114 116 50 54 43 62 91 51 39 114 117 110 91 49 49 39 114 117 110 45 114 101 113 117 101 115 116 60 52 39 112 97 105 114 50 39 105 100 49 54 34 50 97 57 97 102 98 102 53 99 53 55 49 55 50 55 57 62 91 49 48 39 112 97 114 97 109 101 116 101 114 115 60 52 39 112 97 105 114 49 39 110 51 43 62 93 91 53 39 99 97 117 115 101 60 52 39 112 97 105 114 …) …)
In ice-9/boot-9.scm:
  1705:22  0 (raise-exception _ #:continuable? _)

Uncaught exception in task:
In fibers.scm:
    179:8 11 (_)
In goblins/actor-lib/io.scm:
    60:10 10 (_)
    85:15  9 (_ _)
In ice-9/boot-9.scm:
  1784:12  8 (with-exception-handler _ _ #:unwind? _ #:unwind-for-type _)
In goblins/actor-lib/io.scm:
    70:18  7 (run-and-send)
In ice-9/suspendable-ports.scm:
     83:4  6 (write-bytes #<input-output: file 49> #vu8(60 49 48 39 111 112 58 100 101 108 105 118 101 114 60 49 49 39 100 101 115 99 58 101 120 112 111 114 116 50 54 43 62 91 51 39 114 117 110 91 49 49 39 114 117 110 45 114 101 113 117 101 115 116 60 52 39 112 97 105 114 50 39 105 100 49 54 34 50 97 57 97 102 98 102 53 99 53 55 49 55 50 55 57 62 91 49 48 39 112 97 114 97 109 101 116 101 114 115 60 52 39 112 97 105 114 49 39 110 51 43 62 93 91 53 39 99 97 117 115 101 60 52 39 112 97 105 # …) …)
In unknown file:
           5 (port-write #<input-output: file 49> #vu8(60 49 48 39 111 112 58 100 101 108 105 118 101 114 60 49 49 39 100 101 115 99 58 101 120 112 111 114 116 50 54 43 62 91 51 39 114 117 110 91 49 49 39 114 117 110 45 114 101 113 117 101 115 116 60 52 39 112 97 105 114 50 39 105 100 49 54 34 50 97 57 97 102 98 102 53 99 53 55 49 55 50 55 57 62 91 49 48 39 112 97 114 97 109 101 116 101 114 115 60 52 39 112 97 105 114 49 39 110 51 43 62 93 91 53 39 99 97 117 115 101 60 52 39 112 97 105 114 …) …)
In ice-9/boot-9.scm:
  1705:22  4 (raise-exception _ #:continuable? _)
In goblins/core.scm:
   1987:7  3 (<-np-extern _ . _)
In fibers/operations.scm:
   200:10  2 (perform-operation _)
In fibers/scheduler.scm:
    461:6  1 (suspend-current-task _)
In ice-9/boot-9.scm:
  1705:22  0 (raise-exception _ #:continuable? _)
ice-9/boot-9.scm:1705:22: In procedure raise-exception:
Attempt to suspend fiber within continuation barrier
Error in IO handling wrapped resource #<input-output: file 94>:
#<&compound-exception components: (#<&external-error> #<&origin origin: "fport_write"> #<&message message: "~A"> #<&irritants irritants: ("Broken pipe")> #<&exception-with-kind-and-args kind: system-error args: ("fport_write" "~A" ("Broken pipe") (32))>)>
In ice-9/boot-9.scm:
  1778:15 15 (with-exception-handler #<procedure 7febb9f38a20 at ice-9/boot-9.scm:1882:7 (exn)> _ #:unwind? _ #:unwind-for-type _)
In fibers.scm:
   164:13 14 (run-fibers _ #:hz _ #:scheduler _ #:parallelism _ #:cpus _ #:install-suspendable-ports? _ #:drain? _)
     85:4 13 (%run-fibers _ _ _ _)
In fibers/interrupts.scm:
     98:4 12 (with-interrupts/thread-cputime _ _ _ _)
In fibers/scheduler.scm:
   380:26 11 (run-scheduler #<scheduler 7febb8b13e70 (remote-peers: (7febb8b13e00))> _)
In ice-9/boot-9.scm:
  1778:15 10 (with-exception-handler #<procedure 7febb4e28f30 at ice-9/boot-9.scm:1882:7 (exn)> _ #:unwind? _ #:unwind-for-type _)
  1784:12  9 (with-exception-handler _ _ #:unwind? _ #:unwind-for-type _)
In fibers/scheduler.scm:
   344:10  8 (next-task)
In fibers.scm:
    179:8  7 (_)
In goblins/actor-lib/io.scm:
    60:10  6 (_)
    85:15  5 (_ _)
In ice-9/boot-9.scm:
  1784:12  4 (with-exception-handler _ _ #:unwind? _ #:unwind-for-type _)
In goblins/actor-lib/io.scm:
    70:18  3 (run-and-send)
In ice-9/suspendable-ports.scm:
     83:4  2 (write-bytes #<input-output: file 94> #vu8(60 49 51 39 111 112 58 103 99 45 101 120 112 111 114 116 115 91 56 56 43 93 91 49 43 93 62 114 116 56 56 43 62 91 55 39 102 117 108 102 105 108 108 60 49 56 39 100 101 115 99 58 105 109 112 111 114 116 45 111 98 106 101 99 116 55 43 62 93 102 102 62 48 46 49 58 52 54 48 55 53 47 111 117 116 112 117 116 62 60 52 39 112 97 105 114 53 39 116 111 107 101 110 51 50 34 51 101 48 57 53 57 101 53 55 48 52 51 99 53 48 55 57 55 99 56 101 102 51 …) …)
In unknown file:
           1 (port-write #<input-output: file 94> #vu8(60 49 51 39 111 112 58 103 99 45 101 120 112 111 114 116 115 91 56 56 43 93 91 49 43 93 62 114 116 56 56 43 62 91 55 39 102 117 108 102 105 108 108 60 49 56 39 100 101 115 99 58 105 109 112 111 114 116 45 111 98 106 101 99 116 55 43 62 93 102 102 62 48 46 49 58 52 54 48 55 53 47 111 117 116 112 117 116 62 60 52 39 112 97 105 114 53 39 116 111 107 101 110 51 50 34 51 101 48 57 53 57 101 53 55 48 52 51 99 53 48 55 57 55 99 56 101 102 51 …) …)
In ice-9/boot-9.scm:
  1705:22  0 (raise-exception _ #:continuable? _)

Uncaught exception in task:
In fibers.scm:
    179:8 11 (_)
In goblins/actor-lib/io.scm:
    60:10 10 (_)
    85:15  9 (_ _)
In ice-9/boot-9.scm:
  1784:12  8 (with-exception-handler _ _ #:unwind? _ #:unwind-for-type _)
In goblins/actor-lib/io.scm:
    70:18  7 (run-and-send)
In ice-9/suspendable-ports.scm:
     83:4  6 (write-bytes #<input-output: file 94> #vu8(60 49 51 39 111 112 58 103 99 45 101 120 112 111 114 116 115 91 56 56 43 93 91 49 43 93 62 114 116 56 56 43 62 91 55 39 102 117 108 102 105 108 108 60 49 56 39 100 101 115 99 58 105 109 112 111 114 116 45 111 98 106 101 99 116 55 43 62 93 102 102 62 48 46 49 58 52 54 48 55 53 47 111 117 116 112 117 116 62 60 52 39 112 97 105 114 53 39 116 111 107 101 110 51 50 34 51 101 48 57 53 57 101 53 55 48 52 51 99 53 48 55 57 55 99 56 101 102 51 …) …)
In unknown file:
           5 (port-write #<input-output: file 94> #vu8(60 49 51 39 111 112 58 103 99 45 101 120 112 111 114 116 115 91 56 56 43 93 91 49 43 93 62 114 116 56 56 43 62 91 55 39 102 117 108 102 105 108 108 60 49 56 39 100 101 115 99 58 105 109 112 111 114 116 45 111 98 106 101 99 116 55 43 62 93 102 102 62 48 46 49 58 52 54 48 55 53 47 111 117 116 112 117 116 62 60 52 39 112 97 105 114 53 39 116 111 107 101 110 51 50 34 51 101 48 57 53 57 101 53 55 48 52 51 99 53 48 55 57 55 99 56 101 102 51 …) …)
In ice-9/boot-9.scm:
  1705:22  4 (raise-exception _ #:continuable? _)
In goblins/core.scm:
   1987:7  3 (<-np-extern _ . _)
In fibers/operations.scm:
   200:10  2 (perform-operation _)
In fibers/scheduler.scm:
    461:6  1 (suspend-current-task _)
In ice-9/boot-9.scm:
  1705:22  0 (raise-exception _ #:continuable? _)
ice-9/boot-9.scm:1705:22: In procedure raise-exception:
Attempt to suspend fiber within continuation barrier
GET /events/output/dd54a0b0edf32a94/chatty: error replying to client
2026-09-20 22:49:27 (with-exception-handler) INFO: GET /events/output/dd54a0b0edf32a94/chatty 200 incomplete

Goblins exception:
In message to #<local-object ^admin>:
  (run tests/hook (run-request (id . "e9ac23492a3b18d6") (parameters (repository . "/tmp/safsaf.git") (ref . "refs/heads/trunk") (commit . "c0ffee")) (cause (kind . webhook) (event . "push")) (ancestors)))
ice-9/boot-9.scm:1705:22: In procedure raise-exception:
ERROR:
  1. &automate-error:
      kind: not-attached
      irritants: (tests/hook stale)
  2. &message: "no pipeline process is attached under this name"
  3. &irritants: (tests/hook stale)
In goblins/core.scm:
   1074:7  4 (syscaller-$ _ #<local-object ^admin> (run tests/hook (run-request (id . "e9ac23492a3b18d6") (parameters (repository . "/tmp/safsaf.git") (ref . "refs/heads/trunk") (commit . "c0ffee")) (cause (kind . webhook) (event . "push")) (ancestors))))
In automate/pumphouse.scm:
   136:15  3 (request-run! #<<pumphouse> records: #<local-object ^records> lives: #<hash-table 7febbd29cca0 11/31> shared: #<hash-table 7febbd29cc80 1/31> gates: #<hash-table 7febbd29cc60 0/31> timers: #<hash-table 7febbd29cc40 1/31> tokens: #<hash-table 7febbd29cc20 94/113> registrations: #<hash-table 7febbd29cc00 1/31> sink: "http://127.0.0.1:46075/output" web: "http://127.0.0.1:46075" publish: #<procedure 7febbd3cbe80 at automate/pumphouse/process.scm:129:2 (object swiss-num)>> tests/hook #)
     99:6  2 (live-of _ _)
In automate/model.scm:
     83:2  1 (raise-automate-error _ _ . _)
In ice-9/boot-9.scm:
  1705:22  0 (raise-exception _ #:continuable? _)

2026-09-20 22:50:14 (with-exception-handler) INFO: POST /webhook 500 15ms

Goblins exception:
In message to #<local-object ^admin>:
  (run tests/hook (run-request (id . "e9ac23492a3b18d6") (parameters (repository . "/tmp/safsaf.git") (ref . "refs/heads/trunk") (commit . "c0ffee")) (cause (kind . webhook) (event . "push")) (ancestors)))
ice-9/boot-9.scm:1705:22: In procedure raise-exception:
ERROR:
  1. &automate-error:
      kind: not-attached
      irritants: (tests/hook stale)
  2. &message: "no pipeline process is attached under this name"
  3. &irritants: (tests/hook stale)
In goblins/core.scm:
   1074:7  4 (syscaller-$ _ #<local-object ^admin> (run tests/hook (run-request (id . "e9ac23492a3b18d6") (parameters (repository . "/tmp/safsaf.git") (ref . "refs/heads/trunk") (commit . "c0ffee")) (cause (kind . webhook) (event . "push")) (ancestors))))
In automate/pumphouse.scm:
   136:15  3 (request-run! #<<pumphouse> records: #<local-object ^records> lives: #<hash-table 7febbd29cca0 11/31> shared: #<hash-table 7febbd29cc80 1/31> gates: #<hash-table 7febbd29cc60 0/31> timers: #<hash-table 7febbd29cc40 1/31> tokens: #<hash-table 7febbd29cc20 94/113> registrations: #<hash-table 7febbd29cc00 1/31> sink: "http://127.0.0.1:46075/output" web: "http://127.0.0.1:46075" publish: #<procedure 7febbd3cbe80 at automate/pumphouse/process.scm:129:2 (object swiss-num)>> tests/hook #)
     99:6  2 (live-of _ _)
In automate/model.scm:
     83:2  1 (raise-automate-error _ _ . _)
In ice-9/boot-9.scm:
  1705:22  0 (raise-exception _ #:continuable? _)

2026-09-20 22:50:14 (with-exception-handler) INFO: POST /hooks/other 500 27ms
2026-09-20 22:50:14 (with-exception-handler) INFO: POST /hooks/other 403 1ms
2026-09-20 22:50:14 (with-exception-handler) INFO: POST /webhook 403 1ms

Goblins exception:
In message to #<local-object ^admin>:
  (run tests/linger (run-request (id . "301413004110d9a7") (parameters (marker . "/tmp/automate-pumphouse-AeNLGO/linger-2")) (cause . #f) (ancestors)))
ice-9/boot-9.scm:1705:22: In procedure raise-exception:
ERROR:
  1. &automate-error:
      kind: not-attached
      irritants: (tests/linger stale)
  2. &message: "no pipeline process is attached under this name"
  3. &irritants: (tests/linger stale)
In goblins/core.scm:
   1074:7  4 (syscaller-$ _ #<local-object ^admin> (run tests/linger (run-request (id . "301413004110d9a7") (parameters (marker . "/tmp/automate-pumphouse-AeNLGO/linger-2")) (cause . #f) (ancestors))))
In automate/pumphouse.scm:
   136:15  3 (request-run! #<<pumphouse> records: #<local-object ^records> lives: #<hash-table 7febbd29cca0 11/31> shared: #<hash-table 7febbd29cc80 1/31> gates: #<hash-table 7febbd29cc60 0/31> timers: #<hash-table 7febbd29cc40 1/31> tokens: #<hash-table 7febbd29cc20 94/113> registrations: #<hash-table 7febbd29cc00 1/31> sink: "http://127.0.0.1:46075/output" web: "http://127.0.0.1:46075" publish: #<procedure 7febbd3cbe80 at automate/pumphouse/process.scm:129:2 (object swiss-num)>> # (# # # …))
     99:6  2 (live-of _ _)
In automate/model.scm:
     83:2  1 (raise-automate-error _ _ . _)
In ice-9/boot-9.scm:
  1705:22  0 (raise-exception _ #:continuable? _)

== pumphouse.scm
  fail: the delivery's run succeeded
    expected: succeeded
    actual:   #f
  fail: the delivery's cause is recorded
    expected: ((kind . webhook) (event . "push"))
    actual:   #f
  fail: its parameters carry the push
    expected: "c0ffee"
    actual:   #f
  fail: a repeated delivery maps to the same run
    error:    #<&compound-exception components: (#<&assertion-failure> #<&origin origin: "vector-ref"> #<&message message: "Wrong type argument in position 1 (expecting vector): ~S"> #<&irritants irritants: (#f)> #<&exception-with-kind-and-args kind: wrong-type-arg args: ("vector-ref" "Wrong type argument in position 1 (expecting vector): ~S" (#f) (#f))>)>
  fail: a forge with a path of its own is served there
    expected: 202
    actual:   500
  fail: and its rules start the runs
    expected: ("tests/hook")
    actual:   ()
  suite died: ERROR:
  1. &mystery-exception
  2. &message: "Unknown error occurred with remote object"
  3. &irritants: ()

stop 879: kill #<unspecified>, waitpid (879 . 9)
stop 717: kill #<unspecified>, waitpid (717 . 13)
stop 708: kill #<unspecified>, waitpid (708 . 9)
;;; note: auto-compilation is enabled, set GUILE_AUTO_COMPILE=0
;;;       or pass the --no-auto-compile argument to disable.
;;; compiling /home/chris/automate.cbaines.net/guile-automate/checks/workspace/fd653eb4351ee6b9/work/source/./tests/run.scm
;;; WARNING: compilation of /home/chris/automate.cbaines.net/guile-automate/checks/workspace/fd653eb4351ee6b9/work/source/./tests/run.scm failed:
;;; failed to create path for auto-compiled file "/home/chris/automate.cbaines.net/guile-automate/checks/workspace/fd653eb4351ee6b9/work/source/./tests/run.scm"
;;; compiling /home/chris/automate.cbaines.net/guile-automate/checks/workspace/fd653eb4351ee6b9/work/source/tests/support.scm
;;; WARNING: compilation of /home/chris/automate.cbaines.net/guile-automate/checks/workspace/fd653eb4351ee6b9/work/source/tests/support.scm failed:
;;; failed to create path for auto-compiled file "/home/chris/automate.cbaines.net/guile-automate/checks/workspace/fd653eb4351ee6b9/work/source/tests/support.scm"
;;; compiling /home/chris/automate.cbaines.net/guile-automate/checks/workspace/fd653eb4351ee6b9/work/source/tests/pumphouse.scm
;;; WARNING: compilation of /home/chris/automate.cbaines.net/guile-automate/checks/workspace/fd653eb4351ee6b9/work/source/tests/pumphouse.scm failed:
;;; failed to create path for auto-compiled file "/home/chris/automate.cbaines.net/guile-automate/checks/workspace/fd653eb4351ee6b9/work/source/tests/pumphouse.scm"
FAIL tests/pumphouse.scm (exit status: 1)

============================================================================
Testsuite summary for guile-automate 0.0.0-dev
============================================================================
# TOTAL: 18
# PASS:  17
# SKIP:  0
# XFAIL: 0
# FAIL:  1
# XPASS: 0
# ERROR: 0
============================================================================
See ./test-suite.log for debugging.
============================================================================
make[3]: *** [Makefile:893: test-suite.log] Error 1
make[3]: Leaving directory '/home/chris/automate.cbaines.net/guile-automate/checks/workspace/fd653eb4351ee6b9/work/source'
make[2]: *** [Makefile:1028: check-TESTS] Error 2
make[2]: Leaving directory '/home/chris/automate.cbaines.net/guile-automate/checks/workspace/fd653eb4351ee6b9/work/source'
make[1]: *** [Makefile:1249: check-am] Error 2
make[1]: Leaving directory '/home/chris/automate.cbaines.net/guile-automate/checks/workspace/fd653eb4351ee6b9/work/source'
make: *** [Makefile:779: check-recursive] Error 1
error: #<&invoke-error program: "/gnu/store/1m1yzwgyjlai1bal0w2dfxfma8ajkask-profile/bin/bash" arguments: ("-c" "set -eo pipefail\nexport GUIX_PROFILE=/gnu/store/1m1yzwgyjlai1bal0w2dfxfma8ajkask-profile\nsource \"$GUIX_PROFILE/etc/profile\"\ncd /home/chris/automate.cbaines.net/guile-automate/checks/workspace/fd653eb4351ee6b9/work/source\nmake check VERBOSE=1") exit-status: 2 term-signal: #f stop-signal: #f>